has statistical item
term status: testing
type: Thing
sub property of: topObjectProperty
property disjoint with: bottomObjectProperty
type: ObjectProperty
type: Property
comment: A link from an interest to statistics about itself
domain: Weighted Interest
range: Item

Explicit Mining
term status: testing
description: An explicitly mined user interest
type: Dimension
type: Thing

Weighted Interests Vocabulary
creator: Danica Damljanovic
date: 2010-09-14T14:20:52Z
description: A vocabulary for describing preferences (interests) within contexts, their temporal dynamics and their origin
creator: Yi Zeng
preferred namespace prefix: wi
creator: Yan Wang
type: Thing
creator: Zhisheng Huang
imports: event.owl
creator: me
imports: http://purl.org/dc/elements/1.1/
creator: danbri
version info: 0.5
imports: terms
imports: core
imports: http://xmlns.com/foaf/0.1/
type: Ontology
imports: vann
creator: http://tobyinkster.co.uk/#i
imports: scovo
imports: ns
imports: time

has appear time
term status: testing
type: Thing
sub property of: topObjectProperty
sub property of: time
property disjoint with: bottomObjectProperty
type: ObjectProperty
type: Property
comment: The time when the interest appears in a certain kind of scenario.
domain: http://lodlaundromat.org/.well-known/genid/fceea1a4a3b26fe7b164c84356c01094#1

has evidence
term status: unstable
type: Thing
sub property of: topObjectProperty
sub property of: factor
property disjoint with: bottomObjectProperty
type: ObjectProperty
type: Property
comment: A link between a context and evidence supporting the interpretation of preferences in a context
domain: http://lodlaundromat.org/.well-known/genid/fceea1a4a3b26fe7b164c84356c01094#4

is not interested in
term status: unstable
type: Thing
sub property of: topObjectProperty
property disjoint with: bottomObjectProperty
type: ObjectProperty
type: Property
comment: A link between an agent and a topic of no interest to them
domain: Agent

has interest dynamics
term status: testing
type: Thing
sub property of: topObjectProperty
sub property of: sub event
property disjoint with: bottomObjectProperty
type: ObjectProperty
type: Property
comment: To relate a weighted interest to its temporal dynamics.
domain: Weighted Interest
range: Interest Dynamics

has overall weight
property disjoint with: bottomObjectProperty
type: ObjectProperty
type: FunctionalProperty
type: Thing
sub property of: weight
term status: testing
sub property of: topObjectProperty
type: Property
comment: This weight reflects the overall interest in a topic and should be different from the actual weight of interest.
domain: Weighted Interest

has ultimative duration
type: ObjectProperty
type: Thing
term status: testing
property disjoint with: bottomObjectProperty
sub property of: time
sub property of: has attention duration
sub property of: topObjectProperty
type: Property
comment: The overall duration of attention for an interest, e.g. for an interest, if it appears in the following years: 1990, 1991, 1995, 1996, 1997, 1998, 2001, then the longest duration is 7 years.

Implicit Mining
term status: testing
description: An implicitly mined user interest
type: Dimension
type: Thing

Interest Dynamics
subclass of: Thing
term status: testing
type: Thing
subclass of: http://lodlaundromat.org/.well-known/genid/fceea1a4a3b26fe7b164c84356c01094#1
subclass of: http://lodlaundromat.org/.well-known/genid/fceea1a4a3b26fe7b164c84356c01094#4
disjoint with: Nothing
type: Class
subclass of: Weight
comment: An event concept for describing dynamics of interests, e.g. weight changes, periods of interest.

has agent
term status: testing
type: Thing
sub property of: topObjectProperty
property disjoint with: bottomObjectProperty
inverse of: has preference
type: ObjectProperty
type: Property
comment: A link from a mined interest to the related person
domain: Weighted Interest
range: Agent

has preference
term status: unstable
type: Thing
sub property of: topObjectProperty
property disjoint with: bottomObjectProperty
inverse of: has agent
type: ObjectProperty
type: Property
comment: A link between an agent and a weighted interest
domain: Agent
range: Weighted Interest

Weighted Interest
subclass of: Item
subclass of: http://lodlaundromat.org/.well-known/genid/fceea1a4a3b26fe7b164c84356c01094#1
type: Class
subclass of: Thing
disjoint with: Nothing
subclass of: http://lodlaundromat.org/.well-known/genid/fceea1a4a3b26fe7b164c84356c01094#4
type: Thing
term status: unstable
comment: A weighted interest object, which also can have interest dynamics etc.

has longest duration
sub property of: topObjectProperty
type: ObjectProperty
sub property of: has attention duration
type: Thing
term status: testing
property disjoint with: bottomObjectProperty
sub property of: time
type: Property
comment: The longest continuous interval of attention for an interest, e.g. for an interest, if it appears in the following years: 1990, 1991, 1995, 1996, 1997, 1998, 2001, then the longest duration is 4 years.

has topic
term status: unstable
type: Thing
sub property of: topObjectProperty
sub property of: subject
property disjoint with: bottomObjectProperty
type: ObjectProperty
type: Property
comment: A topic of the weighted interest
domain: Weighted Interest

has attention duration
term status: testing
type: Thing
sub property of: topObjectProperty
sub property of: time
property disjoint with: bottomObjectProperty
type: ObjectProperty
type: Property
comment: An interval of attention for an interest.
domain: Weighted Interest
range: Interval