has statistical item
range: Thing
domain: Thing
type: Property
type: ObjectProperty
comment: A link from an interest to statistics about itself
domain: Weighted Interest
range: Item
term status: testing
range: Resource
domain: http://lodlaundromat.org/.well-known/genid/fceea1a4a3b26fe7b164c84356c01094#1
domain: Resource
domain: Item
domain: http://lodlaundromat.org/.well-known/genid/fceea1a4a3b26fe7b164c84356c01094#4

has appear time
range: Thing
domain: Thing
type: Property
type: ObjectProperty
comment: The time when the interest appears in a certain kind of scenario.
domain: http://lodlaundromat.org/.well-known/genid/fceea1a4a3b26fe7b164c84356c01094#1
sub property of: time
term status: testing
range: Resource
domain: Resource

has evidence
range: Thing
domain: Thing
type: Property
type: ObjectProperty
comment: A link between a context and evidence supporting the interpretation of preferences in a context
domain: http://lodlaundromat.org/.well-known/genid/fceea1a4a3b26fe7b164c84356c01094#4
sub property of: factor
term status: unstable
range: Resource
domain: Resource

is not interested in
range: Thing
domain: Thing
type: Property
type: ObjectProperty
comment: A link between an agent and a topic of no interest to them
domain: Agent
term status: unstable
range: Resource
domain: Resource

has interest dynamics
range: Thing
domain: Thing
type: Property
type: ObjectProperty
comment: To relate a weighted interest to its temporal dynamics.
domain: Weighted Interest
range: Interest Dynamics
sub property of: sub event
term status: testing
range: Resource
range: http://lodlaundromat.org/.well-known/genid/fceea1a4a3b26fe7b164c84356c01094#1
range: http://lodlaundromat.org/.well-known/genid/fceea1a4a3b26fe7b164c84356c01094#4
range: Weight
domain: http://lodlaundromat.org/.well-known/genid/fceea1a4a3b26fe7b164c84356c01094#1
domain: Resource
domain: Item
domain: http://lodlaundromat.org/.well-known/genid/fceea1a4a3b26fe7b164c84356c01094#4

has overall weight
range: Thing
domain: Thing
type: Property
type: FunctionalProperty
type: ObjectProperty
comment: This weight reflects the overall interest in a topic and should be different from the actual weight of interest.
domain: Weighted Interest
sub property of: weight
term status: testing
range: Resource
domain: http://lodlaundromat.org/.well-known/genid/fceea1a4a3b26fe7b164c84356c01094#1
domain: Resource
domain: Item
domain: http://lodlaundromat.org/.well-known/genid/fceea1a4a3b26fe7b164c84356c01094#4

has ultimative duration
sub property of: time
range: Thing
domain: Thing
type: Property
type: ObjectProperty
comment: The overall duration of attention for an interest, e.g. for an interest, if it appears in the following years: 1990, 1991, 1995, 1996, 1997, 1998, 2001, then the longest duration is 7 years.
sub property of: has attention duration
term status: testing
domain: Weighted Interest
domain: Resource
domain: http://lodlaundromat.org/.well-known/genid/fceea1a4a3b26fe7b164c84356c01094#1
domain: http://lodlaundromat.org/.well-known/genid/fceea1a4a3b26fe7b164c84356c01094#4
domain: Item
range: Interval
range: Resource

Interest Dynamics
subclass of: Resource
subclass of: Thing
subclass of: http://lodlaundromat.org/.well-known/genid/fceea1a4a3b26fe7b164c84356c01094#1
subclass of: http://lodlaundromat.org/.well-known/genid/fceea1a4a3b26fe7b164c84356c01094#4
type: Class
comment: An event concept for describing dynamics of interests, e.g. weight changes, periods of interest.
subclass of: Weight
term status: testing

has agent
range: Thing
domain: Thing
type: Property
type: ObjectProperty
comment: A link from a mined interest to the related person
domain: Weighted Interest
range: Agent
inverse of: has preference
term status: testing
range: Resource
domain: http://lodlaundromat.org/.well-known/genid/fceea1a4a3b26fe7b164c84356c01094#1
domain: Resource
domain: Item
domain: http://lodlaundromat.org/.well-known/genid/fceea1a4a3b26fe7b164c84356c01094#4

has preference
range: Thing
domain: Thing
inverse of: has agent
type: Property
type: ObjectProperty
comment: A link between an agent and a weighted interest
domain: Agent
range: Weighted Interest
term status: unstable
range: http://lodlaundromat.org/.well-known/genid/fceea1a4a3b26fe7b164c84356c01094#4
range: Resource
range: http://lodlaundromat.org/.well-known/genid/fceea1a4a3b26fe7b164c84356c01094#1
range: Item
domain: Resource

Weighted Interest
subclass of: http://lodlaundromat.org/.well-known/genid/fceea1a4a3b26fe7b164c84356c01094#1
subclass of: Resource
subclass of: Thing
subclass of: http://lodlaundromat.org/.well-known/genid/fceea1a4a3b26fe7b164c84356c01094#4
type: Class
comment: A weighted interest object, which also can have interest dynamics etc.
subclass of: Item
term status: unstable

has longest duration
range: Thing
domain: Thing
sub property of: time
type: Property
type: ObjectProperty
comment: The longest continuous interval of attention for an interest, e.g. for an interest, if it appears in the following years: 1990, 1991, 1995, 1996, 1997, 1998, 2001, then the longest duration is 4 years.
sub property of: has attention duration
term status: testing
domain: Weighted Interest
domain: Resource
domain: http://lodlaundromat.org/.well-known/genid/fceea1a4a3b26fe7b164c84356c01094#1
domain: http://lodlaundromat.org/.well-known/genid/fceea1a4a3b26fe7b164c84356c01094#4
domain: Item
range: Interval
range: Resource

has topic
range: Thing
domain: Thing
type: Property
type: ObjectProperty
comment: A topic of the weighted interest
domain: Weighted Interest
sub property of: subject
term status: unstable
range: Resource
domain: http://lodlaundromat.org/.well-known/genid/fceea1a4a3b26fe7b164c84356c01094#1
domain: Resource
domain: Item
domain: http://lodlaundromat.org/.well-known/genid/fceea1a4a3b26fe7b164c84356c01094#4

has attention duration
range: Thing
domain: Thing
type: Property
type: ObjectProperty
comment: An interval of attention for an interest.
domain: Weighted Interest
range: Interval
sub property of: time
term status: testing
range: Resource
domain: http://lodlaundromat.org/.well-known/genid/fceea1a4a3b26fe7b164c84356c01094#1
domain: Resource
domain: Item
domain: http://lodlaundromat.org/.well-known/genid/fceea1a4a3b26fe7b164c84356c01094#4

Explicit Mining
description: An explicitly mined user interest
type: Dimension
term status: testing

Weighted Interests Vocabulary
creator: Danica Damljanovic
imports: event.owl
date: 2010-09-14T14:20:52Z
creator: me
description: A vocabulary for describing preferences (interests) within contexts, their temporal dynamics and their origin
imports: http://purl.org/dc/elements/1.1/
creator: Yi Zeng
creator: danbri
version info: 0.5
imports: terms
imports: core
preferred namespace prefix: wi
imports: http://xmlns.com/foaf/0.1/
type: Ontology
imports: vann
creator: http://tobyinkster.co.uk/#i
creator: Yan Wang
imports: scovo
imports: ns
imports: time
creator: Zhisheng Huang

Implicit Mining
description: An implicitly mined user interest
type: Dimension
term status: testing