http://lodlaundromat.org/.well-known/genid/fca39a28037bc24769c95c90517f0418#19
subclass of: Resource
subclass of: Thing
type: Class
type: Restriction
max cardinality: 1
on property: derived from

http://lodlaundromat.org/.well-known/genid/fca39a28037bc24769c95c90517f0418#6
subclass of: Resource
subclass of: Thing
type: Class
type: Restriction
max cardinality: 1
on property: default value

http://lodlaundromat.org/.well-known/genid/fca39a28037bc24769c95c90517f0418#14
subclass of: Resource
subclass of: Thing
type: Class
type: Restriction
max cardinality: 1
on property: code

DTYPE Enumeration
subclass of: Resource
type: Class
comment: A type that serves as a container for the enumerated values of an enumeration. This enables the enumeration itself to be referenceable. One need for this is in determing the default value of an enumeration , another need is in the management of sub-enumerations and composite enumerations.
subclass of: http://lodlaundromat.org/.well-known/genid/fca39a28037bc24769c95c90517f0418#6
subclass of: http://lodlaundromat.org/.well-known/genid/fca39a28037bc24769c95c90517f0418#7
subclass of: http://lodlaundromat.org/.well-known/genid/fca39a28037bc24769c95c90517f0418#8
subclass of: Thing

http://lodlaundromat.org/.well-known/genid/fca39a28037bc24769c95c90517f0418#9
subclass of: Resource
type: Class
subclass of: Thing
type: Restriction
cardinality: 1
on property: value

composite of
range: Thing
domain: Thing
comment: Aproperty for constructing composite data structures
type: ObjectProperty
type: Property
domain: Resource
range: Resource

http://lodlaundromat.org/.well-known/genid/fca39a28037bc24769c95c90517f0418#12
subclass of: Resource
subclass of: Thing
type: Class
type: Restriction
max cardinality: 1
on property: name

derived from
range: Thing
domain: Thing
comment: A property for specifying a derivation relationship.
type: ObjectProperty
type: Property
domain: Resource
range: Resource

Codelist
subclass of: Resource
subclass of: Thing
type: Class
comment: A codelist is a controlled vocabulary of terms that are used to represent permissible values of a variable in information systems. The representaiton of codes in "dtype" has been influenced by CCTS and UBL.
subclass of: DTYPE Enumeration
subclass of: http://lodlaundromat.org/.well-known/genid/fca39a28037bc24769c95c90517f0418#7
subclass of: http://lodlaundromat.org/.well-known/genid/fca39a28037bc24769c95c90517f0418#6
subclass of: http://lodlaundromat.org/.well-known/genid/fca39a28037bc24769c95c90517f0418#8

http://lodlaundromat.org/.well-known/genid/fca39a28037bc24769c95c90517f0418#20
subclass of: Resource
subclass of: Thing
type: Class
type: Restriction
max cardinality: 1
on property: position
subclass of: http://lodlaundromat.org/.well-known/genid/fca39a28037bc24769c95c90517f0418#15
equivalent class: http://lodlaundromat.org/.well-known/genid/fca39a28037bc24769c95c90517f0418#15

http://lodlaundromat.org/.well-known/genid/fca39a28037bc24769c95c90517f0418#15
subclass of: Resource
subclass of: Thing
type: Class
type: Restriction
max cardinality: 1
on property: position
subclass of: http://lodlaundromat.org/.well-known/genid/fca39a28037bc24769c95c90517f0418#20
equivalent class: http://lodlaundromat.org/.well-known/genid/fca39a28037bc24769c95c90517f0418#20

http://lodlaundromat.org/.well-known/genid/fca39a28037bc24769c95c90517f0418#10
subclass of: Resource
subclass of: Thing
type: Class
type: Restriction
min cardinality: 0
on property: url

Derived Code List
subclass of: Resource
type: Class
subclass of: Thing
disjoint with: Simple Code List
subclass of: Codelist
subclass of: http://lodlaundromat.org/.well-known/genid/fca39a28037bc24769c95c90517f0418#17
disjoint with: Composite Code List
comment: A derived codelist is a sublist of another codelist. The members that it has must be members of the source list.
subclass of: http://lodlaundromat.org/.well-known/genid/fca39a28037bc24769c95c90517f0418#18
subclass of: http://lodlaundromat.org/.well-known/genid/fca39a28037bc24769c95c90517f0418#19
subclass of: http://lodlaundromat.org/.well-known/genid/fca39a28037bc24769c95c90517f0418#8
subclass of: http://lodlaundromat.org/.well-known/genid/fca39a28037bc24769c95c90517f0418#6
subclass of: http://lodlaundromat.org/.well-known/genid/fca39a28037bc24769c95c90517f0418#7
subclass of: DTYPE Enumeration

numeric union
subclass of: http://lodlaundromat.org/.well-known/genid/fca39a28037bc24769c95c90517f0418#1
description: A datatype that is the union of numeric xsd data types. "numericUnion" is equivalent to the xsd specification that uses an xsd:union of memberTypes="xsd:decimal xsd:double xsd:float xsd:integer".
type: Datatype
subclass of: Resource
equivalent class: http://lodlaundromat.org/.well-known/genid/fca39a28037bc24769c95c90517f0418#1
type: Class

http://lodlaundromat.org/.well-known/genid/fca39a28037bc24769c95c90517f0418#13
subclass of: Resource
subclass of: Thing
type: Class
type: Restriction
max cardinality: 1
on property: description

refers to
range: Thing
domain: Thing
comment: An indirection pointer for relating a slot in am occurrence data structure, such as "dtype:ValueReference" with another resource.
type: ObjectProperty
type: Property
domain: Resource
range: Resource

http://lodlaundromat.org/.well-known/genid/fca39a28037bc24769c95c90517f0418#21
subclass of: Resource
type: Class
subclass of: Thing
type: Restriction
cardinality: 1
on property: refers to

Simple Code List
subclass of: Resource
subclass of: Thing
type: Class
comment: A simple codelist is one made up only of enumerated values.
subclass of: http://lodlaundromat.org/.well-known/genid/fca39a28037bc24769c95c90517f0418#16
subclass of: Codelist
disjoint with: Composite Code List
disjoint with: Derived Code List
subclass of: http://lodlaundromat.org/.well-known/genid/fca39a28037bc24769c95c90517f0418#7
subclass of: http://lodlaundromat.org/.well-known/genid/fca39a28037bc24769c95c90517f0418#6
subclass of: http://lodlaundromat.org/.well-known/genid/fca39a28037bc24769c95c90517f0418#8
subclass of: DTYPE Enumeration

Composite Code List
subclass of: Resource
subclass of: Thing
type: Class
comment: A composite codelist is a codelist made up of other codelists. It does not introduce any new codes.
subclass of: http://lodlaundromat.org/.well-known/genid/fca39a28037bc24769c95c90517f0418#23
subclass of: Codelist
disjoint with: Derived Code List
disjoint with: Simple Code List
subclass of: http://lodlaundromat.org/.well-known/genid/fca39a28037bc24769c95c90517f0418#7
subclass of: http://lodlaundromat.org/.well-known/genid/fca39a28037bc24769c95c90517f0418#6
subclass of: DTYPE Enumeration
subclass of: http://lodlaundromat.org/.well-known/genid/fca39a28037bc24769c95c90517f0418#8

datatype
range: Thing
domain: Thing
type: ObjectProperty
type: Property
domain: Resource
range: Resource

Value Reference
subclass of: Resource
type: Class
comment: A value reference is a pointer to an Enumerated Value. The original position of the value can be overridden by the position attribute.
subclass of: http://lodlaundromat.org/.well-known/genid/fca39a28037bc24769c95c90517f0418#20
subclass of: http://lodlaundromat.org/.well-known/genid/fca39a28037bc24769c95c90517f0418#21
subclass of: http://lodlaundromat.org/.well-known/genid/fca39a28037bc24769c95c90517f0418#22
subclass of: Thing
subclass of: http://lodlaundromat.org/.well-known/genid/fca39a28037bc24769c95c90517f0418#15

has member
range: Thing
domain: Thing
comment: A property for specifying how member elements make up a data structure.
type: ObjectProperty
type: Property
domain: Resource
range: Resource

DTYPE Enumerated value
type: Class
subclass of: Resource
subclass of: http://lodlaundromat.org/.well-known/genid/fca39a28037bc24769c95c90517f0418#9
subclass of: Thing
description: The base class for datatypes that have values that are restriced to a set of literals or tokens. The members of the restriction may themselve be restriced by facets that apply to scalar data types.
subclass of: http://lodlaundromat.org/.well-known/genid/fca39a28037bc24769c95c90517f0418#12
subclass of: http://lodlaundromat.org/.well-known/genid/fca39a28037bc24769c95c90517f0418#15
subclass of: http://lodlaundromat.org/.well-known/genid/fca39a28037bc24769c95c90517f0418#11
subclass of: http://lodlaundromat.org/.well-known/genid/fca39a28037bc24769c95c90517f0418#14
subclass of: http://lodlaundromat.org/.well-known/genid/fca39a28037bc24769c95c90517f0418#10
subclass of: http://lodlaundromat.org/.well-known/genid/fca39a28037bc24769c95c90517f0418#13
subclass of: http://lodlaundromat.org/.well-known/genid/fca39a28037bc24769c95c90517f0418#20

http://lodlaundromat.org/.well-known/genid/fca39a28037bc24769c95c90517f0418#11
subclass of: Resource
subclass of: Thing
type: Class
type: Restriction
max cardinality: 1
on property: order

value
comment: The property "dtype:value" is a general property that in some cases could have scalar values and in other cases may refer to a first class concept that is a "value object". For this reason, the type of this property is set as "rdf:Property" and the property is rangeless.
type: Property

literal
comment: A general purpose property for holding string literals.
type: DatatypeProperty
range: string
type: Property
range: Resource

order index
comment: The property "dtype:orderIndex" is an annotation property to specify a position that some value or structure will have. One use is to specify the place that a resource has in a sequence. One use is on property occurrences in class axioms. Here "vaem:orderIndex" is placed on a restriction to specify how that property may be transformed into a representation where ordering has some importance, for example, in XML Schema sequences.
type: AnnotationProperty
range: nonNegativeInteger
type: Property
range: Resource
range: integer
range: http://lodlaundromat.org/.well-known/genid/fca39a28037bc24769c95c90517f0418#1
range: decimal
range: numeric union

default value
comment: The property "dtype:defaultValue" is a general property for specifying a value in situations where none is specified, or can be determined. In some cases of use, this property could have a scalar value and in other cases may need to refer to a first class concept that holds a "value object". For this reason, the type of this property is set as "rdf:Property" and the property is rangeless.
type: Property

order
comment: The property "dtype:order" provides a means to specify a precedence. One use of order is in specifying ordered enumerations such as "voag:ConfidentialityLevel". A similar property, but with an important type difference, is "vaem:orderIndex". This is for use on property occurrences in class axioms where it can be placed on a restriction to specify how that property may be transformed into other representations where ordering has some importance, for example, in XML Schema sequences. Whereas "vaem:order" is a datatype property, "vaem:orderIndex" is an annotation property.
type: DatatypeProperty
range: nonNegativeInteger
type: Property
range: Resource
range: integer
range: http://lodlaundromat.org/.well-known/genid/fca39a28037bc24769c95c90517f0418#1
range: decimal
range: numeric union

is invalid
comment: A boolean flag to state that a value is invalid with respect to its type.
type: DatatypeProperty
range: boolean
type: Property
range: Resource

Datatype Ontology
version info: Created with TopBraid Composer
revision: 1.1
uses non imported resource: description
has graph role: SchemaGraph
date created: com.hp.hpl.jena.datatypes.BaseDatatype$TypedValue@e0c9650d
uses non imported resource: author
last updated: com.hp.hpl.jena.datatypes.BaseDatatype$TypedValue@478443ec
owner: TopQuadrant
with attribution to: TopQuadrantAttribution
uses non imported resource: title
author: Ralph Hodgson
namespace: http://www.linkedmodel.org/schema/dtype
uses non imported resource: contributor
uses non imported resource: subject
subject: Datatype schema
description: The ontology "dtype" provides a specification of simple data types such as enumerations and codelists. These are needed in support of the conversion of XML Schemas and UML Models to OWL. The purpose of "dtype" is to provide a foundation for expressing rich data types. These data types are typically needed when dealing with OWL representations of data structures derived from XML Schema.
namespace prefix: dtype
name: DTYPE
has license type: CC-SHAREALIKE 3PT0-US

code
comment: A property for expressing an encoded value. The range has been set to "xsd:anySimpleType" to allow for a variety of scalar datatypes.
type: DatatypeProperty
range: anySimpleType
type: Property
range: Resource

position
type: DatatypeProperty
range: nonNegativeInteger
type: Property
range: Resource
range: integer
range: http://lodlaundromat.org/.well-known/genid/fca39a28037bc24769c95c90517f0418#1
range: decimal
range: numeric union