Taxi (uco:UsageType)
type: QualitativeValue
type: Usage Type
type: Thing
comment: The usage of a vehicle as a taxi

original parts only (0..1)
property disjoint with: valid from (0..1)
property disjoint with: unit code (0..1)
type: DatatypeProperty
property disjoint with: country of registration (0..1)
property disjoint with: valid to (0..1)
property disjoint with: from (0..1)
property disjoint with: number of owners (0..1)
property disjoint with: number of drivers (0..1)
property disjoint with: to (0..1)
sub property of: topDataProperty
property disjoint with: bottomDataProperty
property disjoint with: country of origin (0..1)
property disjoint with: license plate (0..*)
comment: This indicates whether the parts used for repairing a damage, for a maintenance task, or a modification were all original.
domain: http://lodlaundromat.org/.well-known/genid/ede21269d31f27212ebe3c65718ca2a9#11
range: boolean

from (0..1)
property disjoint with: bottomDataProperty
property disjoint with: country of registration (0..1)
sub property of: topDataProperty
property disjoint with: total loss (0..1)
property disjoint with: airbag deployment (0..1)
property disjoint with: number of drivers (0..1)
property disjoint with: unit code (0..1)
property disjoint with: structural damage (0..1)
type: DatatypeProperty
property disjoint with: original parts only (0..1)
property disjoint with: country of origin (0..1)
property disjoint with: smoking (0..1)
property disjoint with: indication of odometer rollback (0..1)
property disjoint with: license plate (0..*)
property disjoint with: number of owners (0..1)
property disjoint with: repaired (0..1)
comment: This property indicates the beginning of the period of ownership represented by this uco:OwnershipInfo node.
domain: Ownership Info
range: dateTime

hasOwnershipInfo (0..*)
sub property of: topObjectProperty
property disjoint with: bottomObjectProperty
type: ObjectProperty
comment: This property points to information about the current and previous owners of the vehicle.
domain: Vehicle
range: Ownership Info

property value (0..1)
sub property of: topDataProperty
property disjoint with: bottomDataProperty
type: DatatypeProperty
comment: The value of of the property
domain: Property Value
range: Literal

Carport (uco:ParkingType)
type: QualitativeValue
type: Parking Type
type: Thing
comment: The parking of a vehicle under a protective roof, e.g. in a carport

mileage (0..1)
sub property of: topObjectProperty
property disjoint with: bottomObjectProperty
type: ObjectProperty
comment: The mileage of the vehicle at the event, e.g. at the accident, maintenance, check, or modification. Typical unit code(s): KMT for kilometers, SMI for statute miles
domain: http://lodlaundromat.org/.well-known/genid/ede21269d31f27212ebe3c65718ca2a9#1
range: QuantitativeValue

feature (0..*)
sub property of: topObjectProperty
property disjoint with: bottomObjectProperty
type: ObjectProperty
comment: This property points to vehicle features in a semi-structured property-value form.
domain: Vehicle
range: Property Value

Modification or Maintenance
disjoint with: Nothing
subclass of: http://lodlaundromat.org/.well-known/genid/ede21269d31f27212ebe3c65718ca2a9#11
subclass of: Thing
subclass of: http://lodlaundromat.org/.well-known/genid/ede21269d31f27212ebe3c65718ca2a9#29
subclass of: http://lodlaundromat.org/.well-known/genid/ede21269d31f27212ebe3c65718ca2a9#1
subclass of: Event
type: Class
comment: A modification or maintenance is an event in which a part of the vehicle is being replaced or removed, or a new part is being added. Typical examples are the replacement of the engine or the installation of a trailor-hitch.

Money-back Guarantee (gr:WarrantyScope)
type: WarrantyScope
type: Thing
comment: The promise to take back the vehicle without any specific reason for a full refund within a certain amount of time

valuation (0..*)
sub property of: topObjectProperty
property disjoint with: bottomObjectProperty
type: ObjectProperty
comment: The market price assessment gained by the respective valuation. Use gr:name to indicate the name of the valuation service.
domain: Vehicle
range: PriceSpecification

number of drivers (0..1)
property disjoint with: airbag deployment (0..1)
property disjoint with: license plate (0..*)
sub property of: topDataProperty
property disjoint with: valid to (0..1)
property disjoint with: unit code (0..1)
property disjoint with: to (0..1)
property disjoint with: total loss (0..1)
property disjoint with: country of origin (0..1)
property disjoint with: original parts only (0..1)
type: DatatypeProperty
property disjoint with: bottomDataProperty
property disjoint with: valid from (0..1)
property disjoint with: smoking (0..1)
property disjoint with: from (0..1)
property disjoint with: structural damage (0..1)
property disjoint with: indication of odometer rollback (0..1)
property disjoint with: repaired (0..1)
property disjoint with: country of registration (0..1)
comment: The number of people who were/are regularly driving the vehicle in the respective period of time (when attached to uco:OwnershipInfo) or in total (when directly applied to a vso:Vehicle)
domain: http://lodlaundromat.org/.well-known/genid/ede21269d31f27212ebe3c65718ca2a9#5
range: integer

total loss (0..1)
property disjoint with: valid to (0..1)
property disjoint with: number of drivers (0..1)
property disjoint with: bottomDataProperty
property disjoint with: to (0..1)
property disjoint with: country of origin (0..1)
property disjoint with: country of registration (0..1)
property disjoint with: from (0..1)
property disjoint with: license plate (0..*)
type: DatatypeProperty
property disjoint with: unit code (0..1)
property disjoint with: number of owners (0..1)
property disjoint with: valid from (0..1)
sub property of: topDataProperty
comment: This property indicates whether the accident leading to the damage was a not-at-fault accident from the perspective of the owner.
domain: Damage or Accident
range: boolean

parking (0..*)
sub property of: topObjectProperty
property disjoint with: bottomObjectProperty
type: ObjectProperty
comment: The main type(s) of parking that have been used for the vehicle during the period of ownership (if attached to uco:OwnershipInfo) or in general (if attached to the vso:Vehicle directly)
domain: Ownership Info
domain: Vehicle
range: Parking Type

smoking (0..1)
property disjoint with: country of registration (0..1)
property disjoint with: valid from (0..1)
property disjoint with: bottomDataProperty
property disjoint with: country of origin (0..1)
sub property of: topDataProperty
property disjoint with: valid to (0..1)
property disjoint with: to (0..1)
property disjoint with: number of owners (0..1)
property disjoint with: from (0..1)
property disjoint with: license plate (0..*)
property disjoint with: number of drivers (0..1)
property disjoint with: unit code (0..1)
type: DatatypeProperty
comment: This property indicates whether it has been smoked inside the car in the respective period of time (when attached to uco:OwnershipInfo) or ever (when directly applied to a vso:Vehicle).
domain: http://lodlaundromat.org/.well-known/genid/ede21269d31f27212ebe3c65718ca2a9#14
range: boolean

part added (0..1)
sub property of: topDataProperty
property disjoint with: bottomDataProperty
type: DatatypeProperty
comment: A textual description of the part or parts added in the modification (e.g. tuning) or maintenance task
domain: Modification or Maintenance
range: Literal

airbag deployment (0..1)
property disjoint with: country of origin (0..1)
property disjoint with: from (0..1)
property disjoint with: number of drivers (0..1)
property disjoint with: valid from (0..1)
sub property of: topDataProperty
property disjoint with: to (0..1)
property disjoint with: valid to (0..1)
type: DatatypeProperty
property disjoint with: country of registration (0..1)
property disjoint with: number of owners (0..1)
property disjoint with: license plate (0..*)
property disjoint with: unit code (0..1)
property disjoint with: bottomDataProperty
comment: This property indicates whether at least one of the airbags of the vehicle has been deployed in the respective accident (when attached to uco:DamageOrAccident) or ever (when directly applied to a vso:Vehicle).
domain: http://lodlaundromat.org/.well-known/genid/ede21269d31f27212ebe3c65718ca2a9#8
range: boolean

repaired (0..1)
property disjoint with: license plate (0..*)
property disjoint with: country of origin (0..1)
type: DatatypeProperty
property disjoint with: number of owners (0..1)
property disjoint with: unit code (0..1)
property disjoint with: country of registration (0..1)
property disjoint with: to (0..1)
property disjoint with: number of drivers (0..1)
property disjoint with: valid to (0..1)
property disjoint with: from (0..1)
property disjoint with: bottomDataProperty
property disjoint with: valid from (0..1)
sub property of: topDataProperty
comment: This indicates whether damages resulting from a certain uco:DamageOrAccident (when attached to this type) or all damages (when directly attached to a vso:Vehicle) have been properly repaired. Do not use this propery on a vso:Vehicle if it never had a damage.
domain: http://lodlaundromat.org/.well-known/genid/ede21269d31f27212ebe3c65718ca2a9#26
range: boolean

Usage Type
disjoint with: Nothing
subclass of: QualitativeValue
subclass of: Thing
type: Class
comment: A type of usage of a vehicle, e.g. rental, taxi, driving school, commuting. It is best to either use one of the predefined individuals or DBpedia URIs whenever possible.

Driving School (uco:UsageType)
type: QualitativeValue
type: Usage Type
type: Thing
comment: The usage of a vehicle for commercial driver's education

pets (0..*)
sub property of: topObjectProperty
property disjoint with: bottomObjectProperty
type: ObjectProperty
comment: The type(s) of animals that have been transported in the vehicle during the period of ownership (if attached to uco:OwnershipInfo) or in general (if attached to the vso:Vehicle directly). If possible, use DBPedia URIs, e.g. http://dbpedia.org/resource/Dog.
domain: Ownership Info
domain: Vehicle
range: Species

carried out by (0..1)
sub property of: topObjectProperty
property disjoint with: bottomObjectProperty
type: ObjectProperty
comment: The business or type of business that carried out the check, repair, maintenance, or modification
domain: http://lodlaundromat.org/.well-known/genid/ede21269d31f27212ebe3c65718ca2a9#29
range: http://lodlaundromat.org/.well-known/genid/ede21269d31f27212ebe3c65718ca2a9#33

number of owners (0..1)
property disjoint with: country of registration (0..1)
property disjoint with: indication of odometer rollback (0..1)
property disjoint with: valid to (0..1)
property disjoint with: from (0..1)
property disjoint with: valid from (0..1)
property disjoint with: unit code (0..1)
property disjoint with: total loss (0..1)
property disjoint with: airbag deployment (0..1)
sub property of: topDataProperty
property disjoint with: country of origin (0..1)
property disjoint with: bottomDataProperty
property disjoint with: to (0..1)
property disjoint with: smoking (0..1)
property disjoint with: original parts only (0..1)
type: DatatypeProperty
property disjoint with: repaired (0..1)
property disjoint with: structural damage (0..1)
property disjoint with: license plate (0..*)
comment: The total number of people or organizations who owned the vehicle, including the current owner. Note that this value can be higher (but not lower) than the number of uco:OwnershipInfo nodes, since those records may be incomplete.
domain: Vehicle
range: integer

Parking Type
disjoint with: Nothing
subclass of: QualitativeValue
subclass of: Thing
type: Class
comment: A type of parking for a vehicle, e.g. in a garage, on the street (open-sky), or in a carport. You can use DBpedia URIs for additional types.

Car Sharing (uco:UsageType)
type: QualitativeValue
type: Usage Type
type: Thing
comment: The usage of a vehicle for car sharing networks

valid from (0..1)
property disjoint with: structural damage (0..1)
property disjoint with: country of registration (0..1)
property disjoint with: license plate (0..*)
property disjoint with: bottomDataProperty
property disjoint with: number of drivers (0..1)
property disjoint with: smoking (0..1)
type: DatatypeProperty
property disjoint with: total loss (0..1)
property disjoint with: airbag deployment (0..1)
property disjoint with: indication of odometer rollback (0..1)
property disjoint with: country of origin (0..1)
property disjoint with: number of owners (0..1)
property disjoint with: original parts only (0..1)
property disjoint with: repaired (0..1)
sub property of: topDataProperty
property disjoint with: unit code (0..1)
comment: This property indicates the beginning of the validity of the inspection represented by the uco:Check node. This is typically the day of the inspection.
domain: Check
range: dateTime

listPrice (0..1)
sub property of: topObjectProperty
property disjoint with: bottomObjectProperty
type: ObjectProperty
comment: The original list price of the new car at the time of production
domain: Vehicle
range: PriceSpecification

part replaced (0..1)
sub property of: topDataProperty
property disjoint with: bottomDataProperty
type: DatatypeProperty
comment: A textual description of the part or parts replaced in the modification (e.g. tuning) or maintenance (e.g. new engine) task
domain: Modification or Maintenance
range: Literal

Check
disjoint with: Nothing
subclass of: Thing
subclass of: http://lodlaundromat.org/.well-known/genid/ede21269d31f27212ebe3c65718ca2a9#29
subclass of: http://lodlaundromat.org/.well-known/genid/ede21269d31f27212ebe3c65718ca2a9#1
type: Class
comment: A mandatory or optional technical inspection, e.g. the MOT, a vendor-specific certification of used cars, etc.

Authorized Dealer (gr:BusinessEntityType)
type: http://lodlaundromat.org/.well-known/genid/ede21269d31f27212ebe3c65718ca2a9#33
type: BusinessEntityType
type: Thing
comment: An authorized dealer of the manufacturer of the respective vehicle

Business (uco:UsageType)
type: QualitativeValue
type: Usage Type
type: Thing
comment: The usage of a vehicle for general business purposes, i.e. excluding usages like as a taxi, rental car, or driving instructions.

driver (0..*)
sub property of: topObjectProperty
property disjoint with: bottomObjectProperty
type: ObjectProperty
comment: This property points to the driver or drivers that were regularly driving the vehicle during the respective period of time (when attached to uco:OwnershipInfo) or in total (when attached directly to a vso:Vehicle).
domain: Ownership Info
domain: Vehicle
range: Person

eventInformation (0..*)
sub property of: topObjectProperty
property disjoint with: bottomObjectProperty
type: ObjectProperty
comment: This property points to events related to the vehicle, like accidents and damages or major modifications or maintenance.
domain: Vehicle
range: Event

Damage or Accident
subclass of: http://lodlaundromat.org/.well-known/genid/ede21269d31f27212ebe3c65718ca2a9#17
subclass of: Event
subclass of: http://lodlaundromat.org/.well-known/genid/ede21269d31f27212ebe3c65718ca2a9#11
subclass of: http://lodlaundromat.org/.well-known/genid/ede21269d31f27212ebe3c65718ca2a9#1
subclass of: http://lodlaundromat.org/.well-known/genid/ede21269d31f27212ebe3c65718ca2a9#29
disjoint with: Nothing
subclass of: http://lodlaundromat.org/.well-known/genid/ede21269d31f27212ebe3c65718ca2a9#20
subclass of: Thing
type: Class
subclass of: http://lodlaundromat.org/.well-known/genid/ede21269d31f27212ebe3c65718ca2a9#26
subclass of: http://lodlaundromat.org/.well-known/genid/ede21269d31f27212ebe3c65718ca2a9#8
comment: A damage or accident is an event in which the vehicle is being damaged.

main location (0..*)
sub property of: topObjectProperty
property disjoint with: bottomObjectProperty
type: ObjectProperty
comment: The main location(s) of the vehicle during the period of ownership
domain: Ownership Info
range: Place
range: PostalAddress

owner (0..*)
sub property of: topObjectProperty
property disjoint with: bottomObjectProperty
type: ObjectProperty
comment: This property points to the owner of the vehicle for the respective period of time, as indicated by the uco:OwnershipInfo node.
domain: Ownership Info
domain: Vehicle
range: BusinessEntity
range: Organization
range: Person

part removed (0..1)
sub property of: topDataProperty
property disjoint with: bottomDataProperty
type: DatatypeProperty
comment: A textual description of the part or parts removed in the modification (e.g. tuning) or maintenance task
domain: Modification or Maintenance
range: Literal

license plate (0..*)
property disjoint with: repaired (0..1)
sub property of: topDataProperty
property disjoint with: total loss (0..1)
property disjoint with: smoking (0..1)
property disjoint with: bottomDataProperty
property disjoint with: valid from (0..1)
property disjoint with: number of drivers (0..1)
property disjoint with: airbag deployment (0..1)
property disjoint with: indication of odometer rollback (0..1)
property disjoint with: original parts only (0..1)
property disjoint with: number of owners (0..1)
property disjoint with: to (0..1)
property disjoint with: structural damage (0..1)
property disjoint with: valid to (0..1)
type: DatatypeProperty
property disjoint with: from (0..1)
comment: The license plate string(s) assigned to the vehicle during the period of ownership
domain: Ownership Info
range: string

contains (0..*)
sub property of: topObjectProperty
property disjoint with: bottomObjectProperty
type: ObjectProperty
comment: A naive part-whole relation that allows providing more granular uco:OwnershipInfo data for a part of the duration of the ownership
domain: Ownership Info
range: Ownership Info

to (0..1)
property disjoint with: total loss (0..1)
property disjoint with: bottomDataProperty
property disjoint with: number of drivers (0..1)
type: DatatypeProperty
sub property of: topDataProperty
property disjoint with: indication of odometer rollback (0..1)
property disjoint with: unit code (0..1)
property disjoint with: airbag deployment (0..1)
property disjoint with: smoking (0..1)
property disjoint with: original parts only (0..1)
property disjoint with: country of registration (0..1)
property disjoint with: license plate (0..*)
property disjoint with: country of origin (0..1)
property disjoint with: structural damage (0..1)
property disjoint with: repaired (0..1)
property disjoint with: number of owners (0..1)
comment: This property indicates the end of the period of ownership represented by this uco:OwnershipInfo node.
domain: Ownership Info
range: dateTime

Species
disjoint with: Nothing
subclass of: QualitativeValue
subclass of: Thing
type: Class
comment: A species, typically a pet, for indicating the type of animals that were regularly transported in the vehicle. If possible, use DBPedia URIs, e.g. http://dbpedia.org/resource/Dog.

Garage (uco:ParkingType)
type: QualitativeValue
type: Parking Type
type: Thing
comment: The parking of a vehicle in a closed garage

Private (uco:UsageType)
type: QualitativeValue
type: Usage Type
type: Thing
comment: The usage of a vehicle soleley for private purposes

property ID (0..1)
sub property of: topDataProperty
property disjoint with: bottomDataProperty
type: DatatypeProperty
comment: A global identifier, e.g. a URI, a prefixed string, or any other identifier that can be used to refer to a standardized property type
domain: Property Value
range: Literal

Rental (uco:UsageType)
type: QualitativeValue
type: Usage Type
type: Thing
comment: The usage of a vehicle as a rental car

Street (uco:ParkingType)
type: QualitativeValue
type: Parking Type
type: Thing
comment: The parking of a vehicle on a public or private street

inspected (0..*)
sub property of: topObjectProperty
property disjoint with: bottomObjectProperty
type: ObjectProperty
comment: This property points to inspections and certifications that the vehicle has undergone.
domain: Vehicle
range: Check

total loss (0..1)
property disjoint with: bottomDataProperty
sub property of: topDataProperty
property disjoint with: valid to (0..1)
property disjoint with: unit code (0..1)
property disjoint with: from (0..1)
property disjoint with: to (0..1)
type: DatatypeProperty
property disjoint with: number of drivers (0..1)
property disjoint with: valid from (0..1)
property disjoint with: country of origin (0..1)
property disjoint with: country of registration (0..1)
property disjoint with: number of owners (0..1)
property disjoint with: license plate (0..*)
comment: This property indicates whether the vehicle is considered a total loss as the result of a damage in the respective accident (when attached to uco:DamageOrAccident) or in general (when directly applied to a vso:Vehicle).
domain: http://lodlaundromat.org/.well-known/genid/ede21269d31f27212ebe3c65718ca2a9#17
range: boolean

unit text (0..1)
sub property of: topDataProperty
property disjoint with: bottomDataProperty
type: DatatypeProperty
comment: A string or text indicating the unit of measurement. Useful if you cannot provide a standard unit code for uco:unitCode.
domain: Property Value
range: Literal

valid to (0..1)
property disjoint with: license plate (0..*)
property disjoint with: country of origin (0..1)
property disjoint with: original parts only (0..1)
type: DatatypeProperty
property disjoint with: unit code (0..1)
property disjoint with: bottomDataProperty
property disjoint with: smoking (0..1)
property disjoint with: indication of odometer rollback (0..1)
property disjoint with: country of registration (0..1)
property disjoint with: repaired (0..1)
sub property of: topDataProperty
property disjoint with: total loss (0..1)
property disjoint with: number of owners (0..1)
property disjoint with: airbag deployment (0..1)
property disjoint with: number of drivers (0..1)
property disjoint with: structural damage (0..1)
comment: This property indicates the end of the validity of the inspection represented by the uco:Check node. This is typically the day of the inspection plus one (UK MOT) or two years (e.g. German TÜV).
domain: Check
range: dateTime

currentOwner (0..1)
sub property of: topObjectProperty
sub property of: owner (0..*)
property disjoint with: bottomObjectProperty
type: ObjectProperty
domain: Ownership Info
range: BusinessEntity
comment: This property points to the current owner of the vehicle.
range: Person
range: Organization
domain: Vehicle

structural damage (0..1)
type: DatatypeProperty
property disjoint with: valid from (0..1)
property disjoint with: unit code (0..1)
property disjoint with: from (0..1)
property disjoint with: number of owners (0..1)
sub property of: topDataProperty
property disjoint with: valid to (0..1)
property disjoint with: country of origin (0..1)
property disjoint with: to (0..1)
property disjoint with: license plate (0..*)
property disjoint with: bottomDataProperty
property disjoint with: number of drivers (0..1)
property disjoint with: country of registration (0..1)
comment: This property indicates whether the vehicle has suffered from structural damage in the respective accident (when attached to uco:DamageOrAccident) or ever (when directly applied to a vso:Vehicle).
domain: http://lodlaundromat.org/.well-known/genid/ede21269d31f27212ebe3c65718ca2a9#20
range: boolean

indication of odometer rollback (0..1)
property disjoint with: number of drivers (0..1)
property disjoint with: license plate (0..*)
property disjoint with: valid to (0..1)
property disjoint with: country of registration (0..1)
sub property of: topDataProperty
property disjoint with: from (0..1)
property disjoint with: bottomDataProperty
property disjoint with: country of origin (0..1)
type: DatatypeProperty
property disjoint with: valid from (0..1)
property disjoint with: number of owners (0..1)
property disjoint with: to (0..1)
property disjoint with: unit code (0..1)
comment: This property indicates whether it is likely or known that the odometer of the vehicle does not properly reflect the total mileage of the vehicle, e.g. because the odometer has been replaced, reset, or tampered with
domain: Vehicle
range: boolean

usage (0..*)
sub property of: topObjectProperty
property disjoint with: bottomObjectProperty
type: ObjectProperty
comment: The type(s) of usage during the period of ownership (if attached to uco:OwnershipInfo) or in general (if attached to the vso:Vehicle directly)
domain: Ownership Info
domain: Vehicle
range: Usage Type

mileage end (0..1)
sub property of: topObjectProperty
property disjoint with: bottomObjectProperty
type: ObjectProperty
comment: The mileage of the vehicle at the end of the period of ownership. Typical unit code(s): KMT for kilometers, SMI for statute miles
domain: Ownership Info
range: QuantitativeValue

Ownership Info
disjoint with: Nothing
subclass of: Thing
subclass of: http://lodlaundromat.org/.well-known/genid/ede21269d31f27212ebe3c65718ca2a9#14
subclass of: http://lodlaundromat.org/.well-known/genid/ede21269d31f27212ebe3c65718ca2a9#5
type: Class
comment: An ownership information node is a structured value representing information about the period of ownership of a vehicle by a person or organisation.

currentLocation (0..1)
sub property of: topObjectProperty
property disjoint with: bottomObjectProperty
type: ObjectProperty
comment: The current location of the vehicle, i.e. where the car could be tested. For indicating alternative locations to which the seller is willing to bring the car, use gr:availableAtOrFrom attached to the gr:Offering, since those are aspects of the offer, not of the vehicle.
domain: Vehicle
range: Place
range: PostalAddress

country of registration (0..1)
property disjoint with: indication of odometer rollback (0..1)
property disjoint with: number of owners (0..1)
property disjoint with: original parts only (0..1)
property disjoint with: airbag deployment (0..1)
property disjoint with: bottomDataProperty
property disjoint with: smoking (0..1)
sub property of: topDataProperty
property disjoint with: from (0..1)
property disjoint with: structural damage (0..1)
property disjoint with: number of drivers (0..1)
type: DatatypeProperty
property disjoint with: valid to (0..1)
property disjoint with: to (0..1)
property disjoint with: total loss (0..1)
property disjoint with: repaired (0..1)
property disjoint with: valid from (0..1)
comment: The country or geo-political region in which the vehicle is currently registered, indicated as the two-character version of ISO 3166-1 (ISO 3166-1 alpha-2) for regions or ISO 3166-2, which breaks down the countries from ISO 3166-1 into administrative subdivisions.
domain: Vehicle
range: string

Independent Dealer (gr:BusinessEntityType)
type: http://lodlaundromat.org/.well-known/genid/ede21269d31f27212ebe3c65718ca2a9#33
type: BusinessEntityType
type: Thing
comment: An independent dealer

property name (0..1)
sub property of: topDataProperty
property disjoint with: bottomDataProperty
type: DatatypeProperty
comment: The name of the property
domain: Property Value
range: Literal

mileage initial (0..1)
sub property of: topObjectProperty
property disjoint with: bottomObjectProperty
type: ObjectProperty
comment: The mileage of the vehicle at the beginning of the period of ownership. Typical unit code(s): KMT for kilometers, SMI for statute miles
domain: Ownership Info
range: QuantitativeValue

Property Value
disjoint with: Nothing
subclass of: Thing
type: Class
comment: A property-value is a structured value for representing a feature of a vehicle in a semi-formal way.

country of origin (0..1)
property disjoint with: structural damage (0..1)
property disjoint with: total loss (0..1)
sub property of: topDataProperty
property disjoint with: repaired (0..1)
property disjoint with: smoking (0..1)
property disjoint with: indication of odometer rollback (0..1)
property disjoint with: valid from (0..1)
property disjoint with: to (0..1)
property disjoint with: bottomDataProperty
property disjoint with: number of drivers (0..1)
property disjoint with: number of owners (0..1)
property disjoint with: original parts only (0..1)
type: DatatypeProperty
property disjoint with: airbag deployment (0..1)
property disjoint with: from (0..1)
property disjoint with: valid to (0..1)
comment: The country or geo-political region in which the vehicle was initially sold officially, indicated as the two-character version of ISO 3166-1 (ISO 3166-1 alpha-2) for regions or ISO 3166-2, which breaks down the countries from ISO 3166-1 into administrative subdivisions.
domain: Vehicle
range: string

unit code (0..1)
property disjoint with: valid to (0..1)
type: DatatypeProperty
property disjoint with: airbag deployment (0..1)
property disjoint with: indication of odometer rollback (0..1)
property disjoint with: valid from (0..1)
property disjoint with: total loss (0..1)
property disjoint with: number of owners (0..1)
property disjoint with: to (0..1)
sub property of: topDataProperty
property disjoint with: number of drivers (0..1)
property disjoint with: original parts only (0..1)
property disjoint with: from (0..1)
property disjoint with: repaired (0..1)
property disjoint with: smoking (0..1)
property disjoint with: bottomDataProperty
property disjoint with: structural damage (0..1)
comment: A UN/CEFACT Common Code for indicating the unit of measurement of the value, if available
domain: Property Value
range: string

Used Cars Ontology
subject: E-Commerce, E-Business, GoodRelations, Ontology, Automotive, Cars, Vehicles, Used Cars
license: http://creativecommons.org/licenses/by/3.0/
creator: Hepp Research GmbH and Makolab S.A.
type: Ontology
comment: UCO: The The Used Cars Ontology A Web vocabulary for describing aspects of used cars for e-commerce. Vocabulary: http://purl.org/uco/ns# Namespace: http://purl.org/uco/ns# The vocabulary is designed to be used in combination with (1) GoodRelations, a standard vocabulary for the commercial aspects of offers for sale, rental, repair, or disposal; and (2) the Vehicle Sales Ontology, a standard vocabulary for cars and other vehicles. See http://purl.org/goodrelations/ and http://purl.org/vso/ns for more information.
imports: ns
rights: The Used Cars Ontology is available under the Creative Commons Attribution 3.0 Unported license; see http://creativecommons.org/licenses/by/3.0/. In a nutshell, you are free to copy, distribute and transmit the work; to remix/adapt the work (e.g. to import the ontology and create specializations of its elements), as long as you attribute the work in the manner specified by the author or licensor (but not in any way that suggests that they endorse you or your use of the work).
version info: V 1.0:A, Release 2012-12-31
title: UCO: The Used Cars Ontology for Semantic Web-based E-Commerce
imports: v1