for
domain: Thing
type: Property
type: ObjectProperty
comment: Relates a recommendation to someone or something.
domain: Recommendation
range: Thing
inverse of: has recommendation
term status: unstable
domain: LikeableAssociation
domain: Resource
range: Resource

Ranked Recommendation
subclass of: Resource
subclass of: Thing
type: Class
comment: A ranked recommendation that includes an ordered list of recommendations.
subclass of: OrderedList
subclass of: Recommendation
term status: testing
subclass of: LikeableAssociation

has recommender
range: Agent
inverse of: recommends
range: Thing
domain: Thing
type: Property
type: ObjectProperty
comment: An agent, which provided/calculated this recommendation.
domain: Recommendation
sub property of: creator
term status: unstable
domain: LikeableAssociation
domain: Resource
range: Resource

Recommendation
subclass of: Resource
subclass of: Thing
type: Class
comment: A recommendation of something for someone or a specific audience by a recommender.
subclass of: LikeableAssociation
term status: unstable

ranked recommendation object
range: Thing
domain: Thing
sub property of: object
type: Property
type: ObjectProperty
comment: A ranked recommendation object in a ranked recommendation
domain: Ranked Recommendation
sub property of: slot
sub property of: has recommendation object
term status: testing
range: Resource
domain: Recommendation
domain: Resource
domain: LikeableAssociation
domain: OrderedList

recommended in
range: Thing
type: Property
type: ObjectProperty
comment: A thing, which is recommended in a recommendation.
domain: Thing
range: Recommendation
inverse of: has recommendation object
term status: unstable
domain: Resource
range: Resource
range: LikeableAssociation

recommends
range: Thing
domain: Thing
type: Property
type: ObjectProperty
comment: An agent recommends a recommendation to someone or a recommendation audience.
domain: Agent
range: Recommendation
inverse of: has recommender
term status: unstable
domain: Resource
range: Resource
range: LikeableAssociation

has recommendation
inverse of: for
range: Thing
type: Property
type: ObjectProperty
comment: A recommendation for someone or something.
domain: Thing
range: Recommendation
sub property of: association
term status: unstable
domain: Resource
range: Resource
range: LikeableAssociation

has recommendation object
inverse of: recommended in
domain: Thing
type: Property
type: ObjectProperty
comment: A recommendation object that is part of a specific recommendation.
domain: Recommendation
range: Thing
sub property of: object
term status: unstable
domain: LikeableAssociation
domain: Resource
range: Resource

The Recommendation Ontology
imports: core
imports: http://purl.org/dc/elements/1.1/
imports: terms
type: Ontology
imports: core#
creator: me
version info: 0.3
imports: similarity
date: 2010-08-02T08:31:52Z
imports: http://xmlns.com/foaf/0.1/
description: The Recommendation Ontology specification provides basic concepts and properties for describing recommendations on/ for the Semantic Web. This document contains a RDF description of the Recommendation Ontology.
imports: ns

has recommendation audience
type: Property
comment: An audience for a specific recommendation.
domain: Recommendation
range: http://lodlaundromat.org/.well-known/genid/e92e01bca7468d299fef45acd6881d5f#1
term status: unstable
domain: LikeableAssociation
domain: Thing
domain: Resource
range: Thing
range: Resource