hasLocationCoordinateSystem
range: Thing
domain: Thing
type: ObjectProperty
comment: Corresponds to 'location.coordinateSystem' in the Ontology for Media Resources.
domain: Location
type: Property
range: Resource
domain: Resource

hasSubtitling
sub property of: hasFragment
range: Thing
domain: Thing
type: ObjectProperty
comment: Corresponds to 'fragment' in the Ontology for Media Resources with a 'fragment.role' meaning "subtitling".
sub property of: hasCaptioning
type: Property
range: MediaFragment
range: Resource
range: MediaResource
domain: MediaResource
domain: Resource

hasFragment
range: Thing
domain: Thing
type: ObjectProperty
comment: Corresponds to 'fragment' in the Ontology for Media Resources. Subproperties can be used to distinguish different values of 'fragment.role'.
domain: MediaResource
range: MediaFragment
inverse of: isFragmentOf
type: Property
range: Resource
range: MediaResource
domain: Resource

isProvidedBy
range: Thing
domain: Thing
type: ObjectProperty
comment: Corresponds to 'rating.identifier' in the Ontology for Media Resources.
domain: Rating
range: Agent
inverse of: provides
type: Property
range: Resource
domain: Resource

createdIn
range: Thing
domain: Thing
type: ObjectProperty
comment: A subproperty of 'hasRelatedLocation" used to specify where material shooting took place.
sub property of: hasRelatedLocation
inverse of: isCreationLocationOf
type: Property
range: Location
range: Resource
domain: MediaResource
domain: Resource

hasPolicy
range: Thing
domain: Thing
type: ObjectProperty
comment: Corresponds to 'policy' in the Ontology for Media Resources. Subproperties can be used to distinguish different values of 'policy.type'.
domain: MediaResource
type: Property
range: Resource
domain: Resource

hasCreator
range: Thing
domain: Thing
type: ObjectProperty
comment: Corresponds to 'creator.creator' in the Ontology for Media Resources. Subproperties can be used to distinguish different values of 'creator.role'. Note that this property is semantically a subproperty of 'hasContributor'.
sub property of: hasContributor
inverse of: hasCreated
type: Property
range: Agent
range: Resource
domain: MediaResource
domain: Resource

hasGenre
range: Thing
domain: Thing
type: ObjectProperty
comment: Corresponds to 'genre' in the Ontology for Media Resources.
domain: MediaResource
type: Property
range: Resource
domain: Resource

TargetAudience
subclass of: Thing
subclass of: Resource
type: Class
comment: Information about The target audience (target region, target audience category but also parental guidance recommendation) for which a media resource is intended.
disjoint with: Location
disjoint with: Agent
disjoint with: Rating
disjoint with: MediaResource
disjoint with: Collection

DataTrack
subclass of: Resource
type: Class
subclass of: Thing
comment: Ancillary data track e.g. captioning in addition to video and audio tracks. Specialisation is made through the use of appropriate object properties.
subclass of: Track
disjoint with: VideoTrack
subclass of: MediaResource
subclass of: MediaFragment
disjoint with: AudioTrack

Location
subclass of: Resource
type: Class
subclass of: Thing
comment: A location related to the media resource, e.g. depicted in the resource (possibly fictional) or where the resource was created (shooting location), etc.
disjoint with: MediaResource
disjoint with: Rating
disjoint with: TargetAudience
disjoint with: Collection
disjoint with: Agent

hasPublisher
range: Thing
domain: Thing
type: ObjectProperty
comment: Corresponds to 'publisher' in the Ontology for Media Resources.
sub property of: hasContributor
inverse of: hasPublished
type: Property
range: Agent
range: Resource
domain: MediaResource
domain: Resource

Organisation
subclass of: Resource
type: Class
subclass of: Thing
comment: An organisation or moral agent.
subclass of: Agent
disjoint with: Person

Image
subclass of: Resource
type: Class
subclass of: Thing
comment: A still image / thumbnail / key frame related to the media resource or being the media resource itself.
subclass of: MediaResource

hasContributor
range: Thing
domain: Thing
type: ObjectProperty
comment: Corresponds to 'contributor.contributor' in the Ontology for Media Resources. Subproperties can be used to distinguish different values of 'contributor.role'.
domain: MediaResource
range: Agent
inverse of: hasContributedTo
type: Property
range: Resource
domain: Resource

isMemberOf
range: Thing
domain: Thing
type: ObjectProperty
comment: Corresponds to 'collection' in the Ontology for Media Resources.
domain: MediaResource
range: Collection
inverse of: hasMember
type: Property
range: Resource
domain: Resource

AudioTrack
subclass of: Resource
type: Class
subclass of: Thing
comment: A specialisation of Track for Audio to provide a link to specific data properties such as sampleRate, etc. Specialisation is defined through object properties.
subclass of: Track
disjoint with: DataTrack
disjoint with: VideoTrack
subclass of: MediaResource
subclass of: MediaFragment

hasCompression
range: Thing
domain: Thing
type: ObjectProperty
comment: Corresponds to 'compression' in the Ontology for Media Resources.
domain: MediaResource
type: Property
range: Resource
domain: Resource

hasRelatedResource
range: Thing
domain: Thing
type: ObjectProperty
comment: Corresponds to 'relation' and in the Ontology for Media Resources. Subproperties can be used to distinguish different values of 'relation.type'.
domain: MediaResource
inverse of: isRelatedTo
type: Property
range: Resource
domain: Resource

hasRatingSystem
range: Thing
domain: Thing
type: ObjectProperty
comment: Corresponds to 'rating.type' in the Ontology for Media Resources.
domain: Rating
type: Property
range: Resource
domain: Resource

Collection
subclass of: Thing
subclass of: Resource
type: Class
comment: Any group of media resource e.g. a series.
disjoint with: Location
disjoint with: MediaResource
disjoint with: Rating
disjoint with: TargetAudience
disjoint with: Agent

hasNamedFragment
range: Thing
domain: Thing
type: ObjectProperty
comment: Corresponds to 'namedFragment' in the Ontology for Media Resources.
sub property of: hasFragment
inverse of: isNamedFragmentOf
type: Property
range: MediaFragment
range: Resource
range: MediaResource
domain: MediaResource
domain: Resource

hasClassificationSystem
range: Thing
domain: Thing
type: ObjectProperty
comment: Corresponds to 'targetAudience.identifier' in the Ontology for Media Resources. This is used to identify the reference sheme against which the target audience has been characterised.
domain: TargetAudience
type: Property
range: Resource
domain: Resource

Agent
subclass of: Thing
subclass of: Resource
type: Class
comment: A person or organisation contributing to the media resource.
disjoint with: Collection
disjoint with: Location
disjoint with: MediaResource
disjoint with: Rating
disjoint with: TargetAudience

hasSource
range: Thing
domain: Thing
type: ObjectProperty
comment: Corresponds to 'relation' and in the Ontology for Media Resources with a 'relation.type' meaning "source".
sub property of: hasRelatedResource
inverse of: isSourceOf
type: Property
range: Resource
domain: MediaResource
domain: Resource

hasChapter
range: Thing
domain: Thing
type: ObjectProperty
comment: Corresponds to 'fragment' in the Ontology for Media Resources with a 'fragment.role' meaning "chapter".
sub property of: hasFragment
inverse of: isChapterOf
type: Property
range: MediaFragment
range: Resource
range: MediaResource
domain: MediaResource
domain: Resource

hasRating
range: Thing
domain: Thing
type: ObjectProperty
comment: Corresponds to 'rating' in the Ontology for Media Resources.
domain: MediaResource
range: Rating
inverse of: isRatingOf
type: Property
range: Resource
domain: Resource

hasTrack
range: Thing
domain: Thing
type: ObjectProperty
comment: Corresponds to 'fragment' in the Ontology for Media Resources with a 'fragment.role' meaning "track".
range: Track
sub property of: hasFragment
inverse of: isTrackOf
type: Property
range: MediaFragment
range: Resource
range: MediaResource
domain: MediaResource
domain: Resource

hasPermissions
range: Thing
domain: Thing
type: ObjectProperty
comment: Corresponds to 'policy' in the Ontology for Media Resources with a 'policy.type' meaning "permissions".
sub property of: hasPolicy
type: Property
range: Resource
domain: MediaResource
domain: Resource

MediaResource
subclass of: Thing
subclass of: Resource
type: Class
comment: An image or an audiovisual media resource, which can be composed of one or more fragment / track.
disjoint with: Rating
disjoint with: TargetAudience
disjoint with: Collection
disjoint with: Agent
disjoint with: Location

hasClassification
range: Thing
domain: Thing
type: ObjectProperty
comment: Corresponds to 'targetAudience.classification' in the Ontology for Media Resources. This property is used to provide a value characterising the target audience.
domain: TargetAudience
type: Property
range: Resource
domain: Resource

hasLanguage
range: Thing
domain: Thing
type: ObjectProperty
comment: Corresponds to 'language' in the Ontology for Media Resources. The language used in the resource. A controlled vocabulary such as defined in BCP 47 SHOULD be used. This property can also be used to identify the presence of sign language (RFC 5646). By inheritance, the hasLanguage property applies indifferently at the media resource / fragment / track levels. Best practice recommends to use to best possible level of granularity fo describe the usage of language within a media resource including at fragment and track levels.
domain: MediaResource
type: Property
range: Resource
domain: Resource

hasAudioDescription
sub property of: hasFragment
range: Thing
domain: Thing
type: ObjectProperty
comment: Corresponds to 'fragment' in the Ontology for Media Resources with a 'fragment.role' meaning "audio-description".
sub property of: hasCaptioning
type: Property
range: MediaFragment
range: Resource
range: MediaResource
domain: MediaResource
domain: Resource

Person
subclass of: Thing
subclass of: Resource
type: Class
comment: A physical person.
subclass of: Agent
disjoint with: Organisation

Rating
subclass of: Resource
type: Class
subclass of: Thing
comment: Information about the rating given to a media resource.
disjoint with: TargetAudience
disjoint with: Location
disjoint with: Collection
disjoint with: MediaResource
disjoint with: Agent

MediaFragment
subclass of: Thing
subclass of: Resource
type: Class
comment: A media fragment (spatial, temporal, track...) composing a media resource. In other ontologies fragment is sometimes referred to as a 'part' or 'segment'.
subclass of: MediaResource

depictsFictionalLocation
range: Thing
domain: Thing
type: ObjectProperty
comment: A subproperty of 'hasRelatedLocation' used to specify where the action depicted in the media is supposed to take place, as opposed to the location where shooting actually took place (see 'createdIn').
sub property of: hasRelatedLocation
inverse of: isFictionalLocationDepictedIn
type: Property
range: Location
range: Resource
domain: MediaResource
domain: Resource

VideoTrack
subclass of: Resource
type: Class
subclass of: Thing
comment: A specialisation of Track for Video to provide a link to specific data properties such as frameRate, etc. Signing is another possible example of video track. Specialisation is defined through object properties.
subclass of: Track
subclass of: MediaResource
subclass of: MediaFragment
disjoint with: DataTrack
disjoint with: AudioTrack

hasTargetAudience
range: Thing
domain: Thing
type: ObjectProperty
comment: Corresponds to 'targetAudience' in the Ontology for Media Resources.
domain: MediaResource
range: TargetAudience
inverse of: isTargetAudienceOf
type: Property
range: Resource
domain: Resource

hasRelatedLocation
range: Thing
domain: Thing
type: ObjectProperty
comment: Corresponds to 'location' in the Ontology for Media Resources. Subproperties are provided to specify, when possible, the relation between the media resource and the location.
domain: MediaResource
range: Location
inverse of: isLocationRelatedTo
type: Property
range: Resource
domain: Resource

Track
subclass of: Resource
type: Class
subclass of: Thing
comment: A specialisation of MediaFragment for audiovisual content.
subclass of: MediaFragment
subclass of: MediaResource

hasSigning
range: Thing
domain: Thing
type: ObjectProperty
comment: Corresponds to 'fragment' in the Ontology for Media Resources with a 'fragment.role' meaning "signing". This property can for example point to a spatial fragment or a VideoTrack. The sign language of the captioning track can be expressed by attaching a 'hasLanguage' property to the specific track.
sub property of: hasFragment
inverse of: isSigningOf
type: Property
range: MediaFragment
range: Resource
range: MediaResource
domain: MediaResource
domain: Resource

hasRelatedImage
range: Thing
domain: Thing
type: ObjectProperty
comment: Corresponds to 'relation' and in the Ontology for Media Resources with a 'relation.type' meaning "related image".
range: Image
sub property of: hasRelatedResource
inverse of: isImageRelatedTo
type: Property
range: Resource
domain: MediaResource
domain: Resource
range: MediaResource

isCopyrightedBy
range: Thing
domain: Thing
type: ObjectProperty
comment: Corresponds to 'copyright.identifier' in the Ontology for Media Resources.
domain: MediaResource
range: Agent
inverse of: hasCopyrightOver
type: Property
range: Resource
domain: Resource

features
range: Thing
domain: Thing
type: ObjectProperty
comment: Corresponds to 'contributor.contributor' in the Ontology for Media Resources with a 'contributor.role' meaning "actor".
range: Person
sub property of: hasContributor
inverse of: playsIn
type: Property
range: Agent
range: Resource
domain: MediaResource
domain: Resource

hasKeyword
range: Thing
domain: Thing
type: ObjectProperty
comment: Corresponds to 'keyword' in the Ontology for Media Resources.
domain: MediaResource
type: Property
range: Resource
domain: Resource

hasCaptioning
range: Thing
domain: Thing
type: ObjectProperty
comment: Corresponds to 'fragment' in the Ontology for Media Resources with a 'fragment.role' meaning "captioning". This property can for example point to a spatial fragment, a VideoTrack or a DataTrack. The language of the captioning track can be expressed by attaching a 'hasLanguage' property to the specific track.
sub property of: hasFragment
inverse of: isCaptioningOf
type: Property
range: MediaFragment
range: Resource
range: MediaResource
domain: MediaResource
domain: Resource

hasAccessConditions
range: Thing
domain: Thing
type: ObjectProperty
comment: Corresponds to 'policy' in the Ontology for Media Resources with a 'policy.type' "access conditions".
sub property of: hasPolicy
type: Property
range: Resource
domain: MediaResource
domain: Resource

hasFormat
range: Thing
domain: Thing
type: ObjectProperty
comment: Corresponds to 'format' in the Ontology for Media Resources.
domain: MediaResource
type: Property
range: Resource
domain: Resource

ratingValue
type: DatatypeProperty
comment: Corresponds to 'rating.value' in the Ontology for Media Resources.
domain: Rating
range: decimal
type: Property
range: Resource
domain: Thing
domain: Resource

mainOriginalTitle
type: DatatypeProperty
comment: Corresponds to 'title.title' in the Ontology for Media Resources with a 'title.type' meaning "original".
sub property of: title
type: Property
domain: MediaResource
domain: Thing
domain: Resource

ma-ont
date: 2013-03-20
type: Ontology
comment: Created by Tobias Buerger, Jean Pierre Evain and Pierre-Antoine Champin with the RDFS Taskforce within the W3C Media Annotation Working Group.
comment: THE CONTENT OF THIS MA-ONT.RDF AND DERIVED MA-ONT.TTL FILES PREVAIL OVER THE SPECIFICATION.
imports: dcelements.rdf
version info: R36

frameSizeUnit
type: DatatypeProperty
comment: Corresponds to 'frameSize.unit' in the Ontology for Media Resources.
domain: MediaResource
type: Property
domain: Thing
domain: Resource

Identifier
type: Property
comment: An unambiguous reference to the resource within a given context.
description: Recommended best practice is to identify the resource by means of a string conforming to a formal identification system.
issued: 1999-07-02
modified: 2008-01-14
has version: identifier-006
note: A second property with the same name as this property has been declared in the dcterms: namespace (http://purl.org/dc/terms/). See the Introduction to the document "DCMI Metadata Terms" (http://dublincore.org/documents/dcmi-terms/) for an explanation.

duration
type: DatatypeProperty
comment: Corresponds to 'duration' in the Ontology for Media Resources.
domain: http://lodlaundromat.org/.well-known/genid/c661c6c25a44257f1d0ba35b5c6c855c#5
range: decimal
type: Property
range: Resource
domain: Thing
domain: http://lodlaundromat.org/.well-known/genid/c661c6c25a44257f1d0ba35b5c6c855c#8
domain: MediaResource
domain: Resource

frameRate
type: DatatypeProperty
comment: Corresponds to 'frameRate' in the Ontology for Media Resources, in frame per second.
domain: MediaResource
range: decimal
type: Property
range: Resource
domain: Thing
domain: Resource

recordDate
type: DatatypeProperty
comment: Corresponds to 'date.date' in the Ontology for Media Resources with a 'date.type' meaning "recordDate".
sub property of: date
type: Property
domain: MediaResource
domain: Thing
domain: Resource

Type
type: Property
comment: The nature or genre of the resource.
description: Recommended best practice is to use a controlled vocabulary such as the DCMI Type Vocabulary [DCMITYPE]. To describe the file format, physical medium, or dimensions of the resource, use the Format element.
issued: 1999-07-02
modified: 2008-01-14
has version: type-006
note: A second property with the same name as this property has been declared in the dcterms: namespace (http://purl.org/dc/terms/). See the Introduction to the document "DCMI Metadata Terms" (http://dublincore.org/documents/dcmi-terms/) for an explanation.

Subject
type: Property
comment: The topic of the resource.
description: Typically, the subject will be represented using keywords, key phrases, or classification codes. Recommended best practice is to use a controlled vocabulary. To describe the spatial or temporal topic of the resource, use the Coverage element.
issued: 1999-07-02
modified: 2008-01-14
has version: subject-006
note: A second property with the same name as this property has been declared in the dcterms: namespace (http://purl.org/dc/terms/). See the Introduction to the document "DCMI Metadata Terms" (http://dublincore.org/documents/dcmi-terms/) for an explanation.

Language
modified: 2008-01-14
note: A second property with the same name as this property has been declared in the dcterms: namespace (http://purl.org/dc/terms/). See the Introduction to the document "DCMI Metadata Terms" (http://dublincore.org/documents/dcmi-terms/) for an explanation.
has version: language-007
description: Recommended best practice is to use a controlled vocabulary such as RFC 4646 [RFC4646].
type: Property
issued: 1999-07-02
comment: A language of the resource.

Format
type: Property
comment: The file format, physical medium, or dimensions of the resource.
description: Examples of dimensions include size and duration. Recommended best practice is to use a controlled vocabulary such as the list of Internet Media Types [MIME].
issued: 1999-07-02
modified: 2008-01-14
has version: format-007
note: A second property with the same name as this property has been declared in the dcterms: namespace (http://purl.org/dc/terms/). See the Introduction to the document "DCMI Metadata Terms" (http://dublincore.org/documents/dcmi-terms/) for an explanation.

locationName
type: DatatypeProperty
comment: Corresponds to 'location.name' in the Ontology for Media Resources.
domain: Location
type: Property
domain: Thing
domain: Resource

copyright
type: DatatypeProperty
comment: Corresponds to 'copyright.copyright' in the Ontology for Media Resources.
domain: MediaResource
type: Property
domain: Thing
domain: Resource

DCMI Namespace for the Dublin Core Metadata Element Set, Version 1.1
comment: To comment on this schema, please contact dcmifb@dublincore.org.
publisher: The Dublin Core Metadata Initiative
modified: 2008-01-14

title
type: DatatypeProperty
comment: Corresponds to 'title.title' in the Ontology for Media Resources. Subproperties can be used to distinguish different values of 'title.type'.
domain: MediaResource
type: Property
domain: Thing
domain: Resource

Description
type: Property
comment: An account of the resource.
description: Description may include but is not limited to: an abstract, a table of contents, a graphical representation, or a free-text account of the resource.
issued: 1999-07-02
modified: 2008-01-14
has version: description-006
note: A second property with the same name as this property has been declared in the dcterms: namespace (http://purl.org/dc/terms/). See the Introduction to the document "DCMI Metadata Terms" (http://dublincore.org/documents/dcmi-terms/) for an explanation.

Publisher
type: Property
comment: An entity responsible for making the resource available.
description: Examples of a Publisher include a person, an organization, or a service. Typically, the name of a Publisher should be used to indicate the entity.
issued: 1999-07-02
modified: 2008-01-14
has version: publisher-006
note: A second property with the same name as this property has been declared in the dcterms: namespace (http://purl.org/dc/terms/). See the Introduction to the document "DCMI Metadata Terms" (http://dublincore.org/documents/dcmi-terms/) for an explanation.

ratingScaleMax
type: DatatypeProperty
comment: Corresponds to 'rating.max' in the Ontology for Media Resources.
domain: Rating
range: decimal
type: Property
range: Resource
domain: Thing
domain: Resource

locationLatitude
type: DatatypeProperty
comment: Corresponds to 'location.latitude' in the Ontology for Media Resources.
domain: Location
range: decimal
type: Property
range: Resource
domain: Thing
domain: Resource

Source
type: Property
comment: A related resource from which the described resource is derived.
description: The described resource may be derived from the related resource in whole or in part. Recommended best practice is to identify the related resource by means of a string conforming to a formal identification system.
issued: 1999-07-02
modified: 2008-01-14
has version: source-006
note: A second property with the same name as this property has been declared in the dcterms: namespace (http://purl.org/dc/terms/). See the Introduction to the document "DCMI Metadata Terms" (http://dublincore.org/documents/dcmi-terms/) for an explanation.

Creator
type: Property
comment: An entity primarily responsible for making the resource.
description: Examples of a Creator include a person, an organization, or a service. Typically, the name of a Creator should be used to indicate the entity.
issued: 1999-07-02
modified: 2008-01-14
has version: creator-006
note: A second property with the same name as this property has been declared in the dcterms: namespace (http://purl.org/dc/terms/). See the Introduction to the document "DCMI Metadata Terms" (http://dublincore.org/documents/dcmi-terms/) for an explanation.

date
type: DatatypeProperty
comment: Corresponds to date.date in the ontology for Media Resources. Subproperties can be used to distinguish different values of 'date.type'. The recommended range is 'xsd:dateTime' (for compliance with OWL2-QL and OWL2-RL) but other time-related datatypes may be used (e.g. 'xsd:gYear', 'xsd:date'...).
domain: MediaResource
type: Property
domain: Thing
domain: Resource

fragmentName
type: DatatypeProperty
comment: Corresponds to 'namedFragment.label' in the Ontology for Media Resources.
domain: MediaFragment
type: Property
domain: Thing
domain: Resource
domain: MediaResource

ratingScaleMin
type: DatatypeProperty
comment: Corresponds to 'rating.min' in the Ontology for Media Resources.
domain: Rating
range: decimal
type: Property
range: Resource
domain: Thing
domain: Resource

releaseDate
type: DatatypeProperty
comment: Corresponds to 'date.date' in the Ontology for Media Resources with a 'date.type' meaning "releaseDate".
sub property of: date
type: Property
domain: MediaResource
domain: Thing
domain: Resource

creationDate
type: DatatypeProperty
comment: Corresponds to 'date.date' in the Ontology for Media Resources with a 'date.type' meaning "creationDate".
sub property of: date
type: Property
domain: MediaResource
domain: Thing
domain: Resource

locationLongitude
type: DatatypeProperty
comment: Corresponds to 'location.longitude' in the Ontology for Media Resources.
domain: Location
range: decimal
type: Property
range: Resource
domain: Thing
domain: Resource

locator
type: DatatypeProperty
comment: Corresponds to 'locator' in the Ontology for Media Resources.
domain: MediaResource
range: anyURI
type: Property
range: Resource
domain: Thing
domain: Resource

Relation
type: Property
comment: A related resource.
description: Recommended best practice is to identify the related resource by means of a string conforming to a formal identification system.
issued: 1999-07-02
modified: 2008-01-14
has version: relation-006
note: A second property with the same name as this property has been declared in the dcterms: namespace (http://purl.org/dc/terms/). See the Introduction to the document "DCMI Metadata Terms" (http://dublincore.org/documents/dcmi-terms/) for an explanation.

frameHeight
type: DatatypeProperty
comment: Corresponds to 'frameSize.height' in the Ontology for Media Resources, measured in frameSizeUnit.
domain: MediaResource
range: integer
type: Property
range: Resource
range: decimal
domain: Thing
domain: Resource

samplingRate
type: DatatypeProperty
comment: Corresponds to 'samplingRate' in the Ontology for Media Resources, in samples per second.
domain: MediaResource
range: decimal
type: Property
range: Resource
domain: Thing
domain: Resource

frameWidth
type: DatatypeProperty
comment: Corresponds to 'frameSize.width' in the Ontology for Media Resources measured in frameSizeUnit.
domain: MediaResource
range: integer
type: Property
range: Resource
range: decimal
domain: Thing
domain: Resource

averageBitRate
type: DatatypeProperty
comment: Corresponds to 'averageBitRate' in the Ontology for Media Resources, expressed in kilobits/second.
domain: http://lodlaundromat.org/.well-known/genid/c661c6c25a44257f1d0ba35b5c6c855c#1
range: decimal
type: Property
range: Resource
domain: Thing
domain: http://lodlaundromat.org/.well-known/genid/c661c6c25a44257f1d0ba35b5c6c855c#4
domain: Resource
domain: MediaResource

Date
has version: date-006
type: AnnotationProperty
description: Date may be used to express temporal information at any level of granularity. Recommended best practice is to use an encoding scheme, such as the W3CDTF profile of ISO 8601 [W3CDTF].
comment: A point or period of time associated with an event in the lifecycle of the resource.
modified: 2008-01-14
note: A second property with the same name as this property has been declared in the dcterms: namespace (http://purl.org/dc/terms/). See the Introduction to the document "DCMI Metadata Terms" (http://dublincore.org/documents/dcmi-terms/) for an explanation.
issued: 1999-07-02
type: Property

locationAltitude
type: DatatypeProperty
comment: Corresponds to 'location.altitude' in the Ontology for Media Resources.
domain: Location
range: decimal
type: Property
range: Resource
domain: Thing
domain: Resource

collectionName
type: DatatypeProperty
comment: The name by which a collection (e.g. series) is known.
domain: Collection
type: Property
domain: Thing
domain: Resource

editDate
type: DatatypeProperty
comment: Corresponds to 'date.date' in the Ontology for Media Resources with a 'date.type' meaning "editDate".
sub property of: date
type: Property
domain: MediaResource
domain: Thing
domain: Resource

alternativeTitle
type: DatatypeProperty
comment: Corresponds to 'title.title' in the Ontology for Media Resources with a 'title.type' meaning "alternative".
sub property of: title
type: Property
domain: MediaResource
domain: Thing
domain: Resource

numberOfTracks
type: DatatypeProperty
comment: Corresponds to 'numTracks.number' in the Ontology for Media Resources. Subproperties can be used to distinguish different values of 'numTracks.type'.
domain: MediaResource
range: integer
type: Property
range: Resource
range: decimal
domain: Thing
domain: Resource

description
type: DatatypeProperty
comment: Corresponds to 'description' in the Ontology for Media Resources. This can be specialised by using sub-properties e.g. 'summary' or 'script'.
domain: MediaResource
type: Property
domain: Thing
domain: Resource

Contributor
type: Property
comment: An entity responsible for making contributions to the resource.
description: Examples of a Contributor include a person, an organization, or a service. Typically, the name of a Contributor should be used to indicate the entity.
issued: 1999-07-02
modified: 2008-01-14
has version: contributor-006
note: A second property with the same name as this property has been declared in the dcterms: namespace (http://purl.org/dc/terms/). See the Introduction to the document "DCMI Metadata Terms" (http://dublincore.org/documents/dcmi-terms/) for an explanation.

Coverage
type: Property
comment: The spatial or temporal topic of the resource, the spatial applicability of the resource, or the jurisdiction under which the resource is relevant.
description: Spatial topic and spatial applicability may be a named place or a location specified by its geographic coordinates. Temporal topic may be a named period, date, or date range. A jurisdiction may be a named administrative entity or a geographic place to which the resource applies. Recommended best practice is to use a controlled vocabulary such as the Thesaurus of Geographic Names [TGN]. Where appropriate, named places or time periods can be used in preference to numeric identifiers such as sets of coordinates or date ranges.
issued: 1999-07-02
modified: 2008-01-14
has version: coverage-006
note: A second property with the same name as this property has been declared in the dcterms: namespace (http://purl.org/dc/terms/). See the Introduction to the document "DCMI Metadata Terms" (http://dublincore.org/documents/dcmi-terms/) for an explanation.

Rights
type: Property
comment: Information about rights held in and over the resource.
description: Typically, rights information includes a statement about various property rights associated with the resource, including intellectual property rights.
issued: 1999-07-02
modified: 2008-01-14
has version: rights-006
note: A second property with the same name as this property has been declared in the dcterms: namespace (http://purl.org/dc/terms/). See the Introduction to the document "DCMI Metadata Terms" (http://dublincore.org/documents/dcmi-terms/) for an explanation.

Title
type: Property
comment: A name given to the resource.
issued: 1999-07-02
modified: 2008-01-14
has version: title-006
note: A second property with the same name as this property has been declared in the dcterms: namespace (http://purl.org/dc/terms/). See the Introduction to the document "DCMI Metadata Terms" (http://dublincore.org/documents/dcmi-terms/) for an explanation.

trackName
type: DatatypeProperty
comment: Corresponds to 'fragment.name' in the Ontology for Media Resources, for Track fragments.
domain: Track
sub property of: fragmentName
type: Property
domain: MediaFragment
domain: Thing
domain: Resource
domain: MediaResource