http://lodlaundromat.org/.well-known/genid/c3074a80b58a81f7205d2d00d1cf1112#2
subclass of: Resource
subclass of: Thing
type: Class
type: Restriction
min cardinality: 0
on property: feature of interest
subclass of: http://lodlaundromat.org/.well-known/genid/c3074a80b58a81f7205d2d00d1cf1112#3

procedure
range: Thing
domain: Thing
sub property of: related
type: ObjectProperty
comment: link to procedure or sensor system used in making observation or estimate of property value
domain: Property kind
sub property of: procedure
sub property of: constraint
type: Property
range: http://lodlaundromat.org/.well-known/genid/c3074a80b58a81f7205d2d00d1cf1112#3
range: Resource
domain: http://lodlaundromat.org/.well-known/genid/c3074a80b58a81f7205d2d00d1cf1112#3
domain: Resource
domain: http://lodlaundromat.org/.well-known/genid/c3074a80b58a81f7205d2d00d1cf1112#2
domain: EnumeratedValue
domain: http://lodlaundromat.org/.well-known/genid/c3074a80b58a81f7205d2d00d1cf1112#5
domain: http://lodlaundromat.org/.well-known/genid/c3074a80b58a81f7205d2d00d1cf1112#1
domain: http://lodlaundromat.org/.well-known/genid/c3074a80b58a81f7205d2d00d1cf1112#4
domain: Concept

http://lodlaundromat.org/.well-known/genid/c3074a80b58a81f7205d2d00d1cf1112#5
subclass of: Resource
subclass of: Thing
type: Class
type: Restriction
min cardinality: 0
on property: constraint
subclass of: http://lodlaundromat.org/.well-known/genid/c3074a80b58a81f7205d2d00d1cf1112#3

property kind
range: Thing
domain: Thing
type: ObjectProperty
range: Property kind
sub property of: observedProperty
sub property of: related
type: Property
range: http://lodlaundromat.org/.well-known/genid/c3074a80b58a81f7205d2d00d1cf1112#4
range: http://lodlaundromat.org/.well-known/genid/c3074a80b58a81f7205d2d00d1cf1112#3
range: Resource
range: http://lodlaundromat.org/.well-known/genid/c3074a80b58a81f7205d2d00d1cf1112#5
range: http://lodlaundromat.org/.well-known/genid/c3074a80b58a81f7205d2d00d1cf1112#2
range: http://lodlaundromat.org/.well-known/genid/c3074a80b58a81f7205d2d00d1cf1112#1
range: Concept
range: EnumeratedValue
domain: http://lodlaundromat.org/.well-known/genid/c3074a80b58a81f7205d2d00d1cf1112#3
domain: Resource

applicable vocabulary
range: Thing
domain: Thing
type: ObjectProperty
comment: Set of terms or concepts from which the value must be drawn. This may be implemented as a skos:ConceptScheme or skos:Collection Compare with QUDT2 'applicable unit'
domain: Quality Kind
type: Property
range: http://lodlaundromat.org/.well-known/genid/c3074a80b58a81f7205d2d00d1cf1112#3
range: Resource
domain: http://lodlaundromat.org/.well-known/genid/c3074a80b58a81f7205d2d00d1cf1112#4
domain: http://lodlaundromat.org/.well-known/genid/c3074a80b58a81f7205d2d00d1cf1112#3
domain: Resource
domain: http://lodlaundromat.org/.well-known/genid/c3074a80b58a81f7205d2d00d1cf1112#5
domain: http://lodlaundromat.org/.well-known/genid/c3074a80b58a81f7205d2d00d1cf1112#2
domain: http://lodlaundromat.org/.well-known/genid/c3074a80b58a81f7205d2d00d1cf1112#1
domain: http://lodlaundromat.org/.well-known/genid/c3074a80b58a81f7205d2d00d1cf1112#6
domain: Property kind
domain: Concept
domain: EnumeratedValue

substance
subclass of: Resource
subclass of: Thing
type: Class
subclass of: Substance or Taxon
subclass of: http://lodlaundromat.org/.well-known/genid/c3074a80b58a81f7205d2d00d1cf1112#3
subclass of: EnumeratedValue
subclass of: Concept

Property kind
subclass of: Thing
type: Class
subclass of: Resource
subclass of: http://lodlaundromat.org/.well-known/genid/c3074a80b58a81f7205d2d00d1cf1112#2
subclass of: http://lodlaundromat.org/.well-known/genid/c3074a80b58a81f7205d2d00d1cf1112#3
comment: Superclass of qudt:QuantityKind This class accommodates all kinds of properties, including those (qualities) that are not described by quantities (numeric values). May carry an objectOfInterest property, to point to the substance or taxon with which the property is associated - e.g. tree-height, organism-count, nitrogen-concentration
subclass of: EnumeratedValue
subclass of: http://lodlaundromat.org/.well-known/genid/c3074a80b58a81f7205d2d00d1cf1112#5
subclass of: http://lodlaundromat.org/.well-known/genid/c3074a80b58a81f7205d2d00d1cf1112#1
subclass of: http://lodlaundromat.org/.well-known/genid/c3074a80b58a81f7205d2d00d1cf1112#4
subclass of: Concept

object of interest
range: Thing
domain: Thing
sub property of: related
type: ObjectProperty
comment: In an observable property definition, the object-of-interest constrains the substance or taxon involved in a count, concentration, presence, or other simialr property.
domain: Property kind
range: Substance or Taxon
sub property of: constraint
type: Property
range: http://lodlaundromat.org/.well-known/genid/c3074a80b58a81f7205d2d00d1cf1112#3
range: Resource
domain: http://lodlaundromat.org/.well-known/genid/c3074a80b58a81f7205d2d00d1cf1112#3
domain: Resource
domain: http://lodlaundromat.org/.well-known/genid/c3074a80b58a81f7205d2d00d1cf1112#2
domain: EnumeratedValue
domain: http://lodlaundromat.org/.well-known/genid/c3074a80b58a81f7205d2d00d1cf1112#5
domain: http://lodlaundromat.org/.well-known/genid/c3074a80b58a81f7205d2d00d1cf1112#1
domain: http://lodlaundromat.org/.well-known/genid/c3074a80b58a81f7205d2d00d1cf1112#4
domain: Concept
range: Concept
range: EnumeratedValue

taxon
subclass of: Resource
subclass of: Thing
type: Class
subclass of: Substance or Taxon
subclass of: http://lodlaundromat.org/.well-known/genid/c3074a80b58a81f7205d2d00d1cf1112#3
subclass of: EnumeratedValue
subclass of: Concept

http://lodlaundromat.org/.well-known/genid/c3074a80b58a81f7205d2d00d1cf1112#6
subclass of: Resource
subclass of: Thing
type: Class
type: Restriction
min cardinality: 0
on property: applicable vocabulary
subclass of: http://lodlaundromat.org/.well-known/genid/c3074a80b58a81f7205d2d00d1cf1112#3

matrix
sub property of: related
range: Thing
domain: Thing
sub property of: constraint
sub property of: featureOfInterest
type: ObjectProperty
comment: In an observable property definition, the matrix is a special case of a feature-of-interest that provides the context (container feeaure or medium) for an observable property.
sub property of: feature of interest
type: Property
range: http://lodlaundromat.org/.well-known/genid/c3074a80b58a81f7205d2d00d1cf1112#3
range: Resource
domain: Property kind
domain: http://lodlaundromat.org/.well-known/genid/c3074a80b58a81f7205d2d00d1cf1112#3
domain: Resource
domain: http://lodlaundromat.org/.well-known/genid/c3074a80b58a81f7205d2d00d1cf1112#2
domain: EnumeratedValue
domain: http://lodlaundromat.org/.well-known/genid/c3074a80b58a81f7205d2d00d1cf1112#5
domain: http://lodlaundromat.org/.well-known/genid/c3074a80b58a81f7205d2d00d1cf1112#1
domain: http://lodlaundromat.org/.well-known/genid/c3074a80b58a81f7205d2d00d1cf1112#4
domain: Concept

CAS Number
type: Class
subclass of: http://lodlaundromat.org/.well-known/genid/c3074a80b58a81f7205d2d00d1cf1112#9
type: Datatype
subclass of: Resource
equivalent class: http://lodlaundromat.org/.well-known/genid/c3074a80b58a81f7205d2d00d1cf1112#9

http://lodlaundromat.org/.well-known/genid/c3074a80b58a81f7205d2d00d1cf1112#4
subclass of: Resource
subclass of: Thing
type: Class
type: Restriction
min cardinality: 0
on property: procedure
subclass of: http://lodlaundromat.org/.well-known/genid/c3074a80b58a81f7205d2d00d1cf1112#3

Substance or Taxon
subclass of: Resource
subclass of: Thing
type: Class
comment: Class of stuff and things, individuals of which identify a class of stuff and things that make observed properties concrete.
subclass of: EnumeratedValue
subclass of: http://lodlaundromat.org/.well-known/genid/c3074a80b58a81f7205d2d00d1cf1112#3
subclass of: Concept

constraint
range: Thing
domain: Thing
type: ObjectProperty
comment: Constraint that refines the definition of an abservable property definition. This may include concerns such as realm of application, substance or taxon involved, applicable units or vocabulary.
domain: Property kind
sub property of: related
type: Property
range: http://lodlaundromat.org/.well-known/genid/c3074a80b58a81f7205d2d00d1cf1112#3
range: Resource
domain: http://lodlaundromat.org/.well-known/genid/c3074a80b58a81f7205d2d00d1cf1112#4
domain: http://lodlaundromat.org/.well-known/genid/c3074a80b58a81f7205d2d00d1cf1112#3
domain: Resource
domain: http://lodlaundromat.org/.well-known/genid/c3074a80b58a81f7205d2d00d1cf1112#5
domain: http://lodlaundromat.org/.well-known/genid/c3074a80b58a81f7205d2d00d1cf1112#2
domain: http://lodlaundromat.org/.well-known/genid/c3074a80b58a81f7205d2d00d1cf1112#1
domain: Concept
domain: EnumeratedValue

feature of interest
sub property of: related
range: Thing
domain: Thing
type: ObjectProperty
comment: In an observable property definition, the feature-of-interest constrains the feature realm that the property is associated with.
domain: Property kind
sub property of: featureOfInterest
sub property of: constraint
type: Property
range: http://lodlaundromat.org/.well-known/genid/c3074a80b58a81f7205d2d00d1cf1112#3
range: Resource
domain: http://lodlaundromat.org/.well-known/genid/c3074a80b58a81f7205d2d00d1cf1112#3
domain: Resource
domain: http://lodlaundromat.org/.well-known/genid/c3074a80b58a81f7205d2d00d1cf1112#2
domain: EnumeratedValue
domain: http://lodlaundromat.org/.well-known/genid/c3074a80b58a81f7205d2d00d1cf1112#5
domain: http://lodlaundromat.org/.well-known/genid/c3074a80b58a81f7205d2d00d1cf1112#1
domain: http://lodlaundromat.org/.well-known/genid/c3074a80b58a81f7205d2d00d1cf1112#4
domain: Concept

quality kind
sub property of: observedProperty
sub property of: related
range: Thing
domain: Thing
type: ObjectProperty
range: Quality Kind
sub property of: property kind
property disjoint with: quantityKind
type: Property
range: Property kind
range: http://lodlaundromat.org/.well-known/genid/c3074a80b58a81f7205d2d00d1cf1112#3
range: Resource
range: http://lodlaundromat.org/.well-known/genid/c3074a80b58a81f7205d2d00d1cf1112#2
range: EnumeratedValue
range: http://lodlaundromat.org/.well-known/genid/c3074a80b58a81f7205d2d00d1cf1112#5
range: http://lodlaundromat.org/.well-known/genid/c3074a80b58a81f7205d2d00d1cf1112#1
range: http://lodlaundromat.org/.well-known/genid/c3074a80b58a81f7205d2d00d1cf1112#4
range: Concept
domain: http://lodlaundromat.org/.well-known/genid/c3074a80b58a81f7205d2d00d1cf1112#3
domain: Resource
range: http://lodlaundromat.org/.well-known/genid/c3074a80b58a81f7205d2d00d1cf1112#6

http://lodlaundromat.org/.well-known/genid/c3074a80b58a81f7205d2d00d1cf1112#7
subclass of: Resource
subclass of: Thing
type: Class
type: Restriction
min cardinality: 1
on property: unit
subclass of: http://lodlaundromat.org/.well-known/genid/c3074a80b58a81f7205d2d00d1cf1112#3

Scaled Quantity Kind
subclass of: Thing
subclass of: Resource
subclass of: QuantityKind
type: Class
comment: Scaled quantity kind has one or more unit properties, which indicate valid units of measure for this quantity kind. It is likely that this class is equivalent to qudt:QuantityKind, but has been declared independently for governance of the attached qudt:unit property
subclass of: Property kind
subclass of: http://lodlaundromat.org/.well-known/genid/c3074a80b58a81f7205d2d00d1cf1112#7
subclass of: http://lodlaundromat.org/.well-known/genid/c3074a80b58a81f7205d2d00d1cf1112#8
disjoint with: Quality Kind
equivalent class: QuantityKind
subclass of: http://lodlaundromat.org/.well-known/genid/c3074a80b58a81f7205d2d00d1cf1112#3
subclass of: http://lodlaundromat.org/.well-known/genid/c3074a80b58a81f7205d2d00d1cf1112#2
subclass of: http://lodlaundromat.org/.well-known/genid/c3074a80b58a81f7205d2d00d1cf1112#4
subclass of: http://lodlaundromat.org/.well-known/genid/c3074a80b58a81f7205d2d00d1cf1112#5
subclass of: http://lodlaundromat.org/.well-known/genid/c3074a80b58a81f7205d2d00d1cf1112#1
subclass of: Concept
subclass of: EnumeratedValue

Quality Kind
subclass of: Resource
subclass of: Thing
type: Class
comment: non-numeric PropertyKind
subclass of: Property kind
subclass of: http://lodlaundromat.org/.well-known/genid/c3074a80b58a81f7205d2d00d1cf1112#6
disjoint with: Scaled Quantity Kind
subclass of: http://lodlaundromat.org/.well-known/genid/c3074a80b58a81f7205d2d00d1cf1112#1
subclass of: http://lodlaundromat.org/.well-known/genid/c3074a80b58a81f7205d2d00d1cf1112#5
subclass of: http://lodlaundromat.org/.well-known/genid/c3074a80b58a81f7205d2d00d1cf1112#3
subclass of: http://lodlaundromat.org/.well-known/genid/c3074a80b58a81f7205d2d00d1cf1112#4
subclass of: http://lodlaundromat.org/.well-known/genid/c3074a80b58a81f7205d2d00d1cf1112#2
subclass of: EnumeratedValue
subclass of: Concept

CAS Number
type: DatatypeProperty
domain: Substance or Taxon
range: CAS Number
sub property of: notation
type: Property
range: http://lodlaundromat.org/.well-known/genid/c3074a80b58a81f7205d2d00d1cf1112#9
range: Resource
domain: Thing
domain: http://lodlaundromat.org/.well-known/genid/c3074a80b58a81f7205d2d00d1cf1112#3
domain: Resource
domain: Concept
domain: EnumeratedValue

http://lodlaundromat.org/.well-known/genid/c3074a80b58a81f7205d2d00d1cf1112#10
pattern: [0-9]+\-[0-9]+\-[0-9]+

Observable properties
has part: Scaled Quantity Kind
license: http://creativecommons.org/licenses/by/3.0/
imports: core
has part: Property kind
has part: procedure
preferred namespace prefix: op
creator: Simon J D Cox
type: Vocabulary
imports: quantity
has part: object of interest
vocabulary: qudt
creator: Bruce A Simons
has part: constraint
publisher: CSIRO
type: Ontology
imports: vann
has part: quality kind
has part: applicable vocabulary
imports: void
imports: voaf
modified: 2014-02-02
has part: Substance or Taxon
description: A general purpose ontology for observable properties. The ontology supports description of both qualitative and quantitative properties. The allowed scale or units of measure may be specified. A property may be linked to substances-or-taxa and to features or realms, if they play a role in the definition.
has part: Quality Kind
preferred namespace uri: http://environment.data.gov.au/def/op#
has part: matrix
created: 2013
creator: Jonathan Yu
extends: qudt
uri space: http://environment.data.gov.au/def/op#
comment: A general purpose ontology for observable properties. The ontology supports description of both qualitative and quantitative properties. The allowed scale or units of measure may be specified. A property may be linked to substances-or-taxa and to features or realms, if they play a role in the definition. This ontology was developed to enable publication of a vocabulary of water quality properties for the Bioregional Assessments and eReefs projects. This ontology extends the QUDT schema. Some key classes and properties are linked to SKOS, so that instances of an observable-property vocabulary are implicitly also SKOS concepts, and may be accessed through general purpose vocabulary APIs based on SKOS.
rights: Copyright © 2012-2013 CSIRO
publisher: AGIMO
label: Observable-Properties ontology
has part: feature of interest
imports: http://purl.org/dc/elements/1.1/
has part: property kind