Description
domain: Thing
type: ObjectProperty
comment: General description of a person's activities. Use to describe something that does not fit into a Stage.
comment: 人の活動の一般的な記述。stage、career、planの上位プロパティ。一つのステージに収まらない事項を記述するためにも使える
domain: Person
range: Thing
type: Property
domain: Resource
range: Resource

Where
range: Thing
domain: Thing
type: ObjectProperty
comment: Place which relates to a stage of life. The range is whois:Place to have structured description. Use bio:place for literal value
comment: あるステージの場所を記述する
domain: Stage
range: Place
type: Property
domain: Resource
range: Resource
range: SpatialThing

Honor
range: Thing
domain: Thing
sub property of: Description
type: ObjectProperty
comment: an honor that one has been rewarded.
comment: 顕彰歴を記述する。careerのサブプロパティ
sub property of: Career
type: Property
range: Resource
domain: Person
domain: Resource

Professional Career
sub property of: Description
range: Thing
domain: Thing
type: ObjectProperty
comment: a professional or business career in one's personal history.
comment: 職歴を記述する。careerのサブプロパティ
range: Job (stage)
sub property of: Career
type: Property
range: Resource
domain: Person
domain: Resource
range: Stage

What
domain: Thing
type: ObjectProperty
comment: Specifies a topic in a stage of life. The range is owl:Thing to have structured description. Use dc:description for literal description, or dc:subject for keywords.
comment: あるステージを特徴付けるトピックを記述する（目的語はリテラルではないことに注意）
domain: Stage
range: Thing
sub property of: topic
type: Property
range: Resource
domain: Resource

Achievement
sub property of: Description
range: Thing
domain: Thing
type: ObjectProperty
comment: a one's achievement in general. Note you can use foaf:pastProject for a specific achievement.
comment: 業績を記述する。careerのサブプロパティ
sub property of: Career
type: Property
range: Resource
domain: Person
domain: Resource

Educaton (stage)
subclass of: Resource
subclass of: Thing
type: Class
comment: A period of education in one's academic career, as a stage of life. NOT an activity of learning.
comment: ライフステージ中での、学業期間。学歴を表す
subclass of: Stage

Academic Career
sub property of: Description
range: Thing
domain: Thing
type: ObjectProperty
comment: an educational career in one's personal history.
comment: 学歴を記述する。careerのサブプロパティ
range: Educaton (stage)
sub property of: Career
type: Property
range: Resource
domain: Person
domain: Resource
range: Stage

Born
sub property of: When
sub property of: dtstart
type: DatatypeProperty
comment: One's birthday. This can be used in place of 'whois:since' where the 'whois:Stage' is one's first stage.
comment: 誕生日を記述する。sinceのサブプロパティ（人生の最初のステージの始まり）
sub property of: Since
type: Property
range: Literal
range: Resource
domain: Stage
domain: Thing
domain: Resource

Publication
range: Thing
domain: Thing
type: ObjectProperty
comment: a one's publication in general. Note foaf:publications describes publication list page.
comment: 出版物、論文を記述する。descriptionのサブプロパティ
sub property of: Description
type: Property
range: Resource
domain: Person
domain: Resource

Place
subclass of: Resource
subclass of: Thing
type: Class
comment: A place -- this can be the domain of both contact: vocab and geo: vocab.
comment: 場所を表すクラス
subclass of: SpatialThing

Plan
range: Thing
domain: Thing
type: ObjectProperty
comment: General description of a person's future activities. Note past activity can be described with #career.
comment: 人の将来の活動予定を記述する
sub property of: Description
type: Property
range: Resource
domain: Person
domain: Resource

Career
range: Thing
domain: Thing
type: ObjectProperty
comment: A job, education or any achievement in one's life, which can be specific to a stage of life (object = #Stage) or in general (object = any).
comment: 人生における職業、教育、業績などを記述する
sub property of: Description
type: Property
range: Resource
domain: Person
domain: Resource

Stage
subclass of: Thing
subclass of: Resource
type: Class
comment: A stage of life. A distinct time period in a sequence of one's life cycle.
comment: 人生のあるステージ。人のライフサイクルの中での、はっきりと区切られる一時期

Stage
range: Thing
domain: Thing
type: ObjectProperty
comment: Describes an aspect of one's personal history.
comment: 人の履歴のにおけるある切り口を記述する
range: Stage
sub property of: Description
type: Property
range: Resource
domain: Person
domain: Resource

Job (stage)
subclass of: Resource
subclass of: Thing
type: Class
comment: A period of job in one's professional career, as a stage of life. NOT an activity of working.
comment: ライフステージ中でのある職業の期間。職歴を表す
subclass of: Stage

http://lodlaundromat.org/.well-known/genid/b976fe48402205a62f4a76e99f0eed56#2
code: <whois:stage> <whois:Stage> <whois:since>1987</whois:since> <whois:until>1989</whois:until> <whois:where> <whois:Place geo:lat="40.794" geo:long="-73.972"> <contact:country>U.S.A.</contact:country> <contact:city>New York</contact:city> </whois:Place> </whois:where> <whois:what> <wn:School> <foaf:homepage rdf:resource="http://www.columbia.edu/cu/business/"/> </wn:School> </whois:what> </whois:Stage> </whois:stage>
example of: Who's who description vocabulary
type: Example
comment: A structured description of a stage of one's life. Note properties from contact: and geo: vocabulary can be used with whois:Place.
comment: whois:where、whois:whatの内容にほかの語彙を含む構造的な記述を利用した例。

http://lodlaundromat.org/.well-known/genid/b976fe48402205a62f4a76e99f0eed56#1
code: <foaf:Person> <foaf:name>Masahide Kanzaki</foaf:name> <whois:stage rdf:parseType='Resource'> <whois:place>Tokyo, Japan</whois:place> <whois:since>1982</whois:since> </whois:stage> <whois:stage rdf:parseType='Resource'> <whois:place>Suzuka, Mie, Japan</whois:place> <whois:born>1960</whois:born> <whois:until>1978</whois:until> </whois:stage> </foaf:Person>
example of: Who's who description vocabulary
pfx: whois:
type: Example
comment: Simple, unstructured description. Class tags 'whois:Stage' are omitted by using rdf:parseType='Resource', and 'whois:place' property is used instead of 'whois:where' to have literal values). Note the 'whois:born' (instead of 'whois:since') implies (the omitted 'whois:Stage' is) one's first stage of life, and the stage without 'whois:until' denotes the current phase.
comment: 最もシンプルな例（rdf:parseType='Resource'を用いて'whois:Stage'も省略）。場所を単なるリテラルとするためにwhois:placeを用いている。whois:bornを持つwhois:Stageは出身地での人生の最初のステージを示す。また、whois:untilのないwhois:Stageは現在のステージ。

Who's who description vocabulary
created: 2003-07-08
creator: 神崎正英
modified: 2012-09-16
type: Ontology
comment: An experimental vocabulary to describe a person's profile/history. Properties 'whois:stage' describe one's stage of life (whois:Stage). Similar to Ian Davis' BIO: vocab, however, while BIO: describes events on specific dates, this vocabulary uses whois:since/whois:until so that it can describe a period of time. This also includes such properties as career or honor to be used as a personal resume. Examples included in this document.
comment: プロフィールを記述するための実験ボキャブラリ。Ian DavisのBIO: vocabと似ていますが、BIO:がEventという単位を基本に特定の日を記述するのに対し、こちらはライフサイクルのステージという概念で期間も記述できるようにしています。career, honorといったプロパティは、履歴メタデータの記述にも使えます。
imports: dliser.rdf
version info: Version 0.5.4. added whois:publication.

神崎正英
type: Person

When
type: DatatypeProperty
comment: date/time which is related to a stage of life. Super property of since and until. W3C-DTF format value is assumed (i.e. can be yyyy, yyyy-mm, yyyy-mm-dd etc).
comment: あるステージの時期を記述するための上位プロパティ
domain: Stage
range: Literal
type: Property
domain: Thing
domain: Resource
range: Resource

Place
type: DatatypeProperty
comment: Place which relates to a stage of life. Literal version of 'where'. ":x whois:place 'y'." implies ":x whois:where [rdfs:label 'y'].".
comment: あるステージの場所をリテラルとして記述する
domain: Stage
type: Property
domain: Thing
domain: Resource

Until
type: DatatypeProperty
comment: date when a stage of life ended.
comment: あるステージが終わったときを記述する。whenのサブプロパティ
sub property of: When
sub property of: dtend
type: Property
range: Literal
range: Resource
domain: Stage
domain: Thing
domain: Resource

Since
type: DatatypeProperty
comment: date when a stage of life started.
comment: あるステージが始まったときを記述する。whenのサブプロパティ
sub property of: When
sub property of: dtstart
type: Property
range: Literal
range: Resource
domain: Stage
domain: Thing
domain: Resource

http://lodlaundromat.org/.well-known/genid/b976fe48402205a62f4a76e99f0eed56#3
code: <foaf:Person> <foaf:name>Masahide Kanzaki</foaf:name> <foaf:homepage rdf:resource="http://www.kanzaki.com/"/> <whois:stage whois:born="1960" rdfs:label="Suzuka, Mie, Japan"/> <whois:career> <whois:Education> <rdfs:label>Columbia Business School</rdfs:label> <whois:since>1987</whois:since> <whois:until>1989</whois:until> </whois:Education> </whois:career> <whois:career> <whois:Job> <rdfs:label>A virtual corporation</rdfs:label> <whois:since>1989</whois:since> <whois:until>2002</whois:until> </whois:Job> </whois:career> <whois:professionalCareer rdf:parseType="Resource"> <rdfs:label>Keio University</rdfs:label> <whois:since>2003</whois:since> </whois:professionalCareer> </foaf:Person>
example of: Who's who description vocabulary
type: Example
comment: 'whois:career'プロパティと'whois:Education', 'whois:Job'クラスを使って、履歴メタデータを記述する例。これらはサブプロパティ'whois:academicCareer'および'whois:professionalCareer'によってクラスを暗黙的に示すこともできる。
comment: Combined with other FOAF vocabularies, we can make a personal resume as a metadata. A career can be described with 'whois:career' property + 'whois:Education' or 'whois:Job' class, or sub properties 'whois:academicCareer' and 'whois:professionalCareer' that denote appropriate classes as range.