is role in
range: Thing
domain: Thing
type: InverseFunctionalProperty
type: ObjectProperty
comment: The property relating the definition of a specific role to the situation of an agent holding that role.
domain: role
range: role in time
sub property of: hasTimeIndexedSetting
inverse of: with role
type: Property
domain: Resource
range: Resource
range: http://lodlaundromat.org/.well-known/genid/ae02cc16831f9433d7ffd24b36c29bf2#6
range: http://lodlaundromat.org/.well-known/genid/ae02cc16831f9433d7ffd24b36c29bf2#1
range: http://lodlaundromat.org/.well-known/genid/b8d55434cac930bd810a300af19dc61f#1
range: http://lodlaundromat.org/.well-known/genid/b8d55434cac930bd810a300af19dc61f#7
range: http://lodlaundromat.org/.well-known/genid/ae02cc16831f9433d7ffd24b36c29bf2#2
range: value in time
range: TimeIndexedSituation
range: http://lodlaundromat.org/.well-known/genid/b8d55434cac930bd810a300af19dc61f#8
range: http://lodlaundromat.org/.well-known/genid/b8d55434cac930bd810a300af19dc61f#6
range: http://lodlaundromat.org/.well-known/genid/b8d55434cac930bd810a300af19dc61f#9

relates to organization
sub property of: within context
sub property of: forEntity
range: Thing
domain: Thing
inverse of: is organization context for
type: ObjectProperty
comment: A property relating a time-indexed situation to an organization that represents the context for that situation (e.g. relating the role of member to the institution of which that person is a member).
range: (foaf) Organization
sub property of: relates to
type: Property
domain: Resource
domain: value in time
domain: TimeIndexedSituation
domain: http://lodlaundromat.org/.well-known/genid/ae02cc16831f9433d7ffd24b36c29bf2#1
domain: http://lodlaundromat.org/.well-known/genid/ae02cc16831f9433d7ffd24b36c29bf2#2
domain: http://lodlaundromat.org/.well-known/genid/ae02cc16831f9433d7ffd24b36c29bf2#6
domain: role in time
domain: http://lodlaundromat.org/.well-known/genid/b8d55434cac930bd810a300af19dc61f#6
domain: http://lodlaundromat.org/.well-known/genid/b8d55434cac930bd810a300af19dc61f#7
domain: http://lodlaundromat.org/.well-known/genid/b8d55434cac930bd810a300af19dc61f#8
domain: http://lodlaundromat.org/.well-known/genid/b8d55434cac930bd810a300af19dc61f#9
domain: http://lodlaundromat.org/.well-known/genid/b8d55434cac930bd810a300af19dc61f#1
range: Resource
range: http://lodlaundromat.org/.well-known/genid/9d396f826af70bb26e6c953fbd3fce0b#23
range: http://lodlaundromat.org/.well-known/genid/9d396f826af70bb26e6c953fbd3fce0b#1
range: (foaf) Agent
range: http://lodlaundromat.org/.well-known/genid/9d396f826af70bb26e6c953fbd3fce0b#6
range: http://lodlaundromat.org/.well-known/genid/9d396f826af70bb26e6c953fbd3fce0b#13
range: http://lodlaundromat.org/.well-known/genid/9d396f826af70bb26e6c953fbd3fce0b#18

at time
range: Thing
domain: Thing
type: FunctionalProperty
type: ObjectProperty
comment: A time interval during which a role is held or a contribution is made by an agent.
type: Property
range: Resource
domain: Resource

publishing role
subclass of: Resource
type: Class
subclass of: Thing
comment: A role an agent may have with respect to the publishing process. Individual members of this class are used to specify particular roles.
subclass of: role

(foaf) OnlineAccount
subclass of: Resource
type: Class
subclass of: Thing
subclass of: http://lodlaundromat.org/.well-known/genid/9d396f826af70bb26e6c953fbd3fce0b#6
subclass of: http://lodlaundromat.org/.well-known/genid/9d396f826af70bb26e6c953fbd3fce0b#23
subclass of: http://lodlaundromat.org/.well-known/genid/9d396f826af70bb26e6c953fbd3fce0b#10
nsterm status: unstable
comment: An online account.
disjoint with: (foaf) Agent
disjoint with: (foaf) Document
disjoint with: (foaf) Project

with role
inverse of: is role in
range: Thing
domain: Thing
sub property of: forEntity
type: FunctionalProperty
type: ObjectProperty
comment: An object property connecting an agent's role in time to a definition of the type of role held by this agent, specified as an instance of the class pro:Role or of one of its sub-classes.
domain: role in time
range: role
sub property of: with value
type: Property
domain: Resource
domain: value in time
domain: TimeIndexedSituation
domain: http://lodlaundromat.org/.well-known/genid/ae02cc16831f9433d7ffd24b36c29bf2#1
domain: http://lodlaundromat.org/.well-known/genid/ae02cc16831f9433d7ffd24b36c29bf2#2
domain: http://lodlaundromat.org/.well-known/genid/ae02cc16831f9433d7ffd24b36c29bf2#6
range: Resource
domain: http://lodlaundromat.org/.well-known/genid/b8d55434cac930bd810a300af19dc61f#6
domain: http://lodlaundromat.org/.well-known/genid/b8d55434cac930bd810a300af19dc61f#7
domain: http://lodlaundromat.org/.well-known/genid/b8d55434cac930bd810a300af19dc61f#8
domain: http://lodlaundromat.org/.well-known/genid/b8d55434cac930bd810a300af19dc61f#1
domain: http://lodlaundromat.org/.well-known/genid/b8d55434cac930bd810a300af19dc61f#9

at time
range: Thing
domain: Thing
comment: It specifies the particular temporal instant or time period in which the situation takes place.
domain: value in time
sub property of: isSettingFor
range: TemporalEntity
type: ObjectProperty
type: Property
range: Resource
domain: Resource
domain: http://lodlaundromat.org/.well-known/genid/ae02cc16831f9433d7ffd24b36c29bf2#1
domain: http://lodlaundromat.org/.well-known/genid/ae02cc16831f9433d7ffd24b36c29bf2#6
domain: http://lodlaundromat.org/.well-known/genid/ae02cc16831f9433d7ffd24b36c29bf2#2
domain: TimeIndexedSituation

within context
domain: Thing
comment: It links to the specific context within which the fact of the entity having the value is relevant.
domain: value in time
sub property of: forEntity
range: Thing
type: ObjectProperty
type: Property
domain: Resource
range: Resource
domain: http://lodlaundromat.org/.well-known/genid/ae02cc16831f9433d7ffd24b36c29bf2#1
domain: http://lodlaundromat.org/.well-known/genid/ae02cc16831f9433d7ffd24b36c29bf2#6
domain: http://lodlaundromat.org/.well-known/genid/ae02cc16831f9433d7ffd24b36c29bf2#2
domain: TimeIndexedSituation

is document context for
sub property of: hasTimeIndexedSetting
range: Thing
domain: Thing
type: ObjectProperty
comment: A property relating a document to the role for which that document provides the context (e.g. relating a document to the role of author or peer-reviewer of that document).
domain: (foaf) Document
sub property of: is related to role in time
inverse of: relates to document
type: Property
domain: Resource
range: Resource
range: role in time
range: http://lodlaundromat.org/.well-known/genid/b8d55434cac930bd810a300af19dc61f#6
range: http://lodlaundromat.org/.well-known/genid/b8d55434cac930bd810a300af19dc61f#7
range: http://lodlaundromat.org/.well-known/genid/b8d55434cac930bd810a300af19dc61f#8
range: http://lodlaundromat.org/.well-known/genid/b8d55434cac930bd810a300af19dc61f#9
range: http://lodlaundromat.org/.well-known/genid/b8d55434cac930bd810a300af19dc61f#1
range: value in time
range: http://lodlaundromat.org/.well-known/genid/ae02cc16831f9433d7ffd24b36c29bf2#1
range: http://lodlaundromat.org/.well-known/genid/ae02cc16831f9433d7ffd24b36c29bf2#2
range: http://lodlaundromat.org/.well-known/genid/ae02cc16831f9433d7ffd24b36c29bf2#6
range: TimeIndexedSituation
domain: http://lodlaundromat.org/.well-known/genid/9d396f826af70bb26e6c953fbd3fce0b#18
domain: http://lodlaundromat.org/.well-known/genid/9d396f826af70bb26e6c953fbd3fce0b#23
domain: http://lodlaundromat.org/.well-known/genid/9d396f826af70bb26e6c953fbd3fce0b#10
domain: http://lodlaundromat.org/.well-known/genid/9d396f826af70bb26e6c953fbd3fce0b#1

relates to document
sub property of: forEntity
inverse of: is document context for
range: Thing
domain: Thing
sub property of: within context
type: ObjectProperty
comment: A property relating a time-indexed situation describing a publishing role to a document that represents the context for that situation (e.g. relating the role of editor or peer-reviewer to the document being edited or peer-reviewed).
range: (foaf) Document
sub property of: relates to
type: Property
domain: value in time
domain: Resource
domain: TimeIndexedSituation
domain: http://lodlaundromat.org/.well-known/genid/ae02cc16831f9433d7ffd24b36c29bf2#1
domain: http://lodlaundromat.org/.well-known/genid/ae02cc16831f9433d7ffd24b36c29bf2#2
domain: http://lodlaundromat.org/.well-known/genid/ae02cc16831f9433d7ffd24b36c29bf2#6
domain: role in time
domain: http://lodlaundromat.org/.well-known/genid/b8d55434cac930bd810a300af19dc61f#6
domain: http://lodlaundromat.org/.well-known/genid/b8d55434cac930bd810a300af19dc61f#7
domain: http://lodlaundromat.org/.well-known/genid/b8d55434cac930bd810a300af19dc61f#8
domain: http://lodlaundromat.org/.well-known/genid/b8d55434cac930bd810a300af19dc61f#9
domain: http://lodlaundromat.org/.well-known/genid/b8d55434cac930bd810a300af19dc61f#1
range: Resource
range: http://lodlaundromat.org/.well-known/genid/9d396f826af70bb26e6c953fbd3fce0b#1
range: http://lodlaundromat.org/.well-known/genid/9d396f826af70bb26e6c953fbd3fce0b#23
range: http://lodlaundromat.org/.well-known/genid/9d396f826af70bb26e6c953fbd3fce0b#10
range: http://lodlaundromat.org/.well-known/genid/9d396f826af70bb26e6c953fbd3fce0b#18

is organization context for
range: Thing
domain: Thing
sub property of: hasTimeIndexedSetting
type: ObjectProperty
comment: A property relating an organization to the role for which that organization provides the context (e.g. relating an institution to the role of member held by a person).
domain: (foaf) Organization
sub property of: is related to role in time
inverse of: relates to organization
type: Property
domain: Resource
range: Resource
range: role in time
range: http://lodlaundromat.org/.well-known/genid/b8d55434cac930bd810a300af19dc61f#6
range: http://lodlaundromat.org/.well-known/genid/b8d55434cac930bd810a300af19dc61f#7
range: http://lodlaundromat.org/.well-known/genid/b8d55434cac930bd810a300af19dc61f#8
range: http://lodlaundromat.org/.well-known/genid/b8d55434cac930bd810a300af19dc61f#9
range: http://lodlaundromat.org/.well-known/genid/b8d55434cac930bd810a300af19dc61f#1
range: value in time
range: http://lodlaundromat.org/.well-known/genid/ae02cc16831f9433d7ffd24b36c29bf2#1
range: http://lodlaundromat.org/.well-known/genid/ae02cc16831f9433d7ffd24b36c29bf2#2
range: http://lodlaundromat.org/.well-known/genid/ae02cc16831f9433d7ffd24b36c29bf2#6
range: TimeIndexedSituation
domain: http://lodlaundromat.org/.well-known/genid/9d396f826af70bb26e6c953fbd3fce0b#18
domain: http://lodlaundromat.org/.well-known/genid/9d396f826af70bb26e6c953fbd3fce0b#23
domain: http://lodlaundromat.org/.well-known/genid/9d396f826af70bb26e6c953fbd3fce0b#1
domain: (foaf) Agent
domain: http://lodlaundromat.org/.well-known/genid/9d396f826af70bb26e6c953fbd3fce0b#13
domain: http://lodlaundromat.org/.well-known/genid/9d396f826af70bb26e6c953fbd3fce0b#6

with value
domain: Thing
comment: It holds the value had by the entity taking part to the situation.
domain: value in time
sub property of: forEntity
range: Thing
type: ObjectProperty
type: Property
domain: Resource
range: Resource
domain: http://lodlaundromat.org/.well-known/genid/ae02cc16831f9433d7ffd24b36c29bf2#1
domain: http://lodlaundromat.org/.well-known/genid/ae02cc16831f9433d7ffd24b36c29bf2#6
domain: http://lodlaundromat.org/.well-known/genid/ae02cc16831f9433d7ffd24b36c29bf2#2
domain: TimeIndexedSituation

relates to
sub property of: forEntity
range: Thing
domain: Thing
type: ObjectProperty
comment: A property relating a time-indexed situation to an entity representing the context for that situation.
domain: role in time
sub property of: within context
inverse of: is related to role in time
type: Property
domain: Resource
domain: value in time
domain: TimeIndexedSituation
domain: http://lodlaundromat.org/.well-known/genid/ae02cc16831f9433d7ffd24b36c29bf2#1
domain: http://lodlaundromat.org/.well-known/genid/ae02cc16831f9433d7ffd24b36c29bf2#2
domain: http://lodlaundromat.org/.well-known/genid/ae02cc16831f9433d7ffd24b36c29bf2#6
range: Resource
domain: http://lodlaundromat.org/.well-known/genid/b8d55434cac930bd810a300af19dc61f#6
domain: http://lodlaundromat.org/.well-known/genid/b8d55434cac930bd810a300af19dc61f#7
domain: http://lodlaundromat.org/.well-known/genid/b8d55434cac930bd810a300af19dc61f#8
domain: http://lodlaundromat.org/.well-known/genid/b8d55434cac930bd810a300af19dc61f#1
domain: http://lodlaundromat.org/.well-known/genid/b8d55434cac930bd810a300af19dc61f#9

http://lodlaundromat.org/.well-known/genid/b8d55434cac930bd810a300af19dc61f#8
subclass of: Resource
type: Class
subclass of: Thing
type: Restriction
on class: (foaf) Agent
on property: is role held by
qualified cardinality: 1

(foaf) Person
subclass of: Thing
subclass of: Resource
type: Class
nsterm status: stable
comment: A person.
subclass of: (foaf) Agent
disjoint with: (foaf) Group
disjoint with: (foaf) Organization
subclass of: http://lodlaundromat.org/.well-known/genid/9d396f826af70bb26e6c953fbd3fce0b#1
subclass of: http://lodlaundromat.org/.well-known/genid/9d396f826af70bb26e6c953fbd3fce0b#23
subclass of: http://lodlaundromat.org/.well-known/genid/9d396f826af70bb26e6c953fbd3fce0b#6
subclass of: http://lodlaundromat.org/.well-known/genid/9d396f826af70bb26e6c953fbd3fce0b#13
subclass of: http://lodlaundromat.org/.well-known/genid/9d396f826af70bb26e6c953fbd3fce0b#18

is related to role in time
inverse of: relates to
range: Thing
domain: Thing
type: ObjectProperty
comment: A property relating an entity to the role for which that entity provides the context.
range: role in time
sub property of: hasTimeIndexedSetting
type: Property
domain: Resource
range: Resource
range: http://lodlaundromat.org/.well-known/genid/ae02cc16831f9433d7ffd24b36c29bf2#6
range: http://lodlaundromat.org/.well-known/genid/ae02cc16831f9433d7ffd24b36c29bf2#1
range: http://lodlaundromat.org/.well-known/genid/b8d55434cac930bd810a300af19dc61f#1
range: http://lodlaundromat.org/.well-known/genid/b8d55434cac930bd810a300af19dc61f#7
range: http://lodlaundromat.org/.well-known/genid/ae02cc16831f9433d7ffd24b36c29bf2#2
range: value in time
range: TimeIndexedSituation
range: http://lodlaundromat.org/.well-known/genid/b8d55434cac930bd810a300af19dc61f#8
range: http://lodlaundromat.org/.well-known/genid/b8d55434cac930bd810a300af19dc61f#6
range: http://lodlaundromat.org/.well-known/genid/b8d55434cac930bd810a300af19dc61f#9

(foaf) Project
subclass of: http://lodlaundromat.org/.well-known/genid/9d396f826af70bb26e6c953fbd3fce0b#13
subclass of: Thing
subclass of: Resource
subclass of: http://lodlaundromat.org/.well-known/genid/9d396f826af70bb26e6c953fbd3fce0b#1
subclass of: http://lodlaundromat.org/.well-known/genid/9d396f826af70bb26e6c953fbd3fce0b#23
subclass of: http://lodlaundromat.org/.well-known/genid/9d396f826af70bb26e6c953fbd3fce0b#18
type: Class
nsterm status: unstable
comment: A project (a collective endeavour of some kind).
disjoint with: (foaf) Document
disjoint with: (foaf) Agent
disjoint with: (foaf) OnlineAccount

role in time
subclass of: Thing
subclass of: Resource
type: Class
subclass of: http://lodlaundromat.org/.well-known/genid/b8d55434cac930bd810a300af19dc61f#6
description: A role in time describes always: - a particular role R - a particular agent A holding R - a particular time interval T in which A holds R (optional) - one or more entities (e.g. a particular bibliographic entity or a specific institution) that defines a context for R held by A. (At least one contextual entity should be specified for a particular role).
subclass of: http://lodlaundromat.org/.well-known/genid/b8d55434cac930bd810a300af19dc61f#7
subclass of: http://lodlaundromat.org/.well-known/genid/b8d55434cac930bd810a300af19dc61f#8
comment: A particular situation that describe a role an agent may have, that can be restricted to a particular time interval.
subclass of: http://lodlaundromat.org/.well-known/genid/b8d55434cac930bd810a300af19dc61f#9
subclass of: http://lodlaundromat.org/.well-known/genid/b8d55434cac930bd810a300af19dc61f#1
subclass of: value in time
subclass of: http://lodlaundromat.org/.well-known/genid/ae02cc16831f9433d7ffd24b36c29bf2#1
subclass of: http://lodlaundromat.org/.well-known/genid/ae02cc16831f9433d7ffd24b36c29bf2#2
subclass of: http://lodlaundromat.org/.well-known/genid/ae02cc16831f9433d7ffd24b36c29bf2#6
subclass of: TimeIndexedSituation

role
subclass of: Resource
type: Class
comment: A role an agent may have. Individual members of this class or its sub-classes are used to specify particular roles.
subclass of: Thing

(foaf) Image
subclass of: Thing
subclass of: Resource
type: Class
nsterm status: testing
comment: An image.
subclass of: (foaf) Document
disjoint with: (foaf) PersonalProfileDocument
subclass of: http://lodlaundromat.org/.well-known/genid/9d396f826af70bb26e6c953fbd3fce0b#1
subclass of: http://lodlaundromat.org/.well-known/genid/9d396f826af70bb26e6c953fbd3fce0b#18
subclass of: http://lodlaundromat.org/.well-known/genid/9d396f826af70bb26e6c953fbd3fce0b#10
subclass of: http://lodlaundromat.org/.well-known/genid/9d396f826af70bb26e6c953fbd3fce0b#23

value in time
subclass of: Thing
subclass of: Resource
type: Class
subclass of: TimeIndexedSituation
subclass of: http://lodlaundromat.org/.well-known/genid/ae02cc16831f9433d7ffd24b36c29bf2#1
subclass of: http://lodlaundromat.org/.well-known/genid/ae02cc16831f9433d7ffd24b36c29bf2#2
subclass of: http://lodlaundromat.org/.well-known/genid/ae02cc16831f9433d7ffd24b36c29bf2#6
description: Having the role "graduate student" in a specific time (e.g., now) and context (e.g., "University of Bologna").
comment: It defines a particular kind of time-indexed situation that represents a hub linking the entity having a particular value, the value itself and the temporal and contextual extents from which the entity-value relationship depends.

(foaf) Document
subclass of: Resource
subclass of: Thing
subclass of: http://lodlaundromat.org/.well-known/genid/9d396f826af70bb26e6c953fbd3fce0b#1
subclass of: http://lodlaundromat.org/.well-known/genid/9d396f826af70bb26e6c953fbd3fce0b#23
subclass of: http://lodlaundromat.org/.well-known/genid/9d396f826af70bb26e6c953fbd3fce0b#10
subclass of: http://lodlaundromat.org/.well-known/genid/9d396f826af70bb26e6c953fbd3fce0b#18
comment: A document.
type: Class
label: document
comment: An abstract class defining any kinds of publishing work.
disjoint with: (foaf) OnlineAccount
disjoint with: (foaf) Project
disjoint with: (foaf) Agent
nsterm status: testing

relates to person
sub property of: forEntity
sub property of: within context
range: Thing
domain: Thing
type: ObjectProperty
comment: A property relating a time-indexed situation to a person who represents the context for that situation (e.g. relating the role of an supervisor with respect to the graduate student being supervised).
range: (foaf) Person
sub property of: relates to
type: Property
domain: Resource
domain: value in time
domain: TimeIndexedSituation
domain: http://lodlaundromat.org/.well-known/genid/ae02cc16831f9433d7ffd24b36c29bf2#1
domain: http://lodlaundromat.org/.well-known/genid/ae02cc16831f9433d7ffd24b36c29bf2#2
domain: http://lodlaundromat.org/.well-known/genid/ae02cc16831f9433d7ffd24b36c29bf2#6
domain: role in time
domain: http://lodlaundromat.org/.well-known/genid/b8d55434cac930bd810a300af19dc61f#6
domain: http://lodlaundromat.org/.well-known/genid/b8d55434cac930bd810a300af19dc61f#7
domain: http://lodlaundromat.org/.well-known/genid/b8d55434cac930bd810a300af19dc61f#8
domain: http://lodlaundromat.org/.well-known/genid/b8d55434cac930bd810a300af19dc61f#9
domain: http://lodlaundromat.org/.well-known/genid/b8d55434cac930bd810a300af19dc61f#1
range: Resource
range: (foaf) Agent
range: http://lodlaundromat.org/.well-known/genid/9d396f826af70bb26e6c953fbd3fce0b#23
range: http://lodlaundromat.org/.well-known/genid/9d396f826af70bb26e6c953fbd3fce0b#13
range: http://lodlaundromat.org/.well-known/genid/9d396f826af70bb26e6c953fbd3fce0b#6
range: http://lodlaundromat.org/.well-known/genid/9d396f826af70bb26e6c953fbd3fce0b#18
range: http://lodlaundromat.org/.well-known/genid/9d396f826af70bb26e6c953fbd3fce0b#1

holds role in time
sub property of: hasTimeIndexedSetting
range: Thing
domain: Thing
inverse of: is role held by
type: ObjectProperty
comment: A property relating an agent to a role that the agent holds. This is done via the indirection: foaf:Agent pro:holdsRoleInTime [ a pro:RoleInTime ; pro:withRole pro:Role ] . The ontology permits one to specify the time period over which a role is held, and the other contextual entities to which that agent's role relates.
domain: (foaf) Agent
range: role in time
sub property of: has value
type: Property
domain: Resource
range: Resource
range: value in time
range: TimeIndexedSituation
range: http://lodlaundromat.org/.well-known/genid/ae02cc16831f9433d7ffd24b36c29bf2#1
range: http://lodlaundromat.org/.well-known/genid/ae02cc16831f9433d7ffd24b36c29bf2#2
range: http://lodlaundromat.org/.well-known/genid/ae02cc16831f9433d7ffd24b36c29bf2#6
range: http://lodlaundromat.org/.well-known/genid/b8d55434cac930bd810a300af19dc61f#1
range: http://lodlaundromat.org/.well-known/genid/b8d55434cac930bd810a300af19dc61f#7
range: http://lodlaundromat.org/.well-known/genid/b8d55434cac930bd810a300af19dc61f#8
range: http://lodlaundromat.org/.well-known/genid/b8d55434cac930bd810a300af19dc61f#6
range: http://lodlaundromat.org/.well-known/genid/b8d55434cac930bd810a300af19dc61f#9
domain: http://lodlaundromat.org/.well-known/genid/9d396f826af70bb26e6c953fbd3fce0b#18
domain: http://lodlaundromat.org/.well-known/genid/9d396f826af70bb26e6c953fbd3fce0b#23
domain: http://lodlaundromat.org/.well-known/genid/9d396f826af70bb26e6c953fbd3fce0b#1
domain: http://lodlaundromat.org/.well-known/genid/9d396f826af70bb26e6c953fbd3fce0b#13
domain: http://lodlaundromat.org/.well-known/genid/9d396f826af70bb26e6c953fbd3fce0b#6

(foaf) Group
subclass of: Resource
type: Class
subclass of: Thing
nsterm status: unstable
comment: A class of Agents.
subclass of: (foaf) Agent
disjoint with: (foaf) Organization
disjoint with: (foaf) Person
subclass of: http://lodlaundromat.org/.well-known/genid/9d396f826af70bb26e6c953fbd3fce0b#18
subclass of: http://lodlaundromat.org/.well-known/genid/9d396f826af70bb26e6c953fbd3fce0b#1
subclass of: http://lodlaundromat.org/.well-known/genid/9d396f826af70bb26e6c953fbd3fce0b#13
subclass of: http://lodlaundromat.org/.well-known/genid/9d396f826af70bb26e6c953fbd3fce0b#23
subclass of: http://lodlaundromat.org/.well-known/genid/9d396f826af70bb26e6c953fbd3fce0b#6

(foaf) Agent
subclass of: http://lodlaundromat.org/.well-known/genid/9d396f826af70bb26e6c953fbd3fce0b#13
subclass of: http://lodlaundromat.org/.well-known/genid/9d396f826af70bb26e6c953fbd3fce0b#6
subclass of: http://lodlaundromat.org/.well-known/genid/9d396f826af70bb26e6c953fbd3fce0b#1
subclass of: Thing
subclass of: Resource
subclass of: http://lodlaundromat.org/.well-known/genid/9d396f826af70bb26e6c953fbd3fce0b#23
subclass of: http://lodlaundromat.org/.well-known/genid/9d396f826af70bb26e6c953fbd3fce0b#18
type: Class
disjoint with: (foaf) OnlineAccount
disjoint with: (foaf) Document
label: agent
comment: An abstract class defining any kind of agents, such as a person, a group, an organization or a software agent.
nsterm status: unstable
comment: An agent (eg. person, group, software or physical artifact).
disjoint with: (foaf) Project

time interval
subclass of: Interval
subclass of: Resource
type: Class
subclass of: Thing
equivalent class: Interval
comment: Two (starting and ending) points in time that define a particular period of time.
subclass of: http://lodlaundromat.org/.well-known/genid/ae02cc16831f9433d7ffd24b36c29bf2#3

(foaf) Organization
subclass of: Resource
type: Class
subclass of: Thing
nsterm status: unstable
comment: An organization.
subclass of: (foaf) Agent
disjoint with: (foaf) Person
disjoint with: (foaf) Group
subclass of: http://lodlaundromat.org/.well-known/genid/9d396f826af70bb26e6c953fbd3fce0b#18
subclass of: http://lodlaundromat.org/.well-known/genid/9d396f826af70bb26e6c953fbd3fce0b#13
subclass of: http://lodlaundromat.org/.well-known/genid/9d396f826af70bb26e6c953fbd3fce0b#6
subclass of: http://lodlaundromat.org/.well-known/genid/9d396f826af70bb26e6c953fbd3fce0b#1
subclass of: http://lodlaundromat.org/.well-known/genid/9d396f826af70bb26e6c953fbd3fce0b#23

has value
range: Thing
comment: It links an entity (e.g., a Person) to a particular ValueInTime situation;
range: value in time
sub property of: hasTimeIndexedSetting
domain: Thing
type: ObjectProperty
type: Property
domain: Resource
range: Resource
range: http://lodlaundromat.org/.well-known/genid/ae02cc16831f9433d7ffd24b36c29bf2#2
range: http://lodlaundromat.org/.well-known/genid/ae02cc16831f9433d7ffd24b36c29bf2#6
range: TimeIndexedSituation
range: http://lodlaundromat.org/.well-known/genid/ae02cc16831f9433d7ffd24b36c29bf2#1

(foaf) PersonalProfileDocument
subclass of: Resource
type: Class
subclass of: Thing
nsterm status: testing
comment: A personal profile RDF document.
subclass of: (foaf) Document
disjoint with: (foaf) Image
subclass of: http://lodlaundromat.org/.well-known/genid/9d396f826af70bb26e6c953fbd3fce0b#23
subclass of: http://lodlaundromat.org/.well-known/genid/9d396f826af70bb26e6c953fbd3fce0b#1
subclass of: http://lodlaundromat.org/.well-known/genid/9d396f826af70bb26e6c953fbd3fce0b#10
subclass of: http://lodlaundromat.org/.well-known/genid/9d396f826af70bb26e6c953fbd3fce0b#18

is role held by
range: Thing
domain: Thing
type: ObjectProperty
comment: A property relating a role in time that an agent holds, or a contribution situation that an agent makes, to that agent.
domain: role in time
range: (foaf) Agent
sub property of: forEntity
inverse of: holds role in time
type: Property
domain: Resource
range: Resource
range: http://lodlaundromat.org/.well-known/genid/9d396f826af70bb26e6c953fbd3fce0b#23
range: http://lodlaundromat.org/.well-known/genid/9d396f826af70bb26e6c953fbd3fce0b#13
range: http://lodlaundromat.org/.well-known/genid/9d396f826af70bb26e6c953fbd3fce0b#6
range: http://lodlaundromat.org/.well-known/genid/9d396f826af70bb26e6c953fbd3fce0b#18
range: http://lodlaundromat.org/.well-known/genid/9d396f826af70bb26e6c953fbd3fce0b#1
domain: http://lodlaundromat.org/.well-known/genid/b8d55434cac930bd810a300af19dc61f#6
domain: http://lodlaundromat.org/.well-known/genid/b8d55434cac930bd810a300af19dc61f#7
domain: http://lodlaundromat.org/.well-known/genid/b8d55434cac930bd810a300af19dc61f#8
domain: http://lodlaundromat.org/.well-known/genid/ae02cc16831f9433d7ffd24b36c29bf2#1
domain: http://lodlaundromat.org/.well-known/genid/b8d55434cac930bd810a300af19dc61f#1
domain: http://lodlaundromat.org/.well-known/genid/ae02cc16831f9433d7ffd24b36c29bf2#6
domain: http://lodlaundromat.org/.well-known/genid/ae02cc16831f9433d7ffd24b36c29bf2#2
domain: TimeIndexedSituation
domain: http://lodlaundromat.org/.well-known/genid/b8d55434cac930bd810a300af19dc61f#9
domain: value in time

is person context for
sub property of: hasTimeIndexedSetting
range: Thing
domain: Thing
type: ObjectProperty
comment: A property relating a person to the role for which that person provides the context (e.g. relating a graduate student to the role of supervisor held by a faculty member).
sub property of: is related to role in time
type: Property
domain: Resource
range: Resource
range: role in time
range: http://lodlaundromat.org/.well-known/genid/b8d55434cac930bd810a300af19dc61f#6
range: http://lodlaundromat.org/.well-known/genid/b8d55434cac930bd810a300af19dc61f#7
range: http://lodlaundromat.org/.well-known/genid/b8d55434cac930bd810a300af19dc61f#8
range: http://lodlaundromat.org/.well-known/genid/b8d55434cac930bd810a300af19dc61f#9
range: http://lodlaundromat.org/.well-known/genid/b8d55434cac930bd810a300af19dc61f#1
range: value in time
range: http://lodlaundromat.org/.well-known/genid/ae02cc16831f9433d7ffd24b36c29bf2#1
range: http://lodlaundromat.org/.well-known/genid/ae02cc16831f9433d7ffd24b36c29bf2#2
range: http://lodlaundromat.org/.well-known/genid/ae02cc16831f9433d7ffd24b36c29bf2#6
range: TimeIndexedSituation

managing editor
type: publishing role
type: NamedIndividual
comment: The role of an editor who has management responsibility for the production of particular publication, usually acting under the authority of the Executive Editor and the Editor-in-Chief.
type: role
type: Thing

copy editor
type: publishing role
type: NamedIndividual
comment: The role of an editor who undertakes alterations to the text of a document submitted for publication to improve the formatting, style and accuracy of text, or to bring the text into the house style of the publisher (e.g. Americanization of British spelling), without intentionally altering the substance or meaning of the text.
type: role
type: Thing

guest editor
type: publishing role
type: NamedIndividual
comment: The role of someone who is a guest editor, for example for a special themed issue of a journal.
type: role
type: Thing

archivist
type: publishing role
type: NamedIndividual
comment: The role of a person who manages, undertakes and supervises the work of an archive. [This term is typically used with respect to a document archive, whereas the term data curator is used with respect to a data archive.]
type: role
type: Thing

proof reader
type: publishing role
type: NamedIndividual
comment: The role of a person who reads the proofs of documents to detect any errors prior to final publication.
type: role
type: Thing

commissioning editor
type: publishing role
type: NamedIndividual
comment: The role of an editor who actively commissions authors to write books to be published by the publishing house for which the commissioning editor works.
type: role
type: Thing

copyright owner
type: publishing role
type: NamedIndividual
comment: The role of owning the copyright to a publication, usually held by the author or by the publishing house that publishes the author's work.
type: role
type: Thing

author's agent
type: publishing role
type: NamedIndividual
comment: A person who finds work for professional authors, manages their contracts, and works to advance their careers, charging their clients as fees for their services a percentage of the money made from the authors' writings.
type: role
type: Thing

producer
type: publishing role
type: NamedIndividual
comment: The role of someone who acts as a producer.
type: role
type: Thing

PRO, the Publishing Roles Ontology
comment: This ontology is available at http://purl.org/spar/pro, and uses the namespace prefix pro.
imports: FOAF Essential v. 2.0
creator: David Shotton
creator: Silvio Peroni
comment: PRO, the Publishing Roles Ontology, is an ontology for describing roles in the publication process, or in other scholarly activities or situations, held by particular agent. The role can be specified to exist over a defined period of time, and within a specific context, e.g. with respect to a particular document. PRO forms part of SPAR, a suite of Semantic Publishing and Referencing Ontologies. Other SPAR ontologies are described at http://purl.org/spar/.
version info: 1.5.3
type: Ontology
rights: This work is distributed under a Creative Commons Attribution License (http://creativecommons.org/licenses/by/3.0/).
description: Since roles have contexts and times that are important to take into account (for example, a person can be author of one paper and reviewer of another, while another person will be editor of a journal only for a defined period, not for ever), the PRO ontology permit these contexts to be specified, using an ontological design pattern called the time-indexed value in context (TVC) (http://www.essepuntato.it/2012/04/tvc/) which is imported into PRO. This ontology design pattern permits one to construct the following RDF statements: foaf:Agent pro:holdsRoleInTime [ a pro:RoleInTime pro:withRole pro:editor ] . Thus the domain of pro:withRole is not foaf:Agent, but rather an anonymous member of the class pro:RoleInTime, which itself is the range of the property pro:holdsRoleInTime, for which the domain is foaf:Agent. The range of pro:withRole is the class pro:Role, whose members permit specific roles to be specified. This single step of indirection permits other contextual and temporal attributes (not shown here) to be specified for this member of the class pro:RoleInTime, putting that role into context. Exemplar usage: foaf:Agent pro:holdsRoleInTime [ a pro:RoleInTime pro:withRole pro:editor ] .
date: 2013-12-18
description: PRO, the Publishing Roles Ontology, is an ontology written in OWL 2 DL for the characterization of the roles of agents (people, corporate bodies and computational agents) in the publication process. It permits one to specify how an agent has a role relating to a contextual entity, and the period of time during which that role is held. It is based on the Time-indexed Value in Context (TVC) ontology pattern (http://www.essepuntato.it/2012/04/tvc). It is easy to extend the set of specified roles, simply by adding new individuals to the class pro:PublishingRole. This ontology is imported into SCoRO, the Scholarly Contribution and Roles Ontology (http://purl.org/spar/scoro/), where it is used similarly to enable the description of a wider range of contributions and roles relating to other scholarly activities and entities, including academic administration, funded projects, research investigations, data and authorship, and to define their temporal extents and contexts, as for publishing roles in PRO.
imports: time-indexed value in context

series editor
type: publishing role
type: NamedIndividual
comment: The role of the person who has editorial responsibility for publication series, for example a book series.
type: role
type: Thing

time-indexed value in context
contributor: Fabio Vitali
type: Ontology
contributor: David Shotton
comment: A pattern for the description of scenarios that involve entities having some value during a particular time and within a particular context.
description: Sometimes, we need to describe scenarios in which someone (e.g., a person) has a value (e.g., a particular role) during a particular time and for a particular context. Four different things are involved in these kinds of scenarios: 1. the entity having some value, e.g. a person or a document possessing a role or a status; 2. the value had by someone, e.g. a role or a status; 3. the time period during which the entity has that value, e.g. from April 2008 to September 2008; 4. the particular context that characterises the act of having that value, e.g. being a member of an institution or an editor of a particular journal. Thought as natural extension of the Time-indexed Situation pattern (http://ontologydesignpatterns.org/wiki/Submissions:TimeIndexedSituation), this ontological pattern, called Time-indexed Value in Context (TVC), is able to describe these kinds of scenarios.
creator: Silvio Peroni
title: The Time-indexed Value in Context
date: 2012-06-08
imports: time
imports: timeindexedsituation.owl

illustrator
type: publishing role
type: NamedIndividual
comment: The role of an agent that illustrates a document.
type: role
type: Thing

compiler
type: publishing role
type: NamedIndividual
comment: The role an agent has of compiling a number of items into a compilation or collection.
type: role
type: Thing

executive editor
type: publishing role
type: NamedIndividual
comment: The role of an editor who has executive responsibility for the production of particular publication, usually acting under the authority of the Editor-in-Chief.
type: role
type: Thing

deputy editor
type: publishing role
type: NamedIndividual
comment: The role of a senior editor of a publication who deputizes for the Editor-in-Chief.
type: role
type: Thing

production editor
type: publishing role
type: NamedIndividual
comment: The role of an editor who takes responsibility for the passage of a document through the various stages of the publication workflow from the submitted manuscript to the final publication, including responsibility for scheduling and budget.
type: role
type: Thing

printer
type: publishing role
type: NamedIndividual
comment: The role of an agent involved in printing documents, either a company providing printing services or an individual engaged in the process of printing documents.
type: role
type: Thing

distributor
type: publishing role
type: NamedIndividual
comment: The role of a person who distributes publications.
type: role
type: Thing

biographer
type: publishing role
type: NamedIndividual
comment: The role of an author who writes biographies.
type: role
type: Thing

editor-in-chief
type: publishing role
type: NamedIndividual
comment: The role of the person who has final responsibility for the editorial operations and policies for a particular publication.
type: role
type: Thing

reviewer
type: publishing role
type: NamedIndividual
comment: The role of a person who subjects a publication to a written review and critical analysis of its content, scope and quality.
type: role
type: Thing

peer reviewer
type: publishing role
type: NamedIndividual
comment: The role of an academic peer in evaluating a manuscript submitted by an author for publication as a journal article on behalf of the journal editor, or a conference paper on behalf of the conference programme committee, and in deciding whether it is suitable for acceptance, usually subject to revisions suggested by the peer-reviewer.
type: role
type: Thing

FOAF Essential v. 2.0
prior version: foaf-essential.owl
creator: me
publisher: Mindinformatics, Massachusetts General Hospital
contributor: Alan Ruttenberg
version info: 2.0
contributor: Paolo Ciccarese
title: FOAF Essential ontology
date: October 12, 2010
type: Ontology
language: en
format: rdf/xml

publisher
type: publishing role
type: NamedIndividual
comment: The role of a person or an organization that published material, or of a publisher's employee who has responsibility for such publications.
type: role
type: Thing

journalist
type: publishing role
type: NamedIndividual
comment: The role of an author who writes newspaper or magazine news reports or articles.
type: role
type: Thing

editor
type: publishing role
type: NamedIndividual
comment: The role of a person who selects and prepares for publication material written and submitted by authors.
type: role
type: Thing

ghost writer
type: publishing role
type: NamedIndividual
comment: The role of a professional writer who assists an aspiring author lacking authorship skills to write a book or article for publication, for example by helping the author to create grammatically correct and lucid prose, or who writes the book on behalf of the named author, without himself/herself claiming authorship.
type: role
type: Thing

blogger
type: publishing role
type: NamedIndividual
comment: The role of an author who writes blog posts.
type: role
type: Thing

librarian
type: publishing role
type: NamedIndividual
comment: The role of a person who manages, undertakes and supervises the work of a library.
type: role
type: Thing

author
type: publishing role
type: NamedIndividual
comment: The role a person has of authorship of some material (for example a document).
type: role
type: Thing

senior editor
type: publishing role
type: NamedIndividual
comment: The role of the person who has senior responsibility for the editorial operations and policies for a particular publication, usually acting under the authority of the Editor-in-Chief.
type: role
type: Thing

contributor
type: publishing role
type: NamedIndividual
comment: The role an agent has of contribution of some material (for example an article to a magazine).
type: role
type: Thing

translator
type: publishing role
type: NamedIndividual
comment: The role of an agent that translates a document into another language.
type: role
type: Thing

critic
type: publishing role
type: NamedIndividual
comment: The role of an author who writes evaluations and criticisms of, for example, plays or other works of art.
type: role
type: Thing

reader
type: publishing role
type: NamedIndividual
comment: The role of a person who reads publications.
type: role
type: Thing