language
range: Thing
domain: Thing
type: ObjectProperty
comment: The property of an asset being in a specific language.
range: Language
term status: stable
type: Property
domain: Resource
range: Resource

subProgrammeOf
range: Thing
domain: Thing
type: ObjectProperty
comment: Capture the hierarchy of programmes of study.
domain: ProgrammeOfStudy
range: ProgrammeOfStudy
term status: stable
type: Property
domain: Resource
range: Resource

subFieldOf
range: Thing
domain: Thing
type: ObjectProperty
comment: Capture the hierarchy of fields of study.
domain: FiledOfStudy
range: FiledOfStudy
term status: stable
type: Property
domain: Resource
range: Resource

examBoard
range: Thing
domain: Thing
type: ObjectProperty
comment: Specify an asset is useful for preparing exams provided by an exam board.
range: ExamBoard
term status: stable
type: Property
domain: Resource
range: Resource

subTopicOf
range: Thing
domain: Thing
type: ObjectProperty
comment: Capture the hierarchy of topics.
domain: Topic
range: Topic
term status: stable
type: Property
domain: Resource
range: Resource

TopicOfStudyList
subclass of: Resource
type: Class
subclass of: Thing
comment: A ordered list of topics of study
subclass of: OrderedList
term status: stable

KeyStage
subclass of: Resource
type: Class
subclass of: Thing
comment: Key Stage is a way to specify the stage of the state education system in England, Wales, Northern Ireland.
subclass of: Level
term status: stable

about
range: Thing
domain: Thing
type: ObjectProperty
comment: Link topic of study views to topics.
domain: TopicOfStudy
range: Topic
term status: stable
type: Property
domain: Resource
range: Resource

Language
subclass of: Thing
subclass of: Resource
type: Class
comment: Examples of language are English, Welsh, Scottish Gaelic and Irish Gaelic.
term status: stable

Year
subclass of: Resource
type: Class
subclass of: Thing
comment: Year is a way to specify the stages of education.
subclass of: Level
term status: stable

subLevelOf
range: Thing
domain: Thing
type: ObjectProperty
comment: Capture the hierarchy of level.
domain: Level
range: Level
term status: stable
type: Property
domain: Resource
range: Resource

taughtInNation
range: Thing
domain: Thing
type: ObjectProperty
comment: Specify the nation of a level.
domain: Level
range: Nation
term status: stable
type: Property
domain: Resource
range: Resource

Level
subclass of: Thing
subclass of: Resource
type: Class
comment: Levels refers to the stages of education. Typically, there are four different ways to specify the levels: age range, year, key stage and phase.
term status: stable

Topic
subclass of: Thing
subclass of: Resource
type: Class
comment: Topic can highlight the content of the learning resources in a way more specific than the Field of Study. For example, energy is a topic of physics.
term status: stable

topics
range: Thing
domain: Thing
type: ObjectProperty
comment: Link a topic of study or a programme of study to an ordered list of topics of study.
range: TopicOfStudyList
term status: stable
type: Property
domain: Resource
range: Resource
range: OrderedList

Nation
subclass of: Thing
subclass of: Resource
type: Class
comment: Nation is the concept to describe the four parts of the UK, i.e. England, Wales, Scotland and Northern Ireland.
term status: stable

PaperTier
subclass of: Resource
type: Class
subclass of: Thing
comment: Paper tier reflects the difficulty of a exam. It can be standard or higher.
term status: stable

taughtInField
range: Thing
domain: Thing
type: ObjectProperty
comment: Specify the field of a programme of study.
domain: ProgrammeOfStudy
range: FiledOfStudy
term status: stable
type: Property
domain: Resource
range: Resource

ProgrammeOfStudy
subclass of: Resource
type: Class
subclass of: Thing
comment: A programme of study is the combination of a nation, an educational level such as Key Stage 3 and the subject being studied, Science, Maths etc.
term status: stable

appropriateFor
range: Thing
domain: Thing
type: ObjectProperty
comment: Link topic of study to a programme of study.
domain: TopicOfStudy
range: ProgrammeOfStudy
term status: stable
type: Property
domain: Resource
range: Resource

Age
subclass of: Resource
type: Class
subclass of: Thing
comment: Age or age range is a way to specify the stages of education.
subclass of: Level
term status: stable

ExamBoard
subclass of: Thing
subclass of: Resource
type: Class
comment: Exam board is the organization holds some exams.
term status: stable

Phase
subclass of: Resource
type: Class
subclass of: Thing
comment: This concept is borrowed from the controlled terms for describing phase of education, which are published by the data.gov.uk. The phases of education include Primary, Secondary and 16-Plus.
subclass of: Level
term status: stable

nation
range: Thing
domain: Thing
type: ObjectProperty
comment: Specify an asset could be useful for a certain nation
range: Nation
term status: stable
type: Property
domain: Resource
range: Resource

FiledOfStudy
subclass of: Resource
type: Class
subclass of: Thing
comment: Fields of study refers to the disciplines of a curriculum, e.g. Science, Maths, Science, etc.
term status: stable

paperTier
range: Thing
domain: Thing
type: ObjectProperty
comment: Specify the difficulty level of an asset
range: PaperTier
term status: stable
type: Property
domain: Resource
range: Resource

taughtAtLevel
range: Thing
domain: Thing
type: ObjectProperty
comment: Specify the level of a programme of study.
domain: ProgrammeOfStudy
range: Level
term status: stable
type: Property
domain: Resource
range: Resource

TopicOfStudy
subclass of: Thing
subclass of: Resource
type: Class
comment: Topic of study is topic within the context of a programme of study. It aims to provide a formal learning context to an asset or a collection of assets.
term status: stable

includesTopicOfStudy
range: Thing
domain: Thing
type: ObjectProperty
comment: a short cut from a programme of study or a topic of study to the member of its topic of study list
range: TopicOfStudy
term status: stable
type: Property
domain: Resource
range: Resource

providesContextTo
range: Thing
domain: Thing
type: ObjectProperty
comment: Link topics of study to BBC assets.
domain: TopicOfStudy
term status: stable
type: Property
domain: Resource
range: Resource

lowerAgeBoundary
type: DatatypeProperty
comment: The lower bound of the age range of a educational level.
domain: Level
range: integer
term status: stable
type: Property
domain: Thing
domain: Resource
range: Resource
range: decimal

publishedAt
type: DatatypeProperty
comment: The date when a programme of study is published
range: dateTime
term status: stable
type: Property
range: Resource

depictionPID
type: DatatypeProperty
comment: The PID of the depiction (image).
range: string
term status: stable
type: Property
range: Resource

Curriculum Ontology
comment: This ontology aims to provide data model and vocabularies for describing the national curricula within the UK
imports: provenance
imports: http://purl.org/dc/elements/1.1/
canonical location: https://repo.dev.bbc.co.uk/services/linked-data/ontologies/domain/kl/curriculum/curriculum-ontology-1-2.ttl
type: Ontology
imports: terms
date: Date: 2013/10/11 12:18:00
license: id
change reason: Corrected Labels
imports: core
version info: 1.2
imports: vann
version: 1.2
version IRI: http://www.bbc.co.uk/ontologies/curriculum/1.2
public: true
slug: curriculum
imports: ns

upperAgeBoundary
type: DatatypeProperty
comment: The upper bound of the age range of a educational level.
domain: Level
range: integer
term status: stable
type: Property
domain: Thing
domain: Resource
range: Resource
range: decimal