query-content
sub property of: topObjectProperty
sub property of: content
property disjoint with: bottomObjectProperty
type: ObjectProperty
comment: The query content that leads to the source usage. e.g. the query part of a URL.
domain: Source Usage

Format
disjoint with: Nothing
subclass of: Identified Thing
subclass of: Thing
type: Class
comment: A plan for the organization and arrangement of specified information. Examples: binary, text, pdf, etc.

name
property disjoint with: from-offset
property disjoint with: data-collection-end-datetime
property disjoint with: from-row
property disjoint with: confidence
property disjoint with: to-row
property disjoint with: to-offset
property disjoint with: published in
property disjoint with: url
property disjoint with: last modified
property disjoint with: created
type: DatatypeProperty
property disjoint with: data-collection-start-datetime
property disjoint with: from-column
property disjoint with: bottomDataProperty
property disjoint with: to-column
sub property of: topDataProperty
property disjoint with: usage-datetime
comment: the human readable label of the identified thing.
domain: Identified Thing
range: string

encoding
property disjoint with: to-row
property disjoint with: from-offset
property disjoint with: from-column
property disjoint with: published in
property disjoint with: bottomDataProperty
property disjoint with: url
sub property of: topDataProperty
property disjoint with: to-offset
property disjoint with: from-row
property disjoint with: created
property disjoint with: last modified
property disjoint with: to-column
type: DatatypeProperty
property disjoint with: data-collection-end-datetime
property disjoint with: usage-datetime
property disjoint with: data-collection-start-datetime
property disjoint with: confidence
comment: The content encoding, e.g. "base64". The value of this property helps applications determine the decoder of the raw string.
domain: Information
range: string

Translation Rule
disjoint with: Nothing
subclass of: Method Rule
subclass of: Inference Rule
subclass of: Identified Thing
subclass of: Thing
type: Class
comment: Translation rules are special kinds of inference rules which are used to translate expressions from one language to the other.
subclass of: http://lodlaundromat.org/.well-known/genid/4585ece82e36ebfa83b754bed3a71bb9#34
subclass of: http://lodlaundromat.org/.well-known/genid/4585ece82e36ebfa83b754bed3a71bb9#35

pretty name
property disjoint with: confidence
property disjoint with: to-column
property disjoint with: created
property disjoint with: to-offset
property disjoint with: last modified
property disjoint with: data-collection-start-datetime
property disjoint with: to-row
property disjoint with: data-collection-end-datetime
property disjoint with: bottomDataProperty
type: DatatypeProperty
property disjoint with: from-offset
property disjoint with: published in
sub property of: topDataProperty
property disjoint with: from-column
property disjoint with: url
property disjoint with: usage-datetime
property disjoint with: from-row
domain: Pretty Name Mapping
range: string

Sensor
disjoint with: Publication
subclass of: Agent
disjoint with: Dataset
disjoint with: Document
disjoint with: Nothing
subclass of: Thing
subclass of: Identified Thing
disjoint with: Ontology
type: Class
subclass of: Source
disjoint with: Website
comment: any device that receives a signal or stimulus (as heat or pressure or light or motion etc.) and records it. (WordNet)

Source
disjoint with: Nothing
subclass of: Identified Thing
subclass of: Thing
type: Class
comment: A source refers to the source of information. It is the place where we obtain information.

Website
disjoint with: Software
disjoint with: Agent
disjoint with: Person
disjoint with: Nothing
subclass of: Source
subclass of: Identified Thing
disjoint with: Inference Engine
subclass of: Thing
disjoint with: Web Service
disjoint with: Sensor
subclass of: Document
disjoint with: Organization
type: Class
comment: Collection of files and related resources accessible through the World Wide Web and organized under a particular domain name. Typical files found at a Web site are HTML documents with their associated graphic image files (GIF, JPEG, etc.), scripted programs (in Perl, CGI, Java, etc.), and similar resources. The site's files are usually accessed through hypertext or hyperlinks embedded in other files. A Web site may consist of a single HTML file, or it may comprise hundreds or thousands of related files. A Web site's usual starting point or opening page, called a home page, usually functions as a table of contents or index, with links to other sections of the site. Web sites are hosted on one or more Web servers, which transfer files to client computers or other servers that request them using the HTTP protocol. Although the term ?ite?implies a single physical location, the files and resources of a Web site may actually be spread among several servers in different geographic locations.(adapted from Britannica Concise Encyclopedia).

author(s)
sub property of: topObjectProperty
property disjoint with: bottomObjectProperty
type: ObjectProperty
comment: A list of agents primarily responsible for making the artifact, for example, a person, an organization, or a software service. The AgentList enables an ordered list of agents; however, domain applications may optionally choose to ignore the order. We should be able to derive that each agent is the dc:creator of the artifact.
range: List of Agents

to-language
sub property of: topObjectProperty
property disjoint with: bottomObjectProperty
type: ObjectProperty
comment: language used by the target.
domain: Translation Rule
range: Language

url
property disjoint with: isbn
property disjoint with: confidence
property disjoint with: name
property disjoint with: bottomDataProperty
property disjoint with: encoding
property disjoint with: from-row
property disjoint with: long pretty name
property disjoint with: version
property disjoint with: last modified
property disjoint with: abstract
property disjoint with: pretty-string
property disjoint with: to-column
property disjoint with: from-offset
property disjoint with: created
type: DatatypeProperty
property disjoint with: replacee
property disjoint with: usage-datetime
property disjoint with: to-row
property disjoint with: from-column
sub property of: topDataProperty
property disjoint with: data-collection-start-datetime
property disjoint with: english-description-template
property disjoint with: to-offset
property disjoint with: data-collection-end-datetime
property disjoint with: short pretty name
property disjoint with: pretty name
property disjoint with: raw-string
property disjoint with: mime-type
property disjoint with: published in
property disjoint with: escape character sequence
comment: The URL of a relevant web page.
domain: Information
range: anyURI

to-row
property disjoint with: pretty name
property disjoint with: published in
property disjoint with: url
property disjoint with: replacee
property disjoint with: long pretty name
property disjoint with: data-collection-start-datetime
property disjoint with: confidence
property disjoint with: last modified
property disjoint with: encoding
type: DatatypeProperty
property disjoint with: raw-string
property disjoint with: short pretty name
property disjoint with: mime-type
property disjoint with: english-description-template
property disjoint with: bottomDataProperty
property disjoint with: abstract
property disjoint with: usage-datetime
property disjoint with: escape character sequence
sub property of: topDataProperty
property disjoint with: data-collection-end-datetime
property disjoint with: pretty-string
property disjoint with: isbn
property disjoint with: created
property disjoint with: name
property disjoint with: version
comment: The to row of the fragment (inclusive, index based on 1)
domain: Document Fragment by Row/Column
range: int

created
property disjoint with: isbn
property disjoint with: from-row
property disjoint with: mime-type
property disjoint with: abstract
property disjoint with: pretty-string
property disjoint with: short pretty name
property disjoint with: from-column
type: DatatypeProperty
property disjoint with: raw-string
property disjoint with: confidence
property disjoint with: name
property disjoint with: to-row
property disjoint with: to-offset
sub property of: topDataProperty
property disjoint with: to-column
property disjoint with: pretty name
property disjoint with: version
property disjoint with: url
property disjoint with: encoding
property disjoint with: replacee
property disjoint with: english-description-template
property disjoint with: from-offset
property disjoint with: escape character sequence
property disjoint with: long pretty name
property disjoint with: bottomDataProperty
comment: When the artifact has been first created.
range: dateTime

short pretty name
sub property of: topDataProperty
sub property of: pretty name
property disjoint with: from-offset
property disjoint with: data-collection-start-datetime
property disjoint with: url
property disjoint with: published in
property disjoint with: usage-datetime
property disjoint with: to-row
property disjoint with: to-column
property disjoint with: bottomDataProperty
property disjoint with: data-collection-end-datetime
property disjoint with: from-row
property disjoint with: to-offset
property disjoint with: from-column
type: DatatypeProperty
property disjoint with: last modified
property disjoint with: created
property disjoint with: confidence

version
property disjoint with: last modified
property disjoint with: url
property disjoint with: confidence
property disjoint with: data-collection-start-datetime
property disjoint with: to-column
property disjoint with: published in
property disjoint with: data-collection-end-datetime
type: DatatypeProperty
property disjoint with: from-offset
sub property of: topDataProperty
property disjoint with: to-row
property disjoint with: created
property disjoint with: to-offset
property disjoint with: from-row
property disjoint with: usage-datetime
property disjoint with: from-column
property disjoint with: bottomDataProperty
comment: the version number.
range: string

mime-type
property disjoint with: confidence
property disjoint with: to-offset
property disjoint with: from-column
sub property of: topDataProperty
property disjoint with: published in
property disjoint with: last modified
property disjoint with: url
property disjoint with: usage-datetime
property disjoint with: to-row
property disjoint with: from-row
type: DatatypeProperty
property disjoint with: from-offset
property disjoint with: data-collection-end-datetime
property disjoint with: bottomDataProperty
property disjoint with: to-column
property disjoint with: data-collection-start-datetime
property disjoint with: created
comment: A well-defined string indicating the mime type of information content. Internet Media Types (MIME). see also http://www.iana.org/assignments/media-types/.
domain: Information
range: string

confidence
property disjoint with: pretty-string
property disjoint with: created
property disjoint with: short pretty name
property disjoint with: to-column
property disjoint with: abstract
property disjoint with: escape character sequence
property disjoint with: replacee
property disjoint with: to-row
property disjoint with: last modified
property disjoint with: isbn
property disjoint with: english-description-template
property disjoint with: from-offset
sub property of: topDataProperty
property disjoint with: usage-datetime
property disjoint with: from-column
property disjoint with: mime-type
property disjoint with: data-collection-end-datetime
property disjoint with: bottomDataProperty
property disjoint with: data-collection-start-datetime
property disjoint with: raw-string
property disjoint with: from-row
property disjoint with: published in
type: DatatypeProperty
property disjoint with: version
property disjoint with: encoding
property disjoint with: to-offset
property disjoint with: name
property disjoint with: url
property disjoint with: pretty name
property disjoint with: long pretty name
comment: this is a common property and can be used to describe an agent's confidence on a piece of information or an action step.It is typically used together with an object property indicating who asserted the confidence. For example, an inference engine may be one example. Although we did not specified its cardinality, it is typically used only once in one individual.
range: double

from-language
sub property of: topObjectProperty
property disjoint with: bottomObjectProperty
type: ObjectProperty
comment: language used by the source.
domain: Translation Rule
range: Language

Pretty Name Mapping
disjoint with: Nothing
subclass of: Thing
type: Class
comment: specially designed for pretty display purpose.
subclass of: http://lodlaundromat.org/.well-known/genid/4585ece82e36ebfa83b754bed3a71bb9#39
subclass of: http://lodlaundromat.org/.well-known/genid/4585ece82e36ebfa83b754bed3a71bb9#40

data-collection-end-datetime
property disjoint with: encoding
property disjoint with: from-offset
sub property of: topDataProperty
property disjoint with: version
property disjoint with: pretty name
property disjoint with: pretty-string
property disjoint with: to-row
property disjoint with: abstract
property disjoint with: from-row
type: DatatypeProperty
property disjoint with: bottomDataProperty
property disjoint with: mime-type
property disjoint with: name
property disjoint with: english-description-template
property disjoint with: isbn
property disjoint with: to-column
property disjoint with: short pretty name
property disjoint with: replacee
property disjoint with: url
property disjoint with: to-offset
property disjoint with: confidence
property disjoint with: raw-string
property disjoint with: from-column
property disjoint with: escape character sequence
property disjoint with: long pretty name
comment: the time stamp when data collection ended
domain: Learned Source Usage
range: dateTime

from-offset
property disjoint with: data-collection-end-datetime
property disjoint with: confidence
type: DatatypeProperty
sub property of: topDataProperty
property disjoint with: english-description-template
property disjoint with: name
property disjoint with: long pretty name
property disjoint with: abstract
property disjoint with: replacee
property disjoint with: usage-datetime
property disjoint with: url
property disjoint with: encoding
property disjoint with: created
property disjoint with: data-collection-start-datetime
property disjoint with: mime-type
property disjoint with: version
property disjoint with: pretty name
property disjoint with: pretty-string
property disjoint with: raw-string
property disjoint with: escape character sequence
property disjoint with: bottomDataProperty
property disjoint with: last modified
property disjoint with: short pretty name
property disjoint with: isbn
property disjoint with: published in
comment: The from offset of the fragment (inclusive, index based on 0).
domain: Document Fragment by Offset
range: int

Person
disjoint with: Ontology
disjoint with: Publication
subclass of: Source
type: Class
disjoint with: Dataset
subclass of: Thing
disjoint with: Website
subclass of: Agent
subclass of: Identified Thing
disjoint with: Nothing
disjoint with: Document
comment: A person

from-row
sub property of: topDataProperty
property disjoint with: replacee
property disjoint with: version
property disjoint with: long pretty name
property disjoint with: english-description-template
property disjoint with: short pretty name
property disjoint with: confidence
property disjoint with: escape character sequence
property disjoint with: abstract
property disjoint with: url
property disjoint with: last modified
property disjoint with: mime-type
property disjoint with: encoding
property disjoint with: raw-string
property disjoint with: usage-datetime
property disjoint with: name
property disjoint with: pretty-string
property disjoint with: data-collection-end-datetime
property disjoint with: data-collection-start-datetime
property disjoint with: bottomDataProperty
property disjoint with: published in
property disjoint with: created
property disjoint with: pretty name
type: DatatypeProperty
property disjoint with: isbn
comment: The from row of the fragment (inclusive, index based on 1)
domain: Document Fragment by Row/Column
range: int

pretty-string
property disjoint with: last modified
property disjoint with: data-collection-end-datetime
type: DatatypeProperty
property disjoint with: bottomDataProperty
property disjoint with: created
sub property of: topDataProperty
property disjoint with: from-column
property disjoint with: from-row
property disjoint with: from-offset
property disjoint with: to-row
property disjoint with: to-column
property disjoint with: usage-datetime
property disjoint with: url
property disjoint with: to-offset
property disjoint with: published in
property disjoint with: data-collection-start-datetime
property disjoint with: confidence
comment: the human friendly presentation of the information. Its format is text and it is usually written in English.
domain: Information
range: string

document
property disjoint with: member of
property disjoint with: member
type: ObjectProperty
property disjoint with: publisher
property disjoint with: bottomObjectProperty
property disjoint with: owner
sub property of: topObjectProperty
property disjoint with: uses-inference-engine
comment: A document fragment always depend on one source document, which is also the source.
domain: Document Fragment
range: Document

Learned Source Usage
disjoint with: Nothing
subclass of: Identified Thing
subclass of: Thing
subclass of: Source Usage
type: Class
comment: A special type of source usage. It records the modification of sources - the question that initiates the learning process, the duration of learning, the original source and current source used by learning.
subclass of: http://lodlaundromat.org/.well-known/genid/4585ece82e36ebfa83b754bed3a71bb9#30
subclass of: http://lodlaundromat.org/.well-known/genid/4585ece82e36ebfa83b754bed3a71bb9#31

uses-inference-rule
sub property of: topObjectProperty
property disjoint with: bottomObjectProperty
property disjoint with: publisher
type: ObjectProperty
comment: The inference rules used by the inference engine
domain: Inference Engine
range: Inference Rule

Ontology
disjoint with: Software
subclass of: Thing
disjoint with: Inference Engine
disjoint with: Agent
subclass of: Source
subclass of: Document
disjoint with: Organization
disjoint with: Web Service
subclass of: Identified Thing
disjoint with: Person
disjoint with: Nothing
disjoint with: Sensor
type: Class
comment: An Ontology is a document that describes a vocabulary of terms and their correlations.

Inference Rule
disjoint with: Nothing
subclass of: Identified Thing
subclass of: Thing
type: Class
comment: Inference rules are used to derive conclusions from premises. Inference Web divides inference rules into three classes: Primitive and Derived and Translation. This is an abstract class without any direct instance. A primitive rule is an atomic rule with respect to an inference engine. An inference engine may support rules that it does not need to further decompose. Since a primitive rule is an inference engine dependent concept, we may find a rule is primitive to one inference engine but not to another engine. For example a `natural deduction reasoner R1 may define Modus Ponens as a primitive rule and another reasoner R2 may register Robinson's resolution rule as a primitive rule. The reasoner R2 may be able to derive a Modus Ponens rule using its primitive resolution rule.
subclass of: http://lodlaundromat.org/.well-known/genid/4585ece82e36ebfa83b754bed3a71bb9#32
subclass of: http://lodlaundromat.org/.well-known/genid/4585ece82e36ebfa83b754bed3a71bb9#33

Identified Thing
disjoint with: Nothing
subclass of: Thing
type: Class
comment: The abstract root of provenance related concepts. It organizes a collection of common metadata about the referenced object, and it does not have any instance.
subclass of: http://lodlaundromat.org/.well-known/genid/4585ece82e36ebfa83b754bed3a71bb9#3
subclass of: http://lodlaundromat.org/.well-known/genid/4585ece82e36ebfa83b754bed3a71bb9#4
subclass of: http://lodlaundromat.org/.well-known/genid/4585ece82e36ebfa83b754bed3a71bb9#5
subclass of: http://lodlaundromat.org/.well-known/genid/4585ece82e36ebfa83b754bed3a71bb9#6

Method Rule
disjoint with: Nothing
subclass of: Inference Rule
subclass of: Identified Thing
subclass of: Thing
type: Class
comment: A method inference rule, uses patterns for premises and its conclusions, and additionally contains a method that must be applied. In addition, the conclusion needs to be a valid output of the method, using the premises. For example, procedural attachment is a common encoding form for method rules.

member
sub property of: topObjectProperty
property disjoint with: document
property disjoint with: bottomObjectProperty
property disjoint with: publisher
inverse of: member of
type: ObjectProperty
comment: An organization may have member agents such as persons and other organizations.
domain: Organization
range: Agent

Document Fragment by Offset
disjoint with: Nothing
subclass of: Source
subclass of: Identified Thing
subclass of: Thing
subclass of: Document Fragment
type: Class
comment: We may treat a document a one dimensional string, so we can mark a fragment with two offsets. We don't use byte because characters in text document may be multi-bytes.
subclass of: http://lodlaundromat.org/.well-known/genid/4585ece82e36ebfa83b754bed3a71bb9#21
subclass of: http://lodlaundromat.org/.well-known/genid/4585ece82e36ebfa83b754bed3a71bb9#22

content
sub property of: topObjectProperty
property disjoint with: bottomObjectProperty
type: ObjectProperty
comment: This is a common concept that links to a piece of information. Currently, we focus on content of document, and inference rule.
range: Information

Empty Information
disjoint with: Nothing
subclass of: Identified Thing
subclass of: Information
subclass of: Thing
type: Class
comment: An instance of information indicating no conclusion has been derived, i.e. empty set of statements. In this case, the rawstring may contain some english message indicating no answer.

uses-inference-engine
sub property of: topObjectProperty
property disjoint with: document
property disjoint with: bottomObjectProperty
property disjoint with: publisher
type: ObjectProperty
comment: The inference engine used by an agent
domain: Agent
range: Inference Engine

Web Service
type: Class
disjoint with: Dataset
subclass of: Source
disjoint with: Document
subclass of: Agent
disjoint with: Publication
subclass of: Identified Thing
subclass of: Software
disjoint with: Nothing
disjoint with: Ontology
subclass of: Thing
disjoint with: Website
comment: services implemented by software and available on the Web

Document Fragment by Row/Column
disjoint with: Nothing
subclass of: Source
subclass of: Identified Thing
subclass of: Thing
subclass of: Document Fragment
type: Class
subclass of: http://lodlaundromat.org/.well-known/genid/4585ece82e36ebfa83b754bed3a71bb9#23
subclass of: http://lodlaundromat.org/.well-known/genid/4585ece82e36ebfa83b754bed3a71bb9#24
subclass of: http://lodlaundromat.org/.well-known/genid/4585ece82e36ebfa83b754bed3a71bb9#25
subclass of: http://lodlaundromat.org/.well-known/genid/4585ece82e36ebfa83b754bed3a71bb9#26

pretty name mapping
sub property of: topObjectProperty
property disjoint with: bottomObjectProperty
type: ObjectProperty
comment: The rendering instruction. UI tools may feed the PrettyNameMapping in sequence to string replace operation to get a pretty rendering of the conclusion of a NodeSet. It only applies to the conclusion of the node set.
domain: Information
range: List of PrettyNameMappings

published in
property disjoint with: replacee
property disjoint with: pretty name
property disjoint with: version
property disjoint with: long pretty name
sub property of: topDataProperty
property disjoint with: english-description-template
property disjoint with: url
property disjoint with: isbn
property disjoint with: bottomDataProperty
property disjoint with: from-row
property disjoint with: from-column
property disjoint with: to-offset
property disjoint with: escape character sequence
property disjoint with: pretty-string
property disjoint with: raw-string
property disjoint with: name
property disjoint with: encoding
property disjoint with: short pretty name
property disjoint with: to-row
type: DatatypeProperty
property disjoint with: confidence
property disjoint with: from-offset
property disjoint with: mime-type
property disjoint with: abstract
property disjoint with: to-column
comment: When the publication is published.
domain: Publication
range: dateTime

Language
disjoint with: Nothing
subclass of: Identified Thing
subclass of: Thing
type: Class
comment: The language used to encode the raw string, e.g. English, Knowledge Interchange Format (KIF) , and N3. Languages are in general registered at the core IWRegistry.

usage-datetime
property disjoint with: url
property disjoint with: pretty-string
property disjoint with: abstract
property disjoint with: to-column
property disjoint with: name
sub property of: topDataProperty
property disjoint with: from-column
property disjoint with: replacee
property disjoint with: encoding
property disjoint with: version
property disjoint with: from-row
property disjoint with: confidence
property disjoint with: mime-type
property disjoint with: bottomDataProperty
property disjoint with: isbn
property disjoint with: to-row
property disjoint with: from-offset
property disjoint with: english-description-template
type: DatatypeProperty
property disjoint with: long pretty name
property disjoint with: to-offset
property disjoint with: escape character sequence
property disjoint with: short pretty name
property disjoint with: raw-string
property disjoint with: pretty name
comment: the time stamp when the source usage occurred.
domain: Source Usage
range: dateTime

escape character sequence
property disjoint with: last modified
property disjoint with: data-collection-start-datetime
property disjoint with: from-row
property disjoint with: bottomDataProperty
property disjoint with: data-collection-end-datetime
property disjoint with: url
property disjoint with: from-offset
property disjoint with: confidence
property disjoint with: to-row
property disjoint with: from-column
type: DatatypeProperty
sub property of: topDataProperty
property disjoint with: usage-datetime
property disjoint with: to-column
property disjoint with: published in
property disjoint with: to-offset
property disjoint with: created
comment: The escape character used by a (formal) language (for parse use). It is used more like a comment indicator. This is used by InferenceML to embed metalangauge for proof checking (talk to Priyendra Deshwa).
domain: Language
range: string

english-description-template
property disjoint with: from-offset
property disjoint with: to-row
property disjoint with: bottomDataProperty
property disjoint with: last modified
property disjoint with: published in
property disjoint with: url
property disjoint with: confidence
property disjoint with: from-column
sub property of: topDataProperty
property disjoint with: usage-datetime
type: DatatypeProperty
property disjoint with: from-row
property disjoint with: to-offset
property disjoint with: data-collection-end-datetime
property disjoint with: to-column
property disjoint with: data-collection-start-datetime
property disjoint with: created
comment: it is sub-property of rdfs:comment. It is also a simplified template for adding rule description template in English rather than using hasDescription.
domain: Inference Rule
range: string

isbn
property disjoint with: published in
property disjoint with: last modified
property disjoint with: to-column
sub property of: topDataProperty
property disjoint with: data-collection-start-datetime
type: DatatypeProperty
property disjoint with: url
property disjoint with: bottomDataProperty
property disjoint with: confidence
property disjoint with: to-offset
property disjoint with: created
property disjoint with: from-row
property disjoint with: from-offset
property disjoint with: to-row
property disjoint with: data-collection-end-datetime
property disjoint with: from-column
property disjoint with: usage-datetime
comment: The International Standard Book Number.
domain: Publication
range: string

format
sub property of: topObjectProperty
property disjoint with: bottomObjectProperty
type: ObjectProperty
comment: it specifies the format of information, e.g. "pdf", "ppt" (Power Point). It is mainly used to determine the appropriate application for process/display purpose.
domain: Information
range: Format

to-column
property disjoint with: raw-string
property disjoint with: name
property disjoint with: long pretty name
property disjoint with: last modified
property disjoint with: mime-type
property disjoint with: replacee
property disjoint with: data-collection-end-datetime
property disjoint with: url
property disjoint with: confidence
property disjoint with: short pretty name
type: DatatypeProperty
property disjoint with: isbn
property disjoint with: english-description-template
property disjoint with: pretty-string
property disjoint with: published in
property disjoint with: bottomDataProperty
property disjoint with: escape character sequence
property disjoint with: pretty name
sub property of: topDataProperty
property disjoint with: usage-datetime
property disjoint with: abstract
property disjoint with: data-collection-start-datetime
property disjoint with: created
property disjoint with: encoding
property disjoint with: version
comment: The to column of the fragment (inclusive, index based on 1)
domain: Document Fragment by Row/Column
range: int

Document Fragment
disjoint with: Nothing
subclass of: Source
subclass of: Identified Thing
subclass of: Thing
type: Class
comment: A fragment of document that can be used as source.
subclass of: http://lodlaundromat.org/.well-known/genid/4585ece82e36ebfa83b754bed3a71bb9#20

abstract
property disjoint with: data-collection-end-datetime
property disjoint with: published in
property disjoint with: url
property disjoint with: bottomDataProperty
property disjoint with: from-offset
property disjoint with: to-column
property disjoint with: from-column
property disjoint with: data-collection-start-datetime
property disjoint with: to-offset
type: DatatypeProperty
sub property of: topDataProperty
property disjoint with: usage-datetime
property disjoint with: created
property disjoint with: confidence
property disjoint with: last modified
property disjoint with: from-row
property disjoint with: to-row
comment: The abstract of a document.
domain: Document
range: string

Publication
type: Class
subclass of: Identified Thing
disjoint with: Agent
disjoint with: Organization
disjoint with: Nothing
subclass of: Thing
disjoint with: Inference Engine
disjoint with: Sensor
disjoint with: Software
subclass of: Document
disjoint with: Person
disjoint with: Web Service
subclass of: Source
comment: If we have two versions of the same publication, we need to create two instances of Publication. A publication may have multiple ISBNs.
subclass of: http://lodlaundromat.org/.well-known/genid/4585ece82e36ebfa83b754bed3a71bb9#18
subclass of: http://lodlaundromat.org/.well-known/genid/4585ece82e36ebfa83b754bed3a71bb9#19

reference source usage
sub property of: topObjectProperty
property disjoint with: bottomObjectProperty
type: ObjectProperty
comment: Explain how this information is obtained from a source: by whom, when, which source and which part of the source.
domain: Information
range: Source Usage

Software
type: Class
subclass of: Source
subclass of: Identified Thing
disjoint with: Nothing
disjoint with: Dataset
subclass of: Agent
disjoint with: Document
disjoint with: Ontology
disjoint with: Website
subclass of: Thing
disjoint with: Publication
comment: written programs or procedures or rules and associated documentation pertaining to the operation of a computer system and that are stored in read/write memory.(WordNet)
subclass of: http://lodlaundromat.org/.well-known/genid/4585ece82e36ebfa83b754bed3a71bb9#14

Dataset
subclass of: Thing
type: Class
disjoint with: Person
subclass of: Identified Thing
disjoint with: Agent
disjoint with: Sensor
subclass of: Document
disjoint with: Organization
disjoint with: Inference Engine
disjoint with: Nothing
subclass of: Source
disjoint with: Web Service
disjoint with: Software
comment: A dataset is a collection of data document whose information is encoded in a defined structure (for example, lists, tables, and databases). see also http://purl.org/dc/dcmitype/Dataset.

data-collection-start-datetime
type: DatatypeProperty
property disjoint with: mime-type
property disjoint with: confidence
property disjoint with: replacee
property disjoint with: encoding
property disjoint with: version
property disjoint with: from-offset
property disjoint with: pretty name
property disjoint with: raw-string
property disjoint with: from-column
property disjoint with: name
property disjoint with: long pretty name
sub property of: topDataProperty
property disjoint with: isbn
property disjoint with: abstract
property disjoint with: pretty-string
property disjoint with: english-description-template
property disjoint with: bottomDataProperty
property disjoint with: url
property disjoint with: short pretty name
property disjoint with: to-column
property disjoint with: from-row
property disjoint with: to-offset
property disjoint with: escape character sequence
property disjoint with: to-row
comment: the time stamp when data collection started
domain: Learned Source Usage
range: dateTime

publisher
type: ObjectProperty
property disjoint with: uses-inference-engine
property disjoint with: member of
property disjoint with: member
property disjoint with: document
property disjoint with: uses-inference-rule
property disjoint with: bottomObjectProperty
sub property of: topObjectProperty
comment: An agent responsible for making the document publicly available. see also http://purl.org/dc/elements/1.1/publisher.
domain: Document
range: Agent

from-column
property disjoint with: created
property disjoint with: raw-string
property disjoint with: confidence
property disjoint with: usage-datetime
property disjoint with: published in
property disjoint with: name
property disjoint with: version
property disjoint with: data-collection-end-datetime
property disjoint with: english-description-template
property disjoint with: pretty-string
type: DatatypeProperty
sub property of: topDataProperty
property disjoint with: isbn
property disjoint with: mime-type
property disjoint with: data-collection-start-datetime
property disjoint with: bottomDataProperty
property disjoint with: long pretty name
property disjoint with: short pretty name
property disjoint with: encoding
property disjoint with: url
property disjoint with: abstract
property disjoint with: last modified
property disjoint with: pretty name
property disjoint with: replacee
property disjoint with: escape character sequence
comment: The from column of the fragment (inclusive, index based on 1)
domain: Document Fragment by Row/Column
range: int

Inference Engine
subclass of: Identified Thing
disjoint with: Ontology
disjoint with: Nothing
type: Class
subclass of: Thing
subclass of: Agent
subclass of: Source
disjoint with: Dataset
disjoint with: Document
disjoint with: Website
subclass of: Software
disjoint with: Publication
comment: An inference engine represents an engine that is able to produce a justification for a conclusion. Note that the phrase "inference engine" applies not only to reasoners but also to other systems like search engines which may justify their answers by direct assertion
subclass of: http://lodlaundromat.org/.well-known/genid/4585ece82e36ebfa83b754bed3a71bb9#36

Source Usage
disjoint with: Nothing
subclass of: Identified Thing
subclass of: Thing
type: Class
comment: A usage of the source. It records an access of a source at a certain date time.
subclass of: http://lodlaundromat.org/.well-known/genid/4585ece82e36ebfa83b754bed3a71bb9#27
subclass of: http://lodlaundromat.org/.well-known/genid/4585ece82e36ebfa83b754bed3a71bb9#28
subclass of: http://lodlaundromat.org/.well-known/genid/4585ece82e36ebfa83b754bed3a71bb9#29

Document
subclass of: Source
disjoint with: Sensor
disjoint with: Web Service
subclass of: Thing
type: Class
disjoint with: Agent
disjoint with: Person
disjoint with: Nothing
disjoint with: Organization
subclass of: Identified Thing
disjoint with: Inference Engine
disjoint with: Software
comment: A physical information container that is not actionable. They function like database.
subclass of: http://lodlaundromat.org/.well-known/genid/4585ece82e36ebfa83b754bed3a71bb9#15
subclass of: http://lodlaundromat.org/.well-known/genid/4585ece82e36ebfa83b754bed3a71bb9#16
subclass of: http://lodlaundromat.org/.well-known/genid/4585ece82e36ebfa83b754bed3a71bb9#17

last modified
property disjoint with: encoding
property disjoint with: url
property disjoint with: escape character sequence
property disjoint with: abstract
property disjoint with: to-column
property disjoint with: version
property disjoint with: name
property disjoint with: from-row
property disjoint with: english-description-template
property disjoint with: confidence
property disjoint with: replacee
property disjoint with: to-row
property disjoint with: isbn
property disjoint with: bottomDataProperty
type: DatatypeProperty
property disjoint with: to-offset
property disjoint with: long pretty name
property disjoint with: mime-type
sub property of: topDataProperty
property disjoint with: from-column
property disjoint with: pretty name
property disjoint with: from-offset
property disjoint with: raw-string
property disjoint with: pretty-string
property disjoint with: short pretty name
comment: When the artifact has been modified.
range: dateTime

List of PrettyNameMappings
disjoint with: Nothing
subclass of: List
subclass of: Thing
type: Class
subclass of: http://lodlaundromat.org/.well-known/genid/4585ece82e36ebfa83b754bed3a71bb9#37
subclass of: http://lodlaundromat.org/.well-known/genid/4585ece82e36ebfa83b754bed3a71bb9#38

member of
sub property of: topObjectProperty
property disjoint with: document
property disjoint with: bottomObjectProperty
property disjoint with: publisher
inverse of: member
type: ObjectProperty
comment: An organization may have member agents such as persons and other organizations.
domain: Agent
range: Organization

source
sub property of: topObjectProperty
property disjoint with: bottomObjectProperty
type: ObjectProperty
comment: the source of the Source Usage, i.e. where does it come from.
domain: Source Usage
range: Source

description
sub property of: topObjectProperty
property disjoint with: bottomObjectProperty
type: ObjectProperty
comment: The detailed description of the identified thing, e.g. a web page describing KIF language. An identified thing may have zero to many descriptions that could be written in different languages, format, and etc.
domain: Identified Thing
range: Information

Information
disjoint with: Nothing
subclass of: Identified Thing
subclass of: Thing
type: Class
subclass of: http://lodlaundromat.org/.well-known/genid/4585ece82e36ebfa83b754bed3a71bb9#9
comment: A piece of information, e.g. a formula in logic languages, and an utterance/word/phrase/sentence/paragraph/article in natural language. It is used as a range of iw:hasContent. This class and two of its sub-classes enable users to specify four types of semantics (i) Information Annotation - annotate just the format and language used by the content of information; (ii) Information With Content - additionally provide the content of information that is materialized as string without loading a web page; (iii) Information external - additionally provide the URL for fetching the content; and (iv) Information - with every thing including the content string and URL. The second semantics is especially useful when the content is short or mainly used locally. For example, when learning by instruction, the utterances used for learning can be stored within the PML document without being externally stored. By assigning URI reference to information, we can even use owl:sameAs to capture the equivalence of two pieces of information.
subclass of: http://lodlaundromat.org/.well-known/genid/4585ece82e36ebfa83b754bed3a71bb9#13
subclass of: http://lodlaundromat.org/.well-known/genid/4585ece82e36ebfa83b754bed3a71bb9#8
subclass of: http://lodlaundromat.org/.well-known/genid/4585ece82e36ebfa83b754bed3a71bb9#7
subclass of: http://lodlaundromat.org/.well-known/genid/4585ece82e36ebfa83b754bed3a71bb9#12
subclass of: http://lodlaundromat.org/.well-known/genid/4585ece82e36ebfa83b754bed3a71bb9#10
subclass of: http://lodlaundromat.org/.well-known/genid/4585ece82e36ebfa83b754bed3a71bb9#11

Agent
disjoint with: Dataset
disjoint with: Ontology
disjoint with: Publication
subclass of: Thing
disjoint with: Document
subclass of: Identified Thing
subclass of: Source
disjoint with: Website
type: Class
disjoint with: Nothing
comment: actionalble entities.

long pretty name
property disjoint with: from-row
property disjoint with: usage-datetime
property disjoint with: created
property disjoint with: last modified
type: DatatypeProperty
property disjoint with: data-collection-start-datetime
sub property of: pretty name
property disjoint with: url
sub property of: topDataProperty
property disjoint with: confidence
property disjoint with: to-column
property disjoint with: from-column
property disjoint with: from-offset
property disjoint with: to-offset
property disjoint with: to-row
property disjoint with: bottomDataProperty
property disjoint with: published in
property disjoint with: data-collection-end-datetime

owner
sub property of: topObjectProperty
property disjoint with: document
property disjoint with: bottomObjectProperty
type: ObjectProperty
comment: the owner of a thing.
range: Agent

List of Agents
disjoint with: Nothing
subclass of: List
subclass of: Thing
type: Class
subclass of: http://lodlaundromat.org/.well-known/genid/4585ece82e36ebfa83b754bed3a71bb9#1
subclass of: http://lodlaundromat.org/.well-known/genid/4585ece82e36ebfa83b754bed3a71bb9#2

to-offset
property disjoint with: published in
property disjoint with: abstract
property disjoint with: url
property disjoint with: pretty name
property disjoint with: long pretty name
property disjoint with: data-collection-end-datetime
property disjoint with: version
type: DatatypeProperty
property disjoint with: last modified
property disjoint with: replacee
property disjoint with: name
property disjoint with: confidence
property disjoint with: created
property disjoint with: isbn
property disjoint with: short pretty name
property disjoint with: bottomDataProperty
property disjoint with: escape character sequence
property disjoint with: data-collection-start-datetime
sub property of: topDataProperty
property disjoint with: pretty-string
property disjoint with: raw-string
property disjoint with: usage-datetime
property disjoint with: mime-type
property disjoint with: english-description-template
property disjoint with: encoding
comment: The to offset of the fragment (exclusive, index based on 0)
domain: Document Fragment by Offset
range: int

raw-string
property disjoint with: usage-datetime
property disjoint with: url
property disjoint with: created
property disjoint with: data-collection-end-datetime
sub property of: topDataProperty
property disjoint with: from-row
property disjoint with: from-offset
property disjoint with: published in
property disjoint with: from-column
property disjoint with: last modified
property disjoint with: to-row
type: DatatypeProperty
property disjoint with: confidence
property disjoint with: to-column
property disjoint with: data-collection-start-datetime
property disjoint with: to-offset
property disjoint with: bottomDataProperty
comment: materialized version of the content of information
domain: Information
range: string

Declarative Rule
disjoint with: Nothing
subclass of: Inference Rule
subclass of: Identified Thing
subclass of: Thing
type: Class
comment: A declarative inference rule can be fully specified by patterns for premises and its conclusion. For example, Modus Ponens, can be specified by the premise patterns ?A, ?A -> ?B and the conclusion pattern ?B.

language
sub property of: topObjectProperty
property disjoint with: bottomObjectProperty
type: ObjectProperty
comment: it specifies the language used to encode information, e.g. "Tony's specialty is shellfish" is encoded in English. This property may also link to a registered formal language such as KIF.
domain: Information
range: Language

Organization
disjoint with: Dataset
subclass of: Identified Thing
disjoint with: Document
disjoint with: Website
disjoint with: Ontology
subclass of: Thing
disjoint with: Nothing
type: Class
disjoint with: Publication
subclass of: Agent
subclass of: Source
comment: A group of agents organized for a particular purpose, e.g., KSL, stanford.

rule example
sub property of: topObjectProperty
property disjoint with: bottomObjectProperty
type: ObjectProperty
comment: it is sub-property of rdfs:comment. It is used to provide an example to help users understand the referred entity.
domain: Inference Rule
range: Information

replacee
property disjoint with: data-collection-end-datetime
property disjoint with: from-column
property disjoint with: usage-datetime
property disjoint with: published in
type: DatatypeProperty
property disjoint with: from-row
property disjoint with: to-column
property disjoint with: to-row
property disjoint with: last modified
property disjoint with: url
property disjoint with: data-collection-start-datetime
property disjoint with: to-offset
sub property of: topDataProperty
property disjoint with: from-offset
property disjoint with: created
property disjoint with: bottomDataProperty
property disjoint with: confidence
domain: Pretty Name Mapping
range: string

http://lodlaundromat.org/.well-known/genid/4585ece82e36ebfa83b754bed3a71bb9#14
type: Restriction
max cardinality: 1
on property: version

http://lodlaundromat.org/.well-known/genid/4585ece82e36ebfa83b754bed3a71bb9#27
type: Restriction
cardinality: 1
on property: source

http://lodlaundromat.org/.well-known/genid/4585ece82e36ebfa83b754bed3a71bb9#7
type: Restriction
max cardinality: 1
on property: language

http://lodlaundromat.org/.well-known/genid/4585ece82e36ebfa83b754bed3a71bb9#21
type: Restriction
cardinality: 1
on property: from-offset

http://lodlaundromat.org/.well-known/genid/4585ece82e36ebfa83b754bed3a71bb9#34
type: Restriction
max cardinality: 1
on property: to-language

http://lodlaundromat.org/.well-known/genid/4585ece82e36ebfa83b754bed3a71bb9#19
type: Restriction
max cardinality: 1
on property: published in

http://lodlaundromat.org/.well-known/genid/4585ece82e36ebfa83b754bed3a71bb9#13
type: Restriction
max cardinality: 1
on property: reference source usage

http://lodlaundromat.org/.well-known/genid/4585ece82e36ebfa83b754bed3a71bb9#26
type: Restriction
cardinality: 1
on property: from-row

http://lodlaundromat.org/.well-known/genid/4585ece82e36ebfa83b754bed3a71bb9#39
type: Restriction
cardinality: 1
on property: replacee

http://lodlaundromat.org/.well-known/genid/4585ece82e36ebfa83b754bed3a71bb9#6
type: Restriction
max cardinality: 1
on property: owner

http://lodlaundromat.org/.well-known/genid/4585ece82e36ebfa83b754bed3a71bb9#20
type: Restriction
cardinality: 1
on property: document

http://lodlaundromat.org/.well-known/genid/4585ece82e36ebfa83b754bed3a71bb9#33
type: Restriction
max cardinality: 1
on property: content

http://lodlaundromat.org/.well-known/genid/4585ece82e36ebfa83b754bed3a71bb9#18
type: Restriction
max cardinality: 1
on property: isbn

http://lodlaundromat.org/.well-known/genid/4585ece82e36ebfa83b754bed3a71bb9#40
type: Restriction
cardinality: 1
on property: short pretty name

http://lodlaundromat.org/.well-known/genid/4585ece82e36ebfa83b754bed3a71bb9#12
type: Restriction
max cardinality: 1
on property: pretty name mapping

http://lodlaundromat.org/.well-known/genid/4585ece82e36ebfa83b754bed3a71bb9#25
type: Restriction
cardinality: 1
on property: from-column

http://lodlaundromat.org/.well-known/genid/4585ece82e36ebfa83b754bed3a71bb9#5
type: Restriction
max cardinality: 1
on property: created

http://lodlaundromat.org/.well-known/genid/4585ece82e36ebfa83b754bed3a71bb9#32
type: Restriction
max cardinality: 1
on property: english-description-template

http://lodlaundromat.org/.well-known/genid/4585ece82e36ebfa83b754bed3a71bb9#17
type: Restriction
max cardinality: 1
on property: abstract

http://lodlaundromat.org/.well-known/genid/4585ece82e36ebfa83b754bed3a71bb9#11
type: Restriction
max cardinality: 1
on property: raw-string

http://lodlaundromat.org/.well-known/genid/4585ece82e36ebfa83b754bed3a71bb9#24
type: Restriction
cardinality: 1
on property: to-column

http://lodlaundromat.org/.well-known/genid/4585ece82e36ebfa83b754bed3a71bb9#4
type: Restriction
max cardinality: 1
on property: author(s)

http://lodlaundromat.org/.well-known/genid/4585ece82e36ebfa83b754bed3a71bb9#31
type: Restriction
max cardinality: 1
on property: data-collection-end-datetime

http://lodlaundromat.org/.well-known/genid/4585ece82e36ebfa83b754bed3a71bb9#16
type: Restriction
max cardinality: 1
on property: version

http://lodlaundromat.org/.well-known/genid/4585ece82e36ebfa83b754bed3a71bb9#29
type: Restriction
max cardinality: 1
on property: query-content

http://lodlaundromat.org/.well-known/genid/4585ece82e36ebfa83b754bed3a71bb9#10
type: Restriction
max cardinality: 1
on property: pretty-string

http://lodlaundromat.org/.well-known/genid/4585ece82e36ebfa83b754bed3a71bb9#9
type: Restriction
max cardinality: 1
on property: url

http://lodlaundromat.org/.well-known/genid/4585ece82e36ebfa83b754bed3a71bb9#23
type: Restriction
cardinality: 1
on property: to-row

http://lodlaundromat.org/.well-known/genid/4585ece82e36ebfa83b754bed3a71bb9#36
type: Restriction
min cardinality: 1
on property: uses-inference-rule

http://lodlaundromat.org/.well-known/genid/4585ece82e36ebfa83b754bed3a71bb9#3
type: Restriction
max cardinality: 1
on property: name

PML2 provenance ontology
type: Ontology
comment: The provenance part of PML2 ontology. It is a fundamental component of PML2 ontology.
version info: version 2.0, Authors: Deborah L. McGuinness, Li Ding, Paulo Pinheiro da Silva, Alyssa Glass, and Cynthia Chang
imports: ds.owl#

http://lodlaundromat.org/.well-known/genid/4585ece82e36ebfa83b754bed3a71bb9#30
type: Restriction
max cardinality: 1
on property: data-collection-start-datetime

http://lodlaundromat.org/.well-known/genid/4585ece82e36ebfa83b754bed3a71bb9#15
type: Restriction
max cardinality: 1
on property: content

http://lodlaundromat.org/.well-known/genid/4585ece82e36ebfa83b754bed3a71bb9#28
type: Restriction
cardinality: 1
on property: usage-datetime

http://lodlaundromat.org/.well-known/genid/4585ece82e36ebfa83b754bed3a71bb9#8
type: Restriction
max cardinality: 1
on property: format

http://lodlaundromat.org/.well-known/genid/4585ece82e36ebfa83b754bed3a71bb9#22
type: Restriction
cardinality: 1
on property: to-offset

http://lodlaundromat.org/.well-known/genid/4585ece82e36ebfa83b754bed3a71bb9#35
type: Restriction
max cardinality: 1
on property: from-language