Calendar Day
subclass of: Thing
subclass of: Resource
type: Class
comment: A class for calendar aligned one day intervals, starting at 00:00 (midnight) on the relevant day. ISO 8601(E):2004 Section 2.2.6
subclass of: http://lodlaundromat.org/.well-known/genid/b15634fcd88e4a40e28a2f022818e851#1
subclass of: http://lodlaundromat.org/.well-known/genid/b15634fcd88e4a40e28a2f022818e851#2
subclass of: CalendarInterval (class)
subclass of: Generic Day (Class)
subclass of: http://lodlaundromat.org/.well-known/genid/b15634fcd88e4a40e28a2f022818e851#13
subclass of: http://lodlaundromat.org/.well-known/genid/b15634fcd88e4a40e28a2f022818e851#8
subclass of: http://lodlaundromat.org/.well-known/genid/b15634fcd88e4a40e28a2f022818e851#32
subclass of: http://lodlaundromat.org/.well-known/genid/b15634fcd88e4a40e28a2f022818e851#16
subclass of: http://lodlaundromat.org/.well-known/genid/b15634fcd88e4a40e28a2f022818e851#15
subclass of: http://lodlaundromat.org/.well-known/genid/b15634fcd88e4a40e28a2f022818e851#12
subclass of: http://lodlaundromat.org/.well-known/genid/b15634fcd88e4a40e28a2f022818e851#33
subclass of: http://lodlaundromat.org/.well-known/genid/b15634fcd88e4a40e28a2f022818e851#11
subclass of: http://lodlaundromat.org/.well-known/genid/b15634fcd88e4a40e28a2f022818e851#34
subclass of: http://lodlaundromat.org/.well-known/genid/b15634fcd88e4a40e28a2f022818e851#64
subclass of: http://lodlaundromat.org/.well-known/genid/b15634fcd88e4a40e28a2f022818e851#10
subclass of: http://lodlaundromat.org/.well-known/genid/b15634fcd88e4a40e28a2f022818e851#9
subclass of: DateTimeInterval
subclass of: http://lodlaundromat.org/.well-known/genid/b15634fcd88e4a40e28a2f022818e851#14
subclass of: Dimension
subclass of: http://lodlaundromat.org/.well-known/genid/b15634fcd88e4a40e28a2f022818e851#35
subclass of: http://lodlaundromat.org/.well-known/genid/b15634fcd88e4a40e28a2f022818e851#135
subclass of: http://lodlaundromat.org/.well-known/genid/b15634fcd88e4a40e28a2f022818e851#138
subclass of: Interval
subclass of: http://lodlaundromat.org/.well-known/genid/b15634fcd88e4a40e28a2f022818e851#208
subclass of: http://lodlaundromat.org/.well-known/genid/b15634fcd88e4a40e28a2f022818e851#201
subclass of: http://lodlaundromat.org/.well-known/genid/b15634fcd88e4a40e28a2f022818e851#182
subclass of: http://lodlaundromat.org/.well-known/genid/b15634fcd88e4a40e28a2f022818e851#151
subclass of: http://lodlaundromat.org/.well-known/genid/b15634fcd88e4a40e28a2f022818e851#158
subclass of: http://lodlaundromat.org/.well-known/genid/b15634fcd88e4a40e28a2f022818e851#215
subclass of: http://lodlaundromat.org/.well-known/genid/b15634fcd88e4a40e28a2f022818e851#164
subclass of: http://lodlaundromat.org/.well-known/genid/b15634fcd88e4a40e28a2f022818e851#190
subclass of: http://lodlaundromat.org/.well-known/genid/b15634fcd88e4a40e28a2f022818e851#145
subclass of: http://lodlaundromat.org/.well-known/genid/b15634fcd88e4a40e28a2f022818e851#58

Q1 Interval
subclass of: http://lodlaundromat.org/.well-known/genid/b15634fcd88e4a40e28a2f022818e851#93
subclass of: Resource
type: Class
subclass of: Thing
subclass of: http://lodlaundromat.org/.well-known/genid/b15634fcd88e4a40e28a2f022818e851#104
subclass of: http://lodlaundromat.org/.well-known/genid/b15634fcd88e4a40e28a2f022818e851#99
subclass of: http://lodlaundromat.org/.well-known/genid/b15634fcd88e4a40e28a2f022818e851#89
subclass of: http://lodlaundromat.org/.well-known/genid/b15634fcd88e4a40e28a2f022818e851#108
comment: A class for intervals that are the first quarter of a (nominally) annual cycle.
subclass of: http://lodlaundromat.org/.well-known/genid/b15634fcd88e4a40e28a2f022818e851#88
subclass of: Generic Quarter (Class)
subclass of: http://lodlaundromat.org/.well-known/genid/b15634fcd88e4a40e28a2f022818e851#117
subclass of: http://lodlaundromat.org/.well-known/genid/b15634fcd88e4a40e28a2f022818e851#114
subclass of: http://lodlaundromat.org/.well-known/genid/b15634fcd88e4a40e28a2f022818e851#115
subclass of: http://lodlaundromat.org/.well-known/genid/b15634fcd88e4a40e28a2f022818e851#135
subclass of: Interval
subclass of: http://lodlaundromat.org/.well-known/genid/b15634fcd88e4a40e28a2f022818e851#190
subclass of: http://lodlaundromat.org/.well-known/genid/b15634fcd88e4a40e28a2f022818e851#116
subclass of: http://lodlaundromat.org/.well-known/genid/b15634fcd88e4a40e28a2f022818e851#164
subclass of: Dimension
subclass of: http://lodlaundromat.org/.well-known/genid/b15634fcd88e4a40e28a2f022818e851#58
subclass of: DateTimeInterval

February
type: month of year
comment: The month of February
type: http://lodlaundromat.org/.well-known/genid/b15634fcd88e4a40e28a2f022818e851#182
type: Thing

Calendar Minute
subclass of: Thing
type: Class
subclass of: Resource
comment: A class for calendar align one minute intervals. ISO 8601(E):2004 Section 2.2.3 (for units - 1 minute interval are not defined).
subclass of: http://lodlaundromat.org/.well-known/genid/b15634fcd88e4a40e28a2f022818e851#17
subclass of: http://lodlaundromat.org/.well-known/genid/b15634fcd88e4a40e28a2f022818e851#18
subclass of: CalendarInterval (class)
subclass of: Generic Minute (Class)
subclass of: http://lodlaundromat.org/.well-known/genid/b15634fcd88e4a40e28a2f022818e851#9
subclass of: http://lodlaundromat.org/.well-known/genid/b15634fcd88e4a40e28a2f022818e851#64
subclass of: http://lodlaundromat.org/.well-known/genid/b15634fcd88e4a40e28a2f022818e851#10
subclass of: http://lodlaundromat.org/.well-known/genid/b15634fcd88e4a40e28a2f022818e851#12
subclass of: http://lodlaundromat.org/.well-known/genid/b15634fcd88e4a40e28a2f022818e851#71
subclass of: http://lodlaundromat.org/.well-known/genid/b15634fcd88e4a40e28a2f022818e851#67
subclass of: http://lodlaundromat.org/.well-known/genid/b15634fcd88e4a40e28a2f022818e851#16
subclass of: http://lodlaundromat.org/.well-known/genid/b15634fcd88e4a40e28a2f022818e851#70
subclass of: http://lodlaundromat.org/.well-known/genid/b15634fcd88e4a40e28a2f022818e851#11
subclass of: http://lodlaundromat.org/.well-known/genid/b15634fcd88e4a40e28a2f022818e851#13
subclass of: http://lodlaundromat.org/.well-known/genid/b15634fcd88e4a40e28a2f022818e851#69
subclass of: http://lodlaundromat.org/.well-known/genid/b15634fcd88e4a40e28a2f022818e851#8
subclass of: http://lodlaundromat.org/.well-known/genid/b15634fcd88e4a40e28a2f022818e851#68
subclass of: http://lodlaundromat.org/.well-known/genid/b15634fcd88e4a40e28a2f022818e851#14
subclass of: http://lodlaundromat.org/.well-known/genid/b15634fcd88e4a40e28a2f022818e851#66
subclass of: http://lodlaundromat.org/.well-known/genid/b15634fcd88e4a40e28a2f022818e851#15
subclass of: http://lodlaundromat.org/.well-known/genid/b15634fcd88e4a40e28a2f022818e851#135
subclass of: Dimension
subclass of: DateTimeInterval
subclass of: http://lodlaundromat.org/.well-known/genid/b15634fcd88e4a40e28a2f022818e851#208
subclass of: http://lodlaundromat.org/.well-known/genid/b15634fcd88e4a40e28a2f022818e851#158
subclass of: http://lodlaundromat.org/.well-known/genid/b15634fcd88e4a40e28a2f022818e851#201
subclass of: http://lodlaundromat.org/.well-known/genid/b15634fcd88e4a40e28a2f022818e851#190
subclass of: http://lodlaundromat.org/.well-known/genid/b15634fcd88e4a40e28a2f022818e851#178
subclass of: http://lodlaundromat.org/.well-known/genid/b15634fcd88e4a40e28a2f022818e851#215
subclass of: http://lodlaundromat.org/.well-known/genid/b15634fcd88e4a40e28a2f022818e851#58
subclass of: http://lodlaundromat.org/.well-known/genid/b15634fcd88e4a40e28a2f022818e851#145
subclass of: http://lodlaundromat.org/.well-known/genid/b15634fcd88e4a40e28a2f022818e851#182
subclass of: http://lodlaundromat.org/.well-known/genid/b15634fcd88e4a40e28a2f022818e851#151
subclass of: http://lodlaundromat.org/.well-known/genid/b15634fcd88e4a40e28a2f022818e851#138
subclass of: http://lodlaundromat.org/.well-known/genid/b15634fcd88e4a40e28a2f022818e851#173
subclass of: Interval
subclass of: http://lodlaundromat.org/.well-known/genid/b15634fcd88e4a40e28a2f022818e851#164

H1 Interval
type: Class
subclass of: Thing
subclass of: http://lodlaundromat.org/.well-known/genid/b15634fcd88e4a40e28a2f022818e851#37
subclass of: http://lodlaundromat.org/.well-known/genid/b15634fcd88e4a40e28a2f022818e851#41
subclass of: Resource
comment: A class for intervals that the first half of a (nominally) annual cycle.
subclass of: http://lodlaundromat.org/.well-known/genid/b15634fcd88e4a40e28a2f022818e851#36
subclass of: Generic Half (Class)
subclass of: http://lodlaundromat.org/.well-known/genid/b15634fcd88e4a40e28a2f022818e851#49
subclass of: http://lodlaundromat.org/.well-known/genid/b15634fcd88e4a40e28a2f022818e851#47
subclass of: http://lodlaundromat.org/.well-known/genid/b15634fcd88e4a40e28a2f022818e851#48
subclass of: http://lodlaundromat.org/.well-known/genid/b15634fcd88e4a40e28a2f022818e851#46
subclass of: http://lodlaundromat.org/.well-known/genid/b15634fcd88e4a40e28a2f022818e851#45
subclass of: Interval
subclass of: http://lodlaundromat.org/.well-known/genid/b15634fcd88e4a40e28a2f022818e851#164
subclass of: http://lodlaundromat.org/.well-known/genid/b15634fcd88e4a40e28a2f022818e851#135
subclass of: http://lodlaundromat.org/.well-known/genid/b15634fcd88e4a40e28a2f022818e851#58
subclass of: Dimension
subclass of: DateTimeInterval

http://lodlaundromat.org/.well-known/genid/b15634fcd88e4a40e28a2f022818e851#115
subclass of: Resource
subclass of: Thing
type: Class
type: Restriction
has value: P3M
on property: hasXsdDurationDescription (DataTypeProperty)
subclass of: http://lodlaundromat.org/.well-known/genid/b15634fcd88e4a40e28a2f022818e851#135

November
type: month of year
comment: The month of Novermber
type: http://lodlaundromat.org/.well-known/genid/b15634fcd88e4a40e28a2f022818e851#182
type: Thing

http://lodlaundromat.org/.well-known/genid/b15634fcd88e4a40e28a2f022818e851#53
subclass of: Resource
subclass of: Thing
type: Class
type: Restriction
max cardinality: 3601
on property: intervalContainsSecond

http://lodlaundromat.org/.well-known/genid/b15634fcd88e4a40e28a2f022818e851#23
subclass of: Thing
type: Class
subclass of: Resource
type: Restriction
cardinality: 3
on property: intervalContainsMonth

Calendar Month
subclass of: Thing
type: Class
subclass of: Resource
subclass of: CalendarInterval (class)
subclass of: http://lodlaundromat.org/.well-known/genid/b15634fcd88e4a40e28a2f022818e851#20
comment: A class for calendar aligned intervals of one calendar month. ISO 8601(E):2004 Section 2.2.11
subclass of: http://lodlaundromat.org/.well-known/genid/b15634fcd88e4a40e28a2f022818e851#22
subclass of: Generic Month (Class)
subclass of: http://lodlaundromat.org/.well-known/genid/b15634fcd88e4a40e28a2f022818e851#21
subclass of: http://lodlaundromat.org/.well-known/genid/b15634fcd88e4a40e28a2f022818e851#19
subclass of: http://lodlaundromat.org/.well-known/genid/b15634fcd88e4a40e28a2f022818e851#10
subclass of: http://lodlaundromat.org/.well-known/genid/b15634fcd88e4a40e28a2f022818e851#64
subclass of: http://lodlaundromat.org/.well-known/genid/b15634fcd88e4a40e28a2f022818e851#9
subclass of: http://lodlaundromat.org/.well-known/genid/b15634fcd88e4a40e28a2f022818e851#11
subclass of: http://lodlaundromat.org/.well-known/genid/b15634fcd88e4a40e28a2f022818e851#13
subclass of: http://lodlaundromat.org/.well-known/genid/b15634fcd88e4a40e28a2f022818e851#15
subclass of: http://lodlaundromat.org/.well-known/genid/b15634fcd88e4a40e28a2f022818e851#16
subclass of: http://lodlaundromat.org/.well-known/genid/b15634fcd88e4a40e28a2f022818e851#75
subclass of: http://lodlaundromat.org/.well-known/genid/b15634fcd88e4a40e28a2f022818e851#73
subclass of: http://lodlaundromat.org/.well-known/genid/b15634fcd88e4a40e28a2f022818e851#72
subclass of: http://lodlaundromat.org/.well-known/genid/b15634fcd88e4a40e28a2f022818e851#12
subclass of: http://lodlaundromat.org/.well-known/genid/b15634fcd88e4a40e28a2f022818e851#74
subclass of: http://lodlaundromat.org/.well-known/genid/b15634fcd88e4a40e28a2f022818e851#8
subclass of: http://lodlaundromat.org/.well-known/genid/b15634fcd88e4a40e28a2f022818e851#14
subclass of: http://lodlaundromat.org/.well-known/genid/b15634fcd88e4a40e28a2f022818e851#135
subclass of: Dimension
subclass of: DateTimeInterval
subclass of: http://lodlaundromat.org/.well-known/genid/b15634fcd88e4a40e28a2f022818e851#138
subclass of: Interval
subclass of: http://lodlaundromat.org/.well-known/genid/b15634fcd88e4a40e28a2f022818e851#190
subclass of: http://lodlaundromat.org/.well-known/genid/b15634fcd88e4a40e28a2f022818e851#182
subclass of: http://lodlaundromat.org/.well-known/genid/b15634fcd88e4a40e28a2f022818e851#164
subclass of: http://lodlaundromat.org/.well-known/genid/b15634fcd88e4a40e28a2f022818e851#58

http://lodlaundromat.org/.well-known/genid/b15634fcd88e4a40e28a2f022818e851#35
subclass of: Resource
subclass of: Thing
type: Class
type: Restriction
has value: P1D
on property: hasXsdDurationDescription (DataTypeProperty)
subclass of: http://lodlaundromat.org/.well-known/genid/b15634fcd88e4a40e28a2f022818e851#135

July
type: month of year
comment: The month of July
type: http://lodlaundromat.org/.well-known/genid/b15634fcd88e4a40e28a2f022818e851#182
type: Thing

Calendar Second
subclass of: Resource
subclass of: Thing
type: Class
comment: A class for calendar aligned one-second intervals. ISO 8601(E):2004 Section 2.2.1 (and 2.2.2 for leap seconds)(for units - 1 second interval are not defined).
subclass of: http://lodlaundromat.org/.well-known/genid/b15634fcd88e4a40e28a2f022818e851#25
subclass of: http://lodlaundromat.org/.well-known/genid/b15634fcd88e4a40e28a2f022818e851#26
subclass of: CalendarInterval (class)
subclass of: Generic Second (Class)
subclass of: http://lodlaundromat.org/.well-known/genid/b15634fcd88e4a40e28a2f022818e851#64
subclass of: http://lodlaundromat.org/.well-known/genid/b15634fcd88e4a40e28a2f022818e851#10
subclass of: http://lodlaundromat.org/.well-known/genid/b15634fcd88e4a40e28a2f022818e851#16
subclass of: http://lodlaundromat.org/.well-known/genid/b15634fcd88e4a40e28a2f022818e851#11
subclass of: http://lodlaundromat.org/.well-known/genid/b15634fcd88e4a40e28a2f022818e851#13
subclass of: http://lodlaundromat.org/.well-known/genid/b15634fcd88e4a40e28a2f022818e851#12
subclass of: http://lodlaundromat.org/.well-known/genid/b15634fcd88e4a40e28a2f022818e851#9
subclass of: http://lodlaundromat.org/.well-known/genid/b15634fcd88e4a40e28a2f022818e851#8
subclass of: http://lodlaundromat.org/.well-known/genid/b15634fcd88e4a40e28a2f022818e851#15
subclass of: http://lodlaundromat.org/.well-known/genid/b15634fcd88e4a40e28a2f022818e851#118
subclass of: http://lodlaundromat.org/.well-known/genid/b15634fcd88e4a40e28a2f022818e851#120
subclass of: http://lodlaundromat.org/.well-known/genid/b15634fcd88e4a40e28a2f022818e851#14
subclass of: http://lodlaundromat.org/.well-known/genid/b15634fcd88e4a40e28a2f022818e851#119
subclass of: http://lodlaundromat.org/.well-known/genid/b15634fcd88e4a40e28a2f022818e851#121
subclass of: DateTimeInterval
subclass of: Dimension
subclass of: http://lodlaundromat.org/.well-known/genid/b15634fcd88e4a40e28a2f022818e851#198
subclass of: http://lodlaundromat.org/.well-known/genid/b15634fcd88e4a40e28a2f022818e851#58
subclass of: http://lodlaundromat.org/.well-known/genid/b15634fcd88e4a40e28a2f022818e851#182
subclass of: http://lodlaundromat.org/.well-known/genid/b15634fcd88e4a40e28a2f022818e851#173
subclass of: http://lodlaundromat.org/.well-known/genid/b15634fcd88e4a40e28a2f022818e851#138
subclass of: http://lodlaundromat.org/.well-known/genid/b15634fcd88e4a40e28a2f022818e851#151
subclass of: http://lodlaundromat.org/.well-known/genid/b15634fcd88e4a40e28a2f022818e851#164
subclass of: http://lodlaundromat.org/.well-known/genid/b15634fcd88e4a40e28a2f022818e851#215
subclass of: http://lodlaundromat.org/.well-known/genid/b15634fcd88e4a40e28a2f022818e851#158
subclass of: http://lodlaundromat.org/.well-known/genid/b15634fcd88e4a40e28a2f022818e851#190
subclass of: http://lodlaundromat.org/.well-known/genid/b15634fcd88e4a40e28a2f022818e851#145
subclass of: Interval
subclass of: http://lodlaundromat.org/.well-known/genid/b15634fcd88e4a40e28a2f022818e851#201
subclass of: http://lodlaundromat.org/.well-known/genid/b15634fcd88e4a40e28a2f022818e851#208
subclass of: http://lodlaundromat.org/.well-known/genid/b15634fcd88e4a40e28a2f022818e851#178
subclass of: http://lodlaundromat.org/.well-known/genid/b15634fcd88e4a40e28a2f022818e851#135

http://lodlaundromat.org/.well-known/genid/b15634fcd88e4a40e28a2f022818e851#122
type: Class
subclass of: Thing
subclass of: Resource
type: Restriction
cardinality: 7
on property: intervalContainsDay
subclass of: http://lodlaundromat.org/.well-known/genid/b15634fcd88e4a40e28a2f022818e851#62
equivalent class: http://lodlaundromat.org/.well-known/genid/b15634fcd88e4a40e28a2f022818e851#62

September
type: month of year
comment: The month of September
type: http://lodlaundromat.org/.well-known/genid/b15634fcd88e4a40e28a2f022818e851#182
type: Thing

December
type: month of year
comment: The month of December
type: http://lodlaundromat.org/.well-known/genid/b15634fcd88e4a40e28a2f022818e851#182
type: Thing

http://lodlaundromat.org/.well-known/genid/b15634fcd88e4a40e28a2f022818e851#134
subclass of: Resource
subclass of: Thing
type: Class
type: Restriction
max cardinality: 380
on property: intervalContainsDay

Generic Day (Class)
type: Class
subclass of: http://lodlaundromat.org/.well-known/genid/b15634fcd88e4a40e28a2f022818e851#190
subclass of: http://lodlaundromat.org/.well-known/genid/b15634fcd88e4a40e28a2f022818e851#215
subclass of: Resource
subclass of: http://lodlaundromat.org/.well-known/genid/b15634fcd88e4a40e28a2f022818e851#145
subclass of: http://lodlaundromat.org/.well-known/genid/b15634fcd88e4a40e28a2f022818e851#164
subclass of: http://lodlaundromat.org/.well-known/genid/b15634fcd88e4a40e28a2f022818e851#138
subclass of: http://lodlaundromat.org/.well-known/genid/b15634fcd88e4a40e28a2f022818e851#182
subclass of: Thing
subclass of: http://lodlaundromat.org/.well-known/genid/b15634fcd88e4a40e28a2f022818e851#208
subclass of: http://lodlaundromat.org/.well-known/genid/b15634fcd88e4a40e28a2f022818e851#158
subclass of: http://lodlaundromat.org/.well-known/genid/b15634fcd88e4a40e28a2f022818e851#151
subclass of: http://lodlaundromat.org/.well-known/genid/b15634fcd88e4a40e28a2f022818e851#201
comment: A generic superclass for all day like entities.
subclass of: http://lodlaundromat.org/.well-known/genid/b15634fcd88e4a40e28a2f022818e851#32
subclass of: http://lodlaundromat.org/.well-known/genid/b15634fcd88e4a40e28a2f022818e851#33
subclass of: http://lodlaundromat.org/.well-known/genid/b15634fcd88e4a40e28a2f022818e851#34
subclass of: http://lodlaundromat.org/.well-known/genid/b15634fcd88e4a40e28a2f022818e851#35
subclass of: Interval
subclass of: http://lodlaundromat.org/.well-known/genid/b15634fcd88e4a40e28a2f022818e851#58
subclass of: Dimension
subclass of: DateTimeInterval
subclass of: http://lodlaundromat.org/.well-known/genid/b15634fcd88e4a40e28a2f022818e851#135

Q2 Interval
subclass of: Thing
subclass of: http://lodlaundromat.org/.well-known/genid/b15634fcd88e4a40e28a2f022818e851#89
type: Class
subclass of: Resource
comment: A class for intervals that are 2nd quarters of a (nominally) annual cycle
subclass of: http://lodlaundromat.org/.well-known/genid/b15634fcd88e4a40e28a2f022818e851#92
subclass of: http://lodlaundromat.org/.well-known/genid/b15634fcd88e4a40e28a2f022818e851#96
subclass of: Generic Quarter (Class)
subclass of: http://lodlaundromat.org/.well-known/genid/b15634fcd88e4a40e28a2f022818e851#115
subclass of: http://lodlaundromat.org/.well-known/genid/b15634fcd88e4a40e28a2f022818e851#116
subclass of: http://lodlaundromat.org/.well-known/genid/b15634fcd88e4a40e28a2f022818e851#117
subclass of: http://lodlaundromat.org/.well-known/genid/b15634fcd88e4a40e28a2f022818e851#114
subclass of: http://lodlaundromat.org/.well-known/genid/b15634fcd88e4a40e28a2f022818e851#135
subclass of: http://lodlaundromat.org/.well-known/genid/b15634fcd88e4a40e28a2f022818e851#190
subclass of: Interval
subclass of: http://lodlaundromat.org/.well-known/genid/b15634fcd88e4a40e28a2f022818e851#164
subclass of: http://lodlaundromat.org/.well-known/genid/b15634fcd88e4a40e28a2f022818e851#58
subclass of: DateTimeInterval
subclass of: Dimension

August
type: month of year
comment: The month of August
type: http://lodlaundromat.org/.well-known/genid/b15634fcd88e4a40e28a2f022818e851#182
type: Thing

H2 Interval
subclass of: http://lodlaundromat.org/.well-known/genid/b15634fcd88e4a40e28a2f022818e851#37
subclass of: Resource
type: Class
subclass of: Thing
comment: A class for intervals that the second half of a (nominally) annual cycle.
subclass of: http://lodlaundromat.org/.well-known/genid/b15634fcd88e4a40e28a2f022818e851#40
subclass of: Generic Half (Class)
subclass of: http://lodlaundromat.org/.well-known/genid/b15634fcd88e4a40e28a2f022818e851#46
subclass of: http://lodlaundromat.org/.well-known/genid/b15634fcd88e4a40e28a2f022818e851#45
subclass of: http://lodlaundromat.org/.well-known/genid/b15634fcd88e4a40e28a2f022818e851#48
subclass of: http://lodlaundromat.org/.well-known/genid/b15634fcd88e4a40e28a2f022818e851#49
subclass of: http://lodlaundromat.org/.well-known/genid/b15634fcd88e4a40e28a2f022818e851#47
subclass of: http://lodlaundromat.org/.well-known/genid/b15634fcd88e4a40e28a2f022818e851#164
subclass of: Interval
subclass of: http://lodlaundromat.org/.well-known/genid/b15634fcd88e4a40e28a2f022818e851#135
subclass of: DateTimeInterval
subclass of: Dimension
subclass of: http://lodlaundromat.org/.well-known/genid/b15634fcd88e4a40e28a2f022818e851#58

March
type: month of year
comment: The month of March
type: http://lodlaundromat.org/.well-known/genid/b15634fcd88e4a40e28a2f022818e851#182
type: Thing

http://lodlaundromat.org/.well-known/genid/b15634fcd88e4a40e28a2f022818e851#128
subclass of: Resource
subclass of: Thing
type: Class
type: Restriction
min cardinality: 351
on property: intervalContainsDay

Calendar Week
subclass of: Resource
type: Class
subclass of: Thing
subclass of: CalendarInterval (class)
subclass of: http://lodlaundromat.org/.well-known/genid/b15634fcd88e4a40e28a2f022818e851#63
subclass of: http://lodlaundromat.org/.well-known/genid/b15634fcd88e4a40e28a2f022818e851#62
subclass of: http://lodlaundromat.org/.well-known/genid/b15634fcd88e4a40e28a2f022818e851#65
preferred label: ISO 8601 Week
subclass of: Generice Week (Class)
subclass of: http://lodlaundromat.org/.well-known/genid/b15634fcd88e4a40e28a2f022818e851#64
comment: A class for calendar weeks. Strictly not all calendar week intervals are contained within the year to which they may be attributed. The first or last week of a given calendar year may inculde days from the preceding or following calendar year respectively. An ISO 8601 week starts at 00:00:00 in a Monday and ends at the last moment of 23:59:59 on the following Sunday. ISO 8601(E):2004 Section 2.2.8
subclass of: http://lodlaundromat.org/.well-known/genid/b15634fcd88e4a40e28a2f022818e851#122
subclass of: http://lodlaundromat.org/.well-known/genid/b15634fcd88e4a40e28a2f022818e851#16
subclass of: http://lodlaundromat.org/.well-known/genid/b15634fcd88e4a40e28a2f022818e851#126
subclass of: http://lodlaundromat.org/.well-known/genid/b15634fcd88e4a40e28a2f022818e851#125
subclass of: http://lodlaundromat.org/.well-known/genid/b15634fcd88e4a40e28a2f022818e851#13
subclass of: http://lodlaundromat.org/.well-known/genid/b15634fcd88e4a40e28a2f022818e851#9
subclass of: http://lodlaundromat.org/.well-known/genid/b15634fcd88e4a40e28a2f022818e851#14
subclass of: http://lodlaundromat.org/.well-known/genid/b15634fcd88e4a40e28a2f022818e851#8
subclass of: http://lodlaundromat.org/.well-known/genid/b15634fcd88e4a40e28a2f022818e851#123
subclass of: http://lodlaundromat.org/.well-known/genid/b15634fcd88e4a40e28a2f022818e851#10
subclass of: http://lodlaundromat.org/.well-known/genid/b15634fcd88e4a40e28a2f022818e851#124
subclass of: http://lodlaundromat.org/.well-known/genid/b15634fcd88e4a40e28a2f022818e851#11
subclass of: http://lodlaundromat.org/.well-known/genid/b15634fcd88e4a40e28a2f022818e851#15
subclass of: http://lodlaundromat.org/.well-known/genid/b15634fcd88e4a40e28a2f022818e851#12
subclass of: http://lodlaundromat.org/.well-known/genid/b15634fcd88e4a40e28a2f022818e851#135
subclass of: DateTimeInterval
subclass of: Dimension
subclass of: http://lodlaundromat.org/.well-known/genid/b15634fcd88e4a40e28a2f022818e851#208
subclass of: http://lodlaundromat.org/.well-known/genid/b15634fcd88e4a40e28a2f022818e851#201
subclass of: http://lodlaundromat.org/.well-known/genid/b15634fcd88e4a40e28a2f022818e851#58
subclass of: Interval

http://lodlaundromat.org/.well-known/genid/b15634fcd88e4a40e28a2f022818e851#66
subclass of: Resource
subclass of: Thing
type: Class
type: Restriction
max cardinality: 61
on property: intervalContainsSecond

month of year
range: Thing
domain: Thing
type: ObjectProperty
comment: The month of the year in which a contained instant or interval (of duration one month or less) occurs.
domain: http://lodlaundromat.org/.well-known/genid/b15634fcd88e4a40e28a2f022818e851#138
range: month of year
type: Property
domain: Resource
range: http://lodlaundromat.org/.well-known/genid/b15634fcd88e4a40e28a2f022818e851#182
range: Resource

hasXsdDurationDescription (DataTypeProperty)
type: Property
type: DatatypeProperty
comment: hasXsdDurationDescription: a data type property for associating an xsd:duration with an Interval. Inspired by "durationDescriptionDataType" mentioned in "http://www.w3.org/TR/owl-time" but which seems to have failed to make it into the formal ontology.
domain: http://lodlaundromat.org/.well-known/genid/b15634fcd88e4a40e28a2f022818e851#135
range: duration
domain: Resource
domain: Thing
range: Resource

http://lodlaundromat.org/.well-known/genid/b15634fcd88e4a40e28a2f022818e851#123
subclass of: Resource
subclass of: Thing
type: Class
type: Restriction
has value: P7D
on property: hasXsdDurationDescription (DataTypeProperty)
subclass of: http://lodlaundromat.org/.well-known/genid/b15634fcd88e4a40e28a2f022818e851#135

Generice Week (Class)
type: Class
subclass of: http://lodlaundromat.org/.well-known/genid/b15634fcd88e4a40e28a2f022818e851#208
subclass of: http://lodlaundromat.org/.well-known/genid/b15634fcd88e4a40e28a2f022818e851#201
subclass of: Resource
subclass of: Thing
subclass of: http://lodlaundromat.org/.well-known/genid/b15634fcd88e4a40e28a2f022818e851#126
comment: A generic superclass for all one-week long (7 day) intervals.
subclass of: Interval
subclass of: http://lodlaundromat.org/.well-known/genid/b15634fcd88e4a40e28a2f022818e851#124
subclass of: http://lodlaundromat.org/.well-known/genid/b15634fcd88e4a40e28a2f022818e851#122
label: Generic Week (Class)
subclass of: http://lodlaundromat.org/.well-known/genid/b15634fcd88e4a40e28a2f022818e851#125
subclass of: http://lodlaundromat.org/.well-known/genid/b15634fcd88e4a40e28a2f022818e851#123
subclass of: http://lodlaundromat.org/.well-known/genid/b15634fcd88e4a40e28a2f022818e851#62
subclass of: http://lodlaundromat.org/.well-known/genid/b15634fcd88e4a40e28a2f022818e851#135
subclass of: DateTimeInterval
subclass of: Dimension
subclass of: http://lodlaundromat.org/.well-known/genid/b15634fcd88e4a40e28a2f022818e851#58

May
type: month of year
comment: The month of May
type: http://lodlaundromat.org/.well-known/genid/b15634fcd88e4a40e28a2f022818e851#182
type: Thing

http://lodlaundromat.org/.well-known/genid/b15634fcd88e4a40e28a2f022818e851#31
subclass of: Resource
type: Class
subclass of: Thing
type: Restriction
cardinality: 12
on property: intervalContainsMonth

Q3 Interval
subclass of: http://lodlaundromat.org/.well-known/genid/b15634fcd88e4a40e28a2f022818e851#93
subclass of: Resource
subclass of: Thing
type: Class
comment: A class for intervals that are 3rd quarters of a (nominally) annual cycle
subclass of: http://lodlaundromat.org/.well-known/genid/b15634fcd88e4a40e28a2f022818e851#97
subclass of: http://lodlaundromat.org/.well-known/genid/b15634fcd88e4a40e28a2f022818e851#98
subclass of: Generic Quarter (Class)
subclass of: http://lodlaundromat.org/.well-known/genid/b15634fcd88e4a40e28a2f022818e851#117
subclass of: http://lodlaundromat.org/.well-known/genid/b15634fcd88e4a40e28a2f022818e851#135
subclass of: http://lodlaundromat.org/.well-known/genid/b15634fcd88e4a40e28a2f022818e851#115
subclass of: http://lodlaundromat.org/.well-known/genid/b15634fcd88e4a40e28a2f022818e851#114
subclass of: http://lodlaundromat.org/.well-known/genid/b15634fcd88e4a40e28a2f022818e851#116
subclass of: Interval
subclass of: http://lodlaundromat.org/.well-known/genid/b15634fcd88e4a40e28a2f022818e851#190
subclass of: http://lodlaundromat.org/.well-known/genid/b15634fcd88e4a40e28a2f022818e851#164
subclass of: DateTimeInterval
subclass of: http://lodlaundromat.org/.well-known/genid/b15634fcd88e4a40e28a2f022818e851#58
subclass of: Dimension

H3 Interval
subclass of: Resource
type: Class
subclass of: Thing
subclass of: http://lodlaundromat.org/.well-known/genid/b15634fcd88e4a40e28a2f022818e851#41
comment: A class for 3rd half year intervals in an abnormally long annual interval - in the UK a buisness interval may exceptionally extent to 6 quarters.
subclass of: http://lodlaundromat.org/.well-known/genid/b15634fcd88e4a40e28a2f022818e851#44
subclass of: Generic Half (Class)
subclass of: http://lodlaundromat.org/.well-known/genid/b15634fcd88e4a40e28a2f022818e851#49
subclass of: http://lodlaundromat.org/.well-known/genid/b15634fcd88e4a40e28a2f022818e851#45
subclass of: http://lodlaundromat.org/.well-known/genid/b15634fcd88e4a40e28a2f022818e851#48
subclass of: http://lodlaundromat.org/.well-known/genid/b15634fcd88e4a40e28a2f022818e851#47
subclass of: http://lodlaundromat.org/.well-known/genid/b15634fcd88e4a40e28a2f022818e851#46
subclass of: http://lodlaundromat.org/.well-known/genid/b15634fcd88e4a40e28a2f022818e851#164
subclass of: Interval
subclass of: http://lodlaundromat.org/.well-known/genid/b15634fcd88e4a40e28a2f022818e851#135
subclass of: http://lodlaundromat.org/.well-known/genid/b15634fcd88e4a40e28a2f022818e851#58
subclass of: Dimension
subclass of: DateTimeInterval

Business Intervals
subclass of: Thing
subclass of: Resource
type: Class
comment: A top-level class for business intervals
subclass of: Dimension
subclass of: DateTimeInterval

Half Year Interval
subclass of: Thing
type: Class
subclass of: Resource
comment: A class for business half year intervals. These intervals are not necessarily calendar aligned with month boundaries.
subclass of: Business Intervals
subclass of: Generic Half (Class)
subclass of: http://lodlaundromat.org/.well-known/genid/b15634fcd88e4a40e28a2f022818e851#46
subclass of: http://lodlaundromat.org/.well-known/genid/b15634fcd88e4a40e28a2f022818e851#45
subclass of: http://lodlaundromat.org/.well-known/genid/b15634fcd88e4a40e28a2f022818e851#48
subclass of: http://lodlaundromat.org/.well-known/genid/b15634fcd88e4a40e28a2f022818e851#47
subclass of: http://lodlaundromat.org/.well-known/genid/b15634fcd88e4a40e28a2f022818e851#49
subclass of: DateTimeInterval
subclass of: Dimension
subclass of: Interval
subclass of: http://lodlaundromat.org/.well-known/genid/b15634fcd88e4a40e28a2f022818e851#164
subclass of: http://lodlaundromat.org/.well-known/genid/b15634fcd88e4a40e28a2f022818e851#135
subclass of: http://lodlaundromat.org/.well-known/genid/b15634fcd88e4a40e28a2f022818e851#58

http://lodlaundromat.org/.well-known/genid/b15634fcd88e4a40e28a2f022818e851#55
type: Class
subclass of: Resource
subclass of: Thing
type: Restriction
cardinality: 60
on property: intervalContainsMinute

http://lodlaundromat.org/.well-known/genid/b15634fcd88e4a40e28a2f022818e851#129
type: Class
subclass of: Thing
subclass of: Resource
type: Restriction
cardinality: 4
on property: intervalContainsQuarter

http://lodlaundromat.org/.well-known/genid/b15634fcd88e4a40e28a2f022818e851#130
subclass of: Resource
type: Class
subclass of: Thing
type: Restriction
cardinality: 2
on property: intervalContainsHalf

January
type: month of year
comment: The month of January
type: http://lodlaundromat.org/.well-known/genid/b15634fcd88e4a40e28a2f022818e851#182
type: Thing

http://lodlaundromat.org/.well-known/genid/b15634fcd88e4a40e28a2f022818e851#49
type: Class
subclass of: Resource
subclass of: Thing
type: Restriction
cardinality: 2
on property: intervalContainsQuarter

Generic Half (Class)
type: Class
subclass of: http://lodlaundromat.org/.well-known/genid/b15634fcd88e4a40e28a2f022818e851#164
subclass of: Resource
subclass of: Thing
subclass of: Interval
subclass of: http://lodlaundromat.org/.well-known/genid/b15634fcd88e4a40e28a2f022818e851#45
subclass of: http://lodlaundromat.org/.well-known/genid/b15634fcd88e4a40e28a2f022818e851#48
comment: A generic superclass for all half-year (6 month) like intervals
subclass of: http://lodlaundromat.org/.well-known/genid/b15634fcd88e4a40e28a2f022818e851#47
subclass of: http://lodlaundromat.org/.well-known/genid/b15634fcd88e4a40e28a2f022818e851#46
subclass of: http://lodlaundromat.org/.well-known/genid/b15634fcd88e4a40e28a2f022818e851#49
subclass of: http://lodlaundromat.org/.well-known/genid/b15634fcd88e4a40e28a2f022818e851#135
subclass of: Dimension
subclass of: DateTimeInterval
subclass of: http://lodlaundromat.org/.well-known/genid/b15634fcd88e4a40e28a2f022818e851#58

http://lodlaundromat.org/.well-known/genid/b15634fcd88e4a40e28a2f022818e851#50
subclass of: Resource
subclass of: Thing
type: Class
type: Restriction
min cardinality: 3599
on property: intervalContainsSecond

http://lodlaundromat.org/.well-known/genid/b15634fcd88e4a40e28a2f022818e851#3
type: Class
subclass of: Resource
subclass of: Thing
type: Restriction
cardinality: 6
on property: intervalContainsMonth

http://lodlaundromat.org/.well-known/genid/b15634fcd88e4a40e28a2f022818e851#62
subclass of: Thing
subclass of: Resource
type: Class
type: Restriction
cardinality: 7
on property: intervalContainsDay
subclass of: http://lodlaundromat.org/.well-known/genid/b15634fcd88e4a40e28a2f022818e851#122
equivalent class: http://lodlaundromat.org/.well-known/genid/b15634fcd88e4a40e28a2f022818e851#122

Q4 Interval
subclass of: Resource
subclass of: Thing
subclass of: http://lodlaundromat.org/.well-known/genid/b15634fcd88e4a40e28a2f022818e851#99
type: Class
comment: A class for intervals that are 4th quarters of a (nominally) annual cycle.
subclass of: http://lodlaundromat.org/.well-known/genid/b15634fcd88e4a40e28a2f022818e851#102
subclass of: http://lodlaundromat.org/.well-known/genid/b15634fcd88e4a40e28a2f022818e851#103
subclass of: Generic Quarter (Class)
subclass of: http://lodlaundromat.org/.well-known/genid/b15634fcd88e4a40e28a2f022818e851#117
subclass of: http://lodlaundromat.org/.well-known/genid/b15634fcd88e4a40e28a2f022818e851#116
subclass of: http://lodlaundromat.org/.well-known/genid/b15634fcd88e4a40e28a2f022818e851#115
subclass of: http://lodlaundromat.org/.well-known/genid/b15634fcd88e4a40e28a2f022818e851#135
subclass of: http://lodlaundromat.org/.well-known/genid/b15634fcd88e4a40e28a2f022818e851#114
subclass of: http://lodlaundromat.org/.well-known/genid/b15634fcd88e4a40e28a2f022818e851#190
subclass of: Interval
subclass of: http://lodlaundromat.org/.well-known/genid/b15634fcd88e4a40e28a2f022818e851#164
subclass of: DateTimeInterval
subclass of: http://lodlaundromat.org/.well-known/genid/b15634fcd88e4a40e28a2f022818e851#58
subclass of: Dimension

CalendarHalf (class)
subclass of: Thing
subclass of: Resource
type: Class
comment: A class for calendar aligned intervals that represent a calendar half year, a year being split into two half year periods of 6 months each.
subclass of: http://lodlaundromat.org/.well-known/genid/b15634fcd88e4a40e28a2f022818e851#3
subclass of: http://lodlaundromat.org/.well-known/genid/b15634fcd88e4a40e28a2f022818e851#4
subclass of: http://lodlaundromat.org/.well-known/genid/b15634fcd88e4a40e28a2f022818e851#5
subclass of: CalendarInterval (class)
subclass of: Generic Half (Class)
subclass of: http://lodlaundromat.org/.well-known/genid/b15634fcd88e4a40e28a2f022818e851#15
subclass of: http://lodlaundromat.org/.well-known/genid/b15634fcd88e4a40e28a2f022818e851#14
subclass of: http://lodlaundromat.org/.well-known/genid/b15634fcd88e4a40e28a2f022818e851#12
subclass of: http://lodlaundromat.org/.well-known/genid/b15634fcd88e4a40e28a2f022818e851#16
subclass of: http://lodlaundromat.org/.well-known/genid/b15634fcd88e4a40e28a2f022818e851#47
subclass of: http://lodlaundromat.org/.well-known/genid/b15634fcd88e4a40e28a2f022818e851#48
subclass of: http://lodlaundromat.org/.well-known/genid/b15634fcd88e4a40e28a2f022818e851#11
subclass of: http://lodlaundromat.org/.well-known/genid/b15634fcd88e4a40e28a2f022818e851#8
subclass of: http://lodlaundromat.org/.well-known/genid/b15634fcd88e4a40e28a2f022818e851#45
subclass of: http://lodlaundromat.org/.well-known/genid/b15634fcd88e4a40e28a2f022818e851#46
subclass of: http://lodlaundromat.org/.well-known/genid/b15634fcd88e4a40e28a2f022818e851#64
subclass of: http://lodlaundromat.org/.well-known/genid/b15634fcd88e4a40e28a2f022818e851#10
subclass of: http://lodlaundromat.org/.well-known/genid/b15634fcd88e4a40e28a2f022818e851#49
subclass of: http://lodlaundromat.org/.well-known/genid/b15634fcd88e4a40e28a2f022818e851#13
subclass of: http://lodlaundromat.org/.well-known/genid/b15634fcd88e4a40e28a2f022818e851#9
subclass of: DateTimeInterval
subclass of: Dimension
subclass of: http://lodlaundromat.org/.well-known/genid/b15634fcd88e4a40e28a2f022818e851#164
subclass of: Interval
subclass of: http://lodlaundromat.org/.well-known/genid/b15634fcd88e4a40e28a2f022818e851#135
subclass of: http://lodlaundromat.org/.well-known/genid/b15634fcd88e4a40e28a2f022818e851#58

http://lodlaundromat.org/.well-known/genid/b15634fcd88e4a40e28a2f022818e851#74
subclass of: Resource
subclass of: Thing
type: Class
type: Restriction
has value: P1M
on property: hasXsdDurationDescription (DataTypeProperty)
subclass of: http://lodlaundromat.org/.well-known/genid/b15634fcd88e4a40e28a2f022818e851#135

day of week
range: Thing
domain: Thing
type: ObjectProperty
comment: The day of the week in which an instant or interval (of duration one day or less) occurs.
range: DayOfWeek
type: Property
domain: Resource
range: Resource
range: http://lodlaundromat.org/.well-known/genid/b15634fcd88e4a40e28a2f022818e851#151

http://lodlaundromat.org/.well-known/genid/b15634fcd88e4a40e28a2f022818e851#68
subclass of: Resource
subclass of: Thing
type: Class
type: Restriction
min cardinality: 59
on property: intervalContainsSecond

Generic Month (Class)
subclass of: http://lodlaundromat.org/.well-known/genid/b15634fcd88e4a40e28a2f022818e851#138
subclass of: http://lodlaundromat.org/.well-known/genid/b15634fcd88e4a40e28a2f022818e851#182
subclass of: Thing
subclass of: http://lodlaundromat.org/.well-known/genid/b15634fcd88e4a40e28a2f022818e851#164
type: Class
subclass of: http://lodlaundromat.org/.well-known/genid/b15634fcd88e4a40e28a2f022818e851#190
subclass of: Resource
comment: A generic superclass class for all month-long like intervals.
subclass of: http://lodlaundromat.org/.well-known/genid/b15634fcd88e4a40e28a2f022818e851#72
subclass of: http://lodlaundromat.org/.well-known/genid/b15634fcd88e4a40e28a2f022818e851#73
subclass of: http://lodlaundromat.org/.well-known/genid/b15634fcd88e4a40e28a2f022818e851#74
subclass of: http://lodlaundromat.org/.well-known/genid/b15634fcd88e4a40e28a2f022818e851#75
subclass of: Interval
subclass of: http://lodlaundromat.org/.well-known/genid/b15634fcd88e4a40e28a2f022818e851#135
subclass of: http://lodlaundromat.org/.well-known/genid/b15634fcd88e4a40e28a2f022818e851#58
subclass of: Dimension
subclass of: DateTimeInterval

http://lodlaundromat.org/.well-known/genid/b15634fcd88e4a40e28a2f022818e851#51
subclass of: Resource
subclass of: Thing
type: Class
type: Restriction
has value: PT1H
on property: hasXsdDurationDescription (DataTypeProperty)
subclass of: http://lodlaundromat.org/.well-known/genid/b15634fcd88e4a40e28a2f022818e851#135

http://lodlaundromat.org/.well-known/genid/b15634fcd88e4a40e28a2f022818e851#21
subclass of: Resource
subclass of: Thing
type: Class
type: Restriction
max cardinality: 31
on property: intervalContainsDay

Generic Hour (class)
subclass of: http://lodlaundromat.org/.well-known/genid/b15634fcd88e4a40e28a2f022818e851#190
subclass of: Thing
subclass of: http://lodlaundromat.org/.well-known/genid/b15634fcd88e4a40e28a2f022818e851#208
subclass of: http://lodlaundromat.org/.well-known/genid/b15634fcd88e4a40e28a2f022818e851#164
subclass of: Resource
subclass of: http://lodlaundromat.org/.well-known/genid/b15634fcd88e4a40e28a2f022818e851#201
subclass of: http://lodlaundromat.org/.well-known/genid/b15634fcd88e4a40e28a2f022818e851#138
subclass of: http://lodlaundromat.org/.well-known/genid/b15634fcd88e4a40e28a2f022818e851#145
subclass of: http://lodlaundromat.org/.well-known/genid/b15634fcd88e4a40e28a2f022818e851#182
subclass of: http://lodlaundromat.org/.well-known/genid/b15634fcd88e4a40e28a2f022818e851#158
subclass of: http://lodlaundromat.org/.well-known/genid/b15634fcd88e4a40e28a2f022818e851#215
subclass of: http://lodlaundromat.org/.well-known/genid/b15634fcd88e4a40e28a2f022818e851#173
subclass of: http://lodlaundromat.org/.well-known/genid/b15634fcd88e4a40e28a2f022818e851#151
type: Class
subclass of: http://lodlaundromat.org/.well-known/genid/b15634fcd88e4a40e28a2f022818e851#54
subclass of: Interval
subclass of: http://lodlaundromat.org/.well-known/genid/b15634fcd88e4a40e28a2f022818e851#52
subclass of: http://lodlaundromat.org/.well-known/genid/b15634fcd88e4a40e28a2f022818e851#55
subclass of: http://lodlaundromat.org/.well-known/genid/b15634fcd88e4a40e28a2f022818e851#50
comment: A generic superclass for hour-long intervals. An hour may contain a positive or negative leap second (see http://en.wikipedia.org/wiki/Hour).
subclass of: http://lodlaundromat.org/.well-known/genid/b15634fcd88e4a40e28a2f022818e851#56
subclass of: http://lodlaundromat.org/.well-known/genid/b15634fcd88e4a40e28a2f022818e851#53
subclass of: http://lodlaundromat.org/.well-known/genid/b15634fcd88e4a40e28a2f022818e851#51
subclass of: http://lodlaundromat.org/.well-known/genid/b15634fcd88e4a40e28a2f022818e851#135
subclass of: Dimension
subclass of: http://lodlaundromat.org/.well-known/genid/b15634fcd88e4a40e28a2f022818e851#58
subclass of: DateTimeInterval

Q5 Interval
type: Class
subclass of: http://lodlaundromat.org/.well-known/genid/b15634fcd88e4a40e28a2f022818e851#104
subclass of: Resource
subclass of: Thing
comment: A class for 5th quarters of an abnormally long annual interval - in the UK a buisness interval may exceptionally extent to 6 quarters.
subclass of: http://lodlaundromat.org/.well-known/genid/b15634fcd88e4a40e28a2f022818e851#107
subclass of: http://lodlaundromat.org/.well-known/genid/b15634fcd88e4a40e28a2f022818e851#111
subclass of: Generic Quarter (Class)
subclass of: http://lodlaundromat.org/.well-known/genid/b15634fcd88e4a40e28a2f022818e851#114
subclass of: http://lodlaundromat.org/.well-known/genid/b15634fcd88e4a40e28a2f022818e851#116
subclass of: http://lodlaundromat.org/.well-known/genid/b15634fcd88e4a40e28a2f022818e851#117
subclass of: http://lodlaundromat.org/.well-known/genid/b15634fcd88e4a40e28a2f022818e851#115
subclass of: http://lodlaundromat.org/.well-known/genid/b15634fcd88e4a40e28a2f022818e851#135
subclass of: http://lodlaundromat.org/.well-known/genid/b15634fcd88e4a40e28a2f022818e851#190
subclass of: http://lodlaundromat.org/.well-known/genid/b15634fcd88e4a40e28a2f022818e851#164
subclass of: Interval
subclass of: http://lodlaundromat.org/.well-known/genid/b15634fcd88e4a40e28a2f022818e851#58
subclass of: Dimension
subclass of: DateTimeInterval

Business Year
subclass of: Thing
type: Class
subclass of: Resource
comment: A class for regular annual business reporting and planning intervals, not necessarily calendar aligned.
subclass of: Business Intervals
subclass of: Generic Year (Class)
subclass of: http://lodlaundromat.org/.well-known/genid/b15634fcd88e4a40e28a2f022818e851#134
subclass of: http://lodlaundromat.org/.well-known/genid/b15634fcd88e4a40e28a2f022818e851#127
subclass of: http://lodlaundromat.org/.well-known/genid/b15634fcd88e4a40e28a2f022818e851#131
subclass of: http://lodlaundromat.org/.well-known/genid/b15634fcd88e4a40e28a2f022818e851#128
subclass of: http://lodlaundromat.org/.well-known/genid/b15634fcd88e4a40e28a2f022818e851#133
subclass of: http://lodlaundromat.org/.well-known/genid/b15634fcd88e4a40e28a2f022818e851#129
subclass of: http://lodlaundromat.org/.well-known/genid/b15634fcd88e4a40e28a2f022818e851#130
subclass of: http://lodlaundromat.org/.well-known/genid/b15634fcd88e4a40e28a2f022818e851#132
subclass of: http://lodlaundromat.org/.well-known/genid/b15634fcd88e4a40e28a2f022818e851#135
subclass of: Interval
subclass of: DateTimeInterval
subclass of: Dimension
subclass of: http://lodlaundromat.org/.well-known/genid/b15634fcd88e4a40e28a2f022818e851#58

January
type: month of year
comment: The month of June
preferred label: June
type: http://lodlaundromat.org/.well-known/genid/b15634fcd88e4a40e28a2f022818e851#182
type: Thing

Calendar Hour (Class)
subclass of: Thing
subclass of: Resource
type: Class
comment: A class for calendar aligned hour-long intervals. ISO 8601(E):2004 Section 2.2.4
subclass of: http://lodlaundromat.org/.well-known/genid/b15634fcd88e4a40e28a2f022818e851#6
subclass of: http://lodlaundromat.org/.well-known/genid/b15634fcd88e4a40e28a2f022818e851#7
subclass of: CalendarInterval (class)
subclass of: Generic Hour (class)
subclass of: http://lodlaundromat.org/.well-known/genid/b15634fcd88e4a40e28a2f022818e851#13
subclass of: http://lodlaundromat.org/.well-known/genid/b15634fcd88e4a40e28a2f022818e851#14
subclass of: http://lodlaundromat.org/.well-known/genid/b15634fcd88e4a40e28a2f022818e851#52
subclass of: http://lodlaundromat.org/.well-known/genid/b15634fcd88e4a40e28a2f022818e851#11
subclass of: http://lodlaundromat.org/.well-known/genid/b15634fcd88e4a40e28a2f022818e851#15
subclass of: http://lodlaundromat.org/.well-known/genid/b15634fcd88e4a40e28a2f022818e851#54
subclass of: http://lodlaundromat.org/.well-known/genid/b15634fcd88e4a40e28a2f022818e851#12
subclass of: http://lodlaundromat.org/.well-known/genid/b15634fcd88e4a40e28a2f022818e851#16
subclass of: http://lodlaundromat.org/.well-known/genid/b15634fcd88e4a40e28a2f022818e851#8
subclass of: http://lodlaundromat.org/.well-known/genid/b15634fcd88e4a40e28a2f022818e851#55
subclass of: http://lodlaundromat.org/.well-known/genid/b15634fcd88e4a40e28a2f022818e851#53
subclass of: http://lodlaundromat.org/.well-known/genid/b15634fcd88e4a40e28a2f022818e851#50
subclass of: http://lodlaundromat.org/.well-known/genid/b15634fcd88e4a40e28a2f022818e851#64
subclass of: http://lodlaundromat.org/.well-known/genid/b15634fcd88e4a40e28a2f022818e851#10
subclass of: http://lodlaundromat.org/.well-known/genid/b15634fcd88e4a40e28a2f022818e851#51
subclass of: http://lodlaundromat.org/.well-known/genid/b15634fcd88e4a40e28a2f022818e851#135
subclass of: http://lodlaundromat.org/.well-known/genid/b15634fcd88e4a40e28a2f022818e851#9
subclass of: http://lodlaundromat.org/.well-known/genid/b15634fcd88e4a40e28a2f022818e851#56
subclass of: Dimension
subclass of: DateTimeInterval
subclass of: http://lodlaundromat.org/.well-known/genid/b15634fcd88e4a40e28a2f022818e851#208
subclass of: http://lodlaundromat.org/.well-known/genid/b15634fcd88e4a40e28a2f022818e851#215
subclass of: Interval
subclass of: http://lodlaundromat.org/.well-known/genid/b15634fcd88e4a40e28a2f022818e851#201
subclass of: http://lodlaundromat.org/.well-known/genid/b15634fcd88e4a40e28a2f022818e851#58
subclass of: http://lodlaundromat.org/.well-known/genid/b15634fcd88e4a40e28a2f022818e851#182
subclass of: http://lodlaundromat.org/.well-known/genid/b15634fcd88e4a40e28a2f022818e851#151
subclass of: http://lodlaundromat.org/.well-known/genid/b15634fcd88e4a40e28a2f022818e851#164
subclass of: http://lodlaundromat.org/.well-known/genid/b15634fcd88e4a40e28a2f022818e851#158
subclass of: http://lodlaundromat.org/.well-known/genid/b15634fcd88e4a40e28a2f022818e851#138
subclass of: http://lodlaundromat.org/.well-known/genid/b15634fcd88e4a40e28a2f022818e851#145
subclass of: http://lodlaundromat.org/.well-known/genid/b15634fcd88e4a40e28a2f022818e851#190
subclass of: http://lodlaundromat.org/.well-known/genid/b15634fcd88e4a40e28a2f022818e851#173

http://lodlaundromat.org/.well-known/genid/b15634fcd88e4a40e28a2f022818e851#27
subclass of: Resource
subclass of: Thing
type: Class
type: Restriction
max cardinality: 366
on property: intervalContainsDay

http://lodlaundromat.org/.well-known/genid/b15634fcd88e4a40e28a2f022818e851#132
subclass of: Resource
subclass of: Thing
type: Class
type: Restriction
has value: P1Y
on property: hasXsdDurationDescription (DataTypeProperty)
subclass of: http://lodlaundromat.org/.well-known/genid/b15634fcd88e4a40e28a2f022818e851#135

http://lodlaundromat.org/.well-known/genid/b15634fcd88e4a40e28a2f022818e851#69
subclass of: Resource
subclass of: Thing
type: Class
type: Restriction
has value: PT1M
on property: hasXsdDurationDescription (DataTypeProperty)
subclass of: http://lodlaundromat.org/.well-known/genid/b15634fcd88e4a40e28a2f022818e851#135

Generic Minute (Class)
subclass of: http://lodlaundromat.org/.well-known/genid/b15634fcd88e4a40e28a2f022818e851#208
subclass of: http://lodlaundromat.org/.well-known/genid/b15634fcd88e4a40e28a2f022818e851#151
subclass of: http://lodlaundromat.org/.well-known/genid/b15634fcd88e4a40e28a2f022818e851#158
subclass of: Thing
subclass of: http://lodlaundromat.org/.well-known/genid/b15634fcd88e4a40e28a2f022818e851#164
subclass of: http://lodlaundromat.org/.well-known/genid/b15634fcd88e4a40e28a2f022818e851#178
subclass of: http://lodlaundromat.org/.well-known/genid/b15634fcd88e4a40e28a2f022818e851#190
subclass of: http://lodlaundromat.org/.well-known/genid/b15634fcd88e4a40e28a2f022818e851#215
subclass of: http://lodlaundromat.org/.well-known/genid/b15634fcd88e4a40e28a2f022818e851#182
subclass of: http://lodlaundromat.org/.well-known/genid/b15634fcd88e4a40e28a2f022818e851#173
subclass of: http://lodlaundromat.org/.well-known/genid/b15634fcd88e4a40e28a2f022818e851#145
subclass of: http://lodlaundromat.org/.well-known/genid/b15634fcd88e4a40e28a2f022818e851#201
subclass of: http://lodlaundromat.org/.well-known/genid/b15634fcd88e4a40e28a2f022818e851#138
type: Class
subclass of: Resource
comment: A generic superclass for all minute-long intervals. A minute may contain a positive or negative leap second.
subclass of: http://lodlaundromat.org/.well-known/genid/b15634fcd88e4a40e28a2f022818e851#67
subclass of: http://lodlaundromat.org/.well-known/genid/b15634fcd88e4a40e28a2f022818e851#70
subclass of: http://lodlaundromat.org/.well-known/genid/b15634fcd88e4a40e28a2f022818e851#66
subclass of: Interval
subclass of: http://lodlaundromat.org/.well-known/genid/b15634fcd88e4a40e28a2f022818e851#69
subclass of: http://lodlaundromat.org/.well-known/genid/b15634fcd88e4a40e28a2f022818e851#68
subclass of: http://lodlaundromat.org/.well-known/genid/b15634fcd88e4a40e28a2f022818e851#71
subclass of: http://lodlaundromat.org/.well-known/genid/b15634fcd88e4a40e28a2f022818e851#135
subclass of: DateTimeInterval
subclass of: Dimension
subclass of: http://lodlaundromat.org/.well-known/genid/b15634fcd88e4a40e28a2f022818e851#58

Generic Year (Class)
type: Class
subclass of: Thing
subclass of: Resource
subclass of: http://lodlaundromat.org/.well-known/genid/b15634fcd88e4a40e28a2f022818e851#127
subclass of: Interval
subclass of: http://lodlaundromat.org/.well-known/genid/b15634fcd88e4a40e28a2f022818e851#132
subclass of: http://lodlaundromat.org/.well-known/genid/b15634fcd88e4a40e28a2f022818e851#133
subclass of: http://lodlaundromat.org/.well-known/genid/b15634fcd88e4a40e28a2f022818e851#130
comment: A generic superclass for all manner of Year like intervals. The the cardinality of days in a year is set to between 351 and 380 because in the UK the end of a business reporting year must be within 7 days of an annual reference date. In the worst cases this allows a reporting interval to be shortened or extended by up to two weeks.
subclass of: http://lodlaundromat.org/.well-known/genid/b15634fcd88e4a40e28a2f022818e851#131
subclass of: http://lodlaundromat.org/.well-known/genid/b15634fcd88e4a40e28a2f022818e851#128
subclass of: http://lodlaundromat.org/.well-known/genid/b15634fcd88e4a40e28a2f022818e851#129
subclass of: http://lodlaundromat.org/.well-known/genid/b15634fcd88e4a40e28a2f022818e851#134
subclass of: http://lodlaundromat.org/.well-known/genid/b15634fcd88e4a40e28a2f022818e851#135
subclass of: DateTimeInterval
subclass of: http://lodlaundromat.org/.well-known/genid/b15634fcd88e4a40e28a2f022818e851#58
subclass of: Dimension

Generic Quarter (Class)
subclass of: http://lodlaundromat.org/.well-known/genid/b15634fcd88e4a40e28a2f022818e851#164
subclass of: Thing
subclass of: http://lodlaundromat.org/.well-known/genid/b15634fcd88e4a40e28a2f022818e851#190
type: Class
subclass of: Resource
comment: A generic superclass for all Quarter (3-month) long intervals
subclass of: http://lodlaundromat.org/.well-known/genid/b15634fcd88e4a40e28a2f022818e851#114
subclass of: http://lodlaundromat.org/.well-known/genid/b15634fcd88e4a40e28a2f022818e851#115
subclass of: http://lodlaundromat.org/.well-known/genid/b15634fcd88e4a40e28a2f022818e851#116
subclass of: http://lodlaundromat.org/.well-known/genid/b15634fcd88e4a40e28a2f022818e851#117
subclass of: Interval
subclass of: http://lodlaundromat.org/.well-known/genid/b15634fcd88e4a40e28a2f022818e851#135
subclass of: http://lodlaundromat.org/.well-known/genid/b15634fcd88e4a40e28a2f022818e851#58
subclass of: DateTimeInterval
subclass of: Dimension

Irregular Business interval
subclass of: Resource
subclass of: Thing
type: Class
comment: A business interval outside of the normal pattern of business intervals. In the UK companies house allow an annual reporting interval to be extended by upto 6 months once in 5 years (and at other exceptional times)
subclass of: Business Intervals
subclass of: DateTimeInterval
subclass of: Dimension

month of year
subclass of: http://lodlaundromat.org/.well-known/genid/b15634fcd88e4a40e28a2f022818e851#182
subclass of: Resource
type: Class
comment: A class for the months of a calendar year. A month of year is a recurring interval of about 12th of a year that re-occurs annually.
subclass of: Thing
one of: http://lodlaundromat.org/.well-known/genid/b15634fcd88e4a40e28a2f022818e851#76

CalendarInterval (class)
subclass of: Resource
subclass of: Thing
type: Class
subclass of: http://lodlaundromat.org/.well-known/genid/b15634fcd88e4a40e28a2f022818e851#9
subclass of: http://lodlaundromat.org/.well-known/genid/b15634fcd88e4a40e28a2f022818e851#11
subclass of: http://lodlaundromat.org/.well-known/genid/b15634fcd88e4a40e28a2f022818e851#14
subclass of: DateTimeInterval
subclass of: http://lodlaundromat.org/.well-known/genid/b15634fcd88e4a40e28a2f022818e851#13
subclass of: http://lodlaundromat.org/.well-known/genid/b15634fcd88e4a40e28a2f022818e851#16
subclass of: http://lodlaundromat.org/.well-known/genid/b15634fcd88e4a40e28a2f022818e851#15
subclass of: http://lodlaundromat.org/.well-known/genid/b15634fcd88e4a40e28a2f022818e851#8
subclass of: Dimension
subclass of: http://lodlaundromat.org/.well-known/genid/b15634fcd88e4a40e28a2f022818e851#10
comment: A class for all calendar aligned intervals. The start of a given interval is aligned with the start of each of its first (temporally) subordinate CalendarInterval. Halfs are align the start of the first and seventh month of a year; quarters with the first, forth, seventh and tenth months; months with calendar months sof forth for calendar days, hours,minutes and seconds align
subclass of: http://lodlaundromat.org/.well-known/genid/b15634fcd88e4a40e28a2f022818e851#12
subclass of: http://lodlaundromat.org/.well-known/genid/b15634fcd88e4a40e28a2f022818e851#64

http://lodlaundromat.org/.well-known/genid/b15634fcd88e4a40e28a2f022818e851#22
subclass of: Resource
subclass of: Thing
type: Class
type: Restriction
min cardinality: 28
on property: intervalContainsDay

http://lodlaundromat.org/.well-known/genid/b15634fcd88e4a40e28a2f022818e851#28
subclass of: Resource
subclass of: Thing
type: Class
type: Restriction
min cardinality: 365
on property: intervalContainsDay

Calendar Year
subclass of: Thing
subclass of: Resource
type: Class
subclass of: http://lodlaundromat.org/.well-known/genid/b15634fcd88e4a40e28a2f022818e851#30
subclass of: http://lodlaundromat.org/.well-known/genid/b15634fcd88e4a40e28a2f022818e851#31
subclass of: http://lodlaundromat.org/.well-known/genid/b15634fcd88e4a40e28a2f022818e851#28
subclass of: Generic Year (Class)
comment: A class for calendar aligned intervals of one whole year, ie. year long intervals that are aligned with a Calendar.
subclass of: http://lodlaundromat.org/.well-known/genid/b15634fcd88e4a40e28a2f022818e851#27
subclass of: CalendarInterval (class)
subclass of: http://lodlaundromat.org/.well-known/genid/b15634fcd88e4a40e28a2f022818e851#29
subclass of: http://lodlaundromat.org/.well-known/genid/b15634fcd88e4a40e28a2f022818e851#127
subclass of: http://lodlaundromat.org/.well-known/genid/b15634fcd88e4a40e28a2f022818e851#131
subclass of: http://lodlaundromat.org/.well-known/genid/b15634fcd88e4a40e28a2f022818e851#16
subclass of: http://lodlaundromat.org/.well-known/genid/b15634fcd88e4a40e28a2f022818e851#15
subclass of: http://lodlaundromat.org/.well-known/genid/b15634fcd88e4a40e28a2f022818e851#9
subclass of: http://lodlaundromat.org/.well-known/genid/b15634fcd88e4a40e28a2f022818e851#132
subclass of: http://lodlaundromat.org/.well-known/genid/b15634fcd88e4a40e28a2f022818e851#135
subclass of: http://lodlaundromat.org/.well-known/genid/b15634fcd88e4a40e28a2f022818e851#10
subclass of: http://lodlaundromat.org/.well-known/genid/b15634fcd88e4a40e28a2f022818e851#64
subclass of: http://lodlaundromat.org/.well-known/genid/b15634fcd88e4a40e28a2f022818e851#133
subclass of: http://lodlaundromat.org/.well-known/genid/b15634fcd88e4a40e28a2f022818e851#14
subclass of: http://lodlaundromat.org/.well-known/genid/b15634fcd88e4a40e28a2f022818e851#129
subclass of: http://lodlaundromat.org/.well-known/genid/b15634fcd88e4a40e28a2f022818e851#11
subclass of: http://lodlaundromat.org/.well-known/genid/b15634fcd88e4a40e28a2f022818e851#128
subclass of: http://lodlaundromat.org/.well-known/genid/b15634fcd88e4a40e28a2f022818e851#13
subclass of: http://lodlaundromat.org/.well-known/genid/b15634fcd88e4a40e28a2f022818e851#8
subclass of: http://lodlaundromat.org/.well-known/genid/b15634fcd88e4a40e28a2f022818e851#12
subclass of: Dimension
subclass of: DateTimeInterval
subclass of: http://lodlaundromat.org/.well-known/genid/b15634fcd88e4a40e28a2f022818e851#130
subclass of: http://lodlaundromat.org/.well-known/genid/b15634fcd88e4a40e28a2f022818e851#134
subclass of: Interval
subclass of: http://lodlaundromat.org/.well-known/genid/b15634fcd88e4a40e28a2f022818e851#58

Q6 Interval
type: Class
subclass of: Thing
subclass of: Resource
subclass of: http://lodlaundromat.org/.well-known/genid/b15634fcd88e4a40e28a2f022818e851#108
comment: A class for 6th quarters of an abnormally long annual interval - in the UK a buisness interval may exceptionally extent to 6 quarters.
subclass of: http://lodlaundromat.org/.well-known/genid/b15634fcd88e4a40e28a2f022818e851#112
subclass of: http://lodlaundromat.org/.well-known/genid/b15634fcd88e4a40e28a2f022818e851#113
subclass of: Generic Quarter (Class)
subclass of: http://lodlaundromat.org/.well-known/genid/b15634fcd88e4a40e28a2f022818e851#116
subclass of: http://lodlaundromat.org/.well-known/genid/b15634fcd88e4a40e28a2f022818e851#114
subclass of: http://lodlaundromat.org/.well-known/genid/b15634fcd88e4a40e28a2f022818e851#115
subclass of: http://lodlaundromat.org/.well-known/genid/b15634fcd88e4a40e28a2f022818e851#117
subclass of: http://lodlaundromat.org/.well-known/genid/b15634fcd88e4a40e28a2f022818e851#190
subclass of: http://lodlaundromat.org/.well-known/genid/b15634fcd88e4a40e28a2f022818e851#135
subclass of: Interval
subclass of: http://lodlaundromat.org/.well-known/genid/b15634fcd88e4a40e28a2f022818e851#164
subclass of: DateTimeInterval
subclass of: http://lodlaundromat.org/.well-known/genid/b15634fcd88e4a40e28a2f022818e851#58
subclass of: Dimension

April
type: month of year
comment: The month of April
type: http://lodlaundromat.org/.well-known/genid/b15634fcd88e4a40e28a2f022818e851#182
type: Thing

Generic Second (Class)
subclass of: http://lodlaundromat.org/.well-known/genid/b15634fcd88e4a40e28a2f022818e851#158
subclass of: Thing
subclass of: http://lodlaundromat.org/.well-known/genid/b15634fcd88e4a40e28a2f022818e851#138
subclass of: http://lodlaundromat.org/.well-known/genid/b15634fcd88e4a40e28a2f022818e851#151
subclass of: http://lodlaundromat.org/.well-known/genid/b15634fcd88e4a40e28a2f022818e851#145
subclass of: http://lodlaundromat.org/.well-known/genid/b15634fcd88e4a40e28a2f022818e851#178
subclass of: http://lodlaundromat.org/.well-known/genid/b15634fcd88e4a40e28a2f022818e851#182
subclass of: http://lodlaundromat.org/.well-known/genid/b15634fcd88e4a40e28a2f022818e851#215
subclass of: http://lodlaundromat.org/.well-known/genid/b15634fcd88e4a40e28a2f022818e851#201
subclass of: http://lodlaundromat.org/.well-known/genid/b15634fcd88e4a40e28a2f022818e851#173
subclass of: http://lodlaundromat.org/.well-known/genid/b15634fcd88e4a40e28a2f022818e851#198
subclass of: http://lodlaundromat.org/.well-known/genid/b15634fcd88e4a40e28a2f022818e851#164
subclass of: Resource
subclass of: http://lodlaundromat.org/.well-known/genid/b15634fcd88e4a40e28a2f022818e851#208
subclass of: http://lodlaundromat.org/.well-known/genid/b15634fcd88e4a40e28a2f022818e851#190
type: Class
comment: A generic superclass for all one-second long like intervals
subclass of: http://lodlaundromat.org/.well-known/genid/b15634fcd88e4a40e28a2f022818e851#118
subclass of: http://lodlaundromat.org/.well-known/genid/b15634fcd88e4a40e28a2f022818e851#119
subclass of: http://lodlaundromat.org/.well-known/genid/b15634fcd88e4a40e28a2f022818e851#120
subclass of: http://lodlaundromat.org/.well-known/genid/b15634fcd88e4a40e28a2f022818e851#121
subclass of: Interval
subclass of: http://lodlaundromat.org/.well-known/genid/b15634fcd88e4a40e28a2f022818e851#25
subclass of: http://lodlaundromat.org/.well-known/genid/b15634fcd88e4a40e28a2f022818e851#26
subclass of: http://lodlaundromat.org/.well-known/genid/b15634fcd88e4a40e28a2f022818e851#58
subclass of: DateTimeInterval
subclass of: Dimension
subclass of: http://lodlaundromat.org/.well-known/genid/b15634fcd88e4a40e28a2f022818e851#135

Calendar Quarter
type: Class
subclass of: Resource
subclass of: Thing
comment: A class for calendar aligned one-quarter year (3 month) intervals
subclass of: http://lodlaundromat.org/.well-known/genid/b15634fcd88e4a40e28a2f022818e851#23
subclass of: http://lodlaundromat.org/.well-known/genid/b15634fcd88e4a40e28a2f022818e851#24
subclass of: CalendarInterval (class)
subclass of: Generic Quarter (Class)
subclass of: http://lodlaundromat.org/.well-known/genid/b15634fcd88e4a40e28a2f022818e851#10
subclass of: http://lodlaundromat.org/.well-known/genid/b15634fcd88e4a40e28a2f022818e851#64
subclass of: DateTimeInterval
subclass of: http://lodlaundromat.org/.well-known/genid/b15634fcd88e4a40e28a2f022818e851#11
subclass of: http://lodlaundromat.org/.well-known/genid/b15634fcd88e4a40e28a2f022818e851#8
subclass of: http://lodlaundromat.org/.well-known/genid/b15634fcd88e4a40e28a2f022818e851#16
subclass of: http://lodlaundromat.org/.well-known/genid/b15634fcd88e4a40e28a2f022818e851#15
subclass of: http://lodlaundromat.org/.well-known/genid/b15634fcd88e4a40e28a2f022818e851#14
subclass of: http://lodlaundromat.org/.well-known/genid/b15634fcd88e4a40e28a2f022818e851#12
subclass of: http://lodlaundromat.org/.well-known/genid/b15634fcd88e4a40e28a2f022818e851#13
subclass of: http://lodlaundromat.org/.well-known/genid/b15634fcd88e4a40e28a2f022818e851#9
subclass of: Dimension
subclass of: http://lodlaundromat.org/.well-known/genid/b15634fcd88e4a40e28a2f022818e851#117
subclass of: http://lodlaundromat.org/.well-known/genid/b15634fcd88e4a40e28a2f022818e851#164
subclass of: http://lodlaundromat.org/.well-known/genid/b15634fcd88e4a40e28a2f022818e851#190
subclass of: http://lodlaundromat.org/.well-known/genid/b15634fcd88e4a40e28a2f022818e851#116
subclass of: http://lodlaundromat.org/.well-known/genid/b15634fcd88e4a40e28a2f022818e851#115
subclass of: http://lodlaundromat.org/.well-known/genid/b15634fcd88e4a40e28a2f022818e851#135
subclass of: http://lodlaundromat.org/.well-known/genid/b15634fcd88e4a40e28a2f022818e851#114
subclass of: Interval
subclass of: http://lodlaundromat.org/.well-known/genid/b15634fcd88e4a40e28a2f022818e851#58

October
type: month of year
comment: The month of October
type: http://lodlaundromat.org/.well-known/genid/b15634fcd88e4a40e28a2f022818e851#182
type: Thing

http://lodlaundromat.org/.well-known/genid/b15634fcd88e4a40e28a2f022818e851#46
subclass of: Resource
subclass of: Thing
type: Class
type: Restriction
has value: P6M
on property: hasXsdDurationDescription (DataTypeProperty)
subclass of: http://lodlaundromat.org/.well-known/genid/b15634fcd88e4a40e28a2f022818e851#135

http://lodlaundromat.org/.well-known/genid/b15634fcd88e4a40e28a2f022818e851#121
subclass of: Resource
subclass of: Thing
type: Class
type: Restriction
has value: PT1S
on property: hasXsdDurationDescription (DataTypeProperty)
subclass of: http://lodlaundromat.org/.well-known/genid/b15634fcd88e4a40e28a2f022818e851#135

ordinal day of week {en}
type: Property
type: DatatypeProperty
comment: The ordinal number of the day of the week in which a (contained) instant or interval (of one day or less in duration) occurs. The Monday has an ordinal number of 1.
domain: http://lodlaundromat.org/.well-known/genid/b15634fcd88e4a40e28a2f022818e851#151
range: integer
domain: Thing
domain: Resource
range: Resource
range: decimal

ordinal week of year
type: DatatypeProperty
comment: The ordinal number of the week of the year in which a contained instant or interval of one week duration or less occurs. The ordinal number of the first week of a year is 1. The first week of a year is the week that contains the first Thursday of the year.
domain: http://lodlaundromat.org/.well-known/genid/b15634fcd88e4a40e28a2f022818e851#201
range: integer
type: Property
domain: Resource
domain: Thing
range: Resource
range: decimal

1 hour
hasXsdDurationDescription (DataTypeProperty): PT1H
type: DurationDescriptions
comment: A duration of one hour
hours: 1
type: http://lodlaundromat.org/.well-known/genid/b15634fcd88e4a40e28a2f022818e851#135
type: Thing
type: DurationDescription
type: http://lodlaundromat.org/.well-known/genid/b15634fcd88e4a40e28a2f022818e851#51

1 second
hasXsdDurationDescription (DataTypeProperty): PT1S
type: DurationDescriptions
comment: A duration of one second
seconds: 1
type: http://lodlaundromat.org/.well-known/genid/b15634fcd88e4a40e28a2f022818e851#135
type: Thing
type: DurationDescription
type: http://lodlaundromat.org/.well-known/genid/b15634fcd88e4a40e28a2f022818e851#121

Sunday
ordinal day of week {en}: 7
type: http://lodlaundromat.org/.well-known/genid/b15634fcd88e4a40e28a2f022818e851#151
type: Thing

Friday
ordinal day of week {en}: 5
type: http://lodlaundromat.org/.well-known/genid/b15634fcd88e4a40e28a2f022818e851#151
type: Thing

ordinal second of minute
type: DatatypeProperty
comment: The ordinal number of the second of the minute in which a contained instant or interval (of one second duration or less) occurs. The ordinal number of the first second of a minute is 0.
domain: http://lodlaundromat.org/.well-known/genid/b15634fcd88e4a40e28a2f022818e851#198
range: integer
type: Property
domain: Thing
domain: Resource
range: Resource
range: decimal

1 month
hasXsdDurationDescription (DataTypeProperty): P1M
type: DurationDescriptions
comment: A duration of one month
months: 1
type: http://lodlaundromat.org/.well-known/genid/b15634fcd88e4a40e28a2f022818e851#135
type: Thing
type: http://lodlaundromat.org/.well-known/genid/b15634fcd88e4a40e28a2f022818e851#74
type: DurationDescription

1 year
hasXsdDurationDescription (DataTypeProperty): P1Y
type: DurationDescriptions
comment: A duration of one year
years: 1
type: http://lodlaundromat.org/.well-known/genid/b15634fcd88e4a40e28a2f022818e851#135
type: Thing
type: DurationDescription
type: http://lodlaundromat.org/.well-known/genid/b15634fcd88e4a40e28a2f022818e851#132

ordinal day of month
type: DatatypeProperty
comment: The ordinal number of the day of the month in in which an instant or interval (of duration less than one day) occurs. The first day of a month has the ordinal number 1.
domain: http://lodlaundromat.org/.well-known/genid/b15634fcd88e4a40e28a2f022818e851#145
range: integer
type: Property
domain: Resource
domain: Thing
range: Resource
range: decimal

ordinal day of month
type: DatatypeProperty
comment: The ordinal number of the day of the year in in which an instant or interval (of duration one day or less) occurs. The first day of a year has the ordinal number 1.
domain: http://lodlaundromat.org/.well-known/genid/b15634fcd88e4a40e28a2f022818e851#158
range: integer
type: Property
domain: Resource
domain: Thing
range: Resource
range: decimal

intervals
imports: event.owl
version info: Created with TopBraid Composer
imports: skos-xl
imports: time
imports: core
imports: terms
imports: http://purl.org/dc/elements/1.1/
imports: scovo
imports: dcam
type: Ontology

1 day
hasXsdDurationDescription (DataTypeProperty): P1D
type: DurationDescriptions
comment: A duration of one day, typically 24 hours)
days: 1
type: http://lodlaundromat.org/.well-known/genid/b15634fcd88e4a40e28a2f022818e851#35
type: Thing
type: http://lodlaundromat.org/.well-known/genid/b15634fcd88e4a40e28a2f022818e851#135
type: DurationDescription

ordinal quarter of year
type: DatatypeProperty
comment: The ordinal number of the quarter of the year in which a contained instant or interval (of duration one quarter year or less) occurs. The ordinal number of the first quarter of a year is 1.
domain: http://lodlaundromat.org/.well-known/genid/b15634fcd88e4a40e28a2f022818e851#190
range: integer
type: Property
domain: Resource
domain: Thing
range: Resource
range: decimal

Monday
ordinal day of week {en}: 1
type: http://lodlaundromat.org/.well-known/genid/b15634fcd88e4a40e28a2f022818e851#151
type: Thing

Saturday
ordinal day of week {en}: 6
type: http://lodlaundromat.org/.well-known/genid/b15634fcd88e4a40e28a2f022818e851#151
type: Thing

ordinal year
type: DatatypeProperty
comment: The ordinal year of the year in which an instant or interval (of duration one year or less) occurs. The first year of the AD era has ordinal number 1.
domain: http://lodlaundromat.org/.well-known/genid/b15634fcd88e4a40e28a2f022818e851#215
range: integer
type: Property
domain: Thing
domain: Resource
range: Resource
range: decimal

ordinal minute of hour
type: DatatypeProperty
comment: The ordinal number of the minute of the hour in which a contained instant or interval (of duration one hour or less) occurs. The first minute of an hour has ordinal number 0.
domain: http://lodlaundromat.org/.well-known/genid/b15634fcd88e4a40e28a2f022818e851#178
range: integer
type: Property
domain: Resource
domain: Thing
range: Resource
range: decimal

Tuesday
ordinal day of week {en}: 2
type: http://lodlaundromat.org/.well-known/genid/b15634fcd88e4a40e28a2f022818e851#151
type: Thing

1 quarter of a year
hasXsdDurationDescription (DataTypeProperty): P3M
type: DurationDescriptions
comment: A duration of one quarter, typically 3 months.
months: 3
type: http://lodlaundromat.org/.well-known/genid/b15634fcd88e4a40e28a2f022818e851#115
type: Thing
type: http://lodlaundromat.org/.well-known/genid/b15634fcd88e4a40e28a2f022818e851#135
type: DurationDescription

ordinal week of year year
type: DatatypeProperty
comment: The ordinal number of the week of year year in which an instant or interval (of duration one week or less) occurs. The first year of the AD era has ordinal number 1. The Week Of Year is the year to which a week of year pertains, which is usually the same as the calendar year except aorund the end of year where some days of the week may be deemed to be in the yearr following or the year previous depending on the alignment of the year boundary with the weekly cycle.
domain: http://lodlaundromat.org/.well-known/genid/b15634fcd88e4a40e28a2f022818e851#208
range: integer
type: Property
domain: Resource
domain: Thing
range: Resource
range: decimal

Previous Annual Reference Date.
type: FunctionalProperty
comment: A reference to the companies house annual reference date at the end of the previous reporting year. Annual reporting periods are required to end with 7 days of this date. Success annual reference dates normally advance by 1 whole year each year. However, companies can always apply for an earlier reference date and under restricted circumstance request a later reference date (upto 6 months later) see http://www.companieshouse.gov.uk/about/gbhtml/gp2.shtml#ch2.
domain: Business Intervals
range: Calendar Day
type: Property
domain: DateTimeInterval
domain: Dimension
domain: Thing
domain: Resource
range: http://lodlaundromat.org/.well-known/genid/b15634fcd88e4a40e28a2f022818e851#208
range: http://lodlaundromat.org/.well-known/genid/b15634fcd88e4a40e28a2f022818e851#12
range: http://lodlaundromat.org/.well-known/genid/b15634fcd88e4a40e28a2f022818e851#135
range: Thing
range: http://lodlaundromat.org/.well-known/genid/b15634fcd88e4a40e28a2f022818e851#1
range: http://lodlaundromat.org/.well-known/genid/b15634fcd88e4a40e28a2f022818e851#8
range: Resource
range: http://lodlaundromat.org/.well-known/genid/b15634fcd88e4a40e28a2f022818e851#34
range: http://lodlaundromat.org/.well-known/genid/b15634fcd88e4a40e28a2f022818e851#14
range: Interval
range: http://lodlaundromat.org/.well-known/genid/b15634fcd88e4a40e28a2f022818e851#9
range: http://lodlaundromat.org/.well-known/genid/b15634fcd88e4a40e28a2f022818e851#16
range: http://lodlaundromat.org/.well-known/genid/b15634fcd88e4a40e28a2f022818e851#164
range: http://lodlaundromat.org/.well-known/genid/b15634fcd88e4a40e28a2f022818e851#138
range: http://lodlaundromat.org/.well-known/genid/b15634fcd88e4a40e28a2f022818e851#2
range: http://lodlaundromat.org/.well-known/genid/b15634fcd88e4a40e28a2f022818e851#151
range: http://lodlaundromat.org/.well-known/genid/b15634fcd88e4a40e28a2f022818e851#33
range: http://lodlaundromat.org/.well-known/genid/b15634fcd88e4a40e28a2f022818e851#35
range: http://lodlaundromat.org/.well-known/genid/b15634fcd88e4a40e28a2f022818e851#32
range: http://lodlaundromat.org/.well-known/genid/b15634fcd88e4a40e28a2f022818e851#190
range: http://lodlaundromat.org/.well-known/genid/b15634fcd88e4a40e28a2f022818e851#215
range: http://lodlaundromat.org/.well-known/genid/b15634fcd88e4a40e28a2f022818e851#11
range: http://lodlaundromat.org/.well-known/genid/b15634fcd88e4a40e28a2f022818e851#201
range: http://lodlaundromat.org/.well-known/genid/b15634fcd88e4a40e28a2f022818e851#13
range: http://lodlaundromat.org/.well-known/genid/b15634fcd88e4a40e28a2f022818e851#182
range: Generic Day (Class)
range: CalendarInterval (class)
range: http://lodlaundromat.org/.well-known/genid/b15634fcd88e4a40e28a2f022818e851#145
range: http://lodlaundromat.org/.well-known/genid/b15634fcd88e4a40e28a2f022818e851#158
range: http://lodlaundromat.org/.well-known/genid/b15634fcd88e4a40e28a2f022818e851#64
range: http://lodlaundromat.org/.well-known/genid/b15634fcd88e4a40e28a2f022818e851#10
range: http://lodlaundromat.org/.well-known/genid/b15634fcd88e4a40e28a2f022818e851#58
range: http://lodlaundromat.org/.well-known/genid/b15634fcd88e4a40e28a2f022818e851#15
range: DateTimeInterval
range: Dimension

1 minute
hasXsdDurationDescription (DataTypeProperty): PT1M
type: DurationDescriptions
comment: A duration of 1 minute
minutes: 1
type: http://lodlaundromat.org/.well-known/genid/b15634fcd88e4a40e28a2f022818e851#135
type: Thing
type: DurationDescription
type: http://lodlaundromat.org/.well-known/genid/b15634fcd88e4a40e28a2f022818e851#69

ordinal month of year
type: DatatypeProperty
comment: The ordinal number of the month of the year in in which an instant or interval (of duration one day or less) occurs. The January has the ordinal number 1.
domain: http://lodlaundromat.org/.well-known/genid/b15634fcd88e4a40e28a2f022818e851#182
range: integer
type: Property
domain: Resource
domain: Thing
range: Resource
range: decimal

Thursday
ordinal day of week {en}: 4
type: http://lodlaundromat.org/.well-known/genid/b15634fcd88e4a40e28a2f022818e851#151
type: Thing

Wednesday
ordinal day of week {en}: 3
type: http://lodlaundromat.org/.well-known/genid/b15634fcd88e4a40e28a2f022818e851#151
type: Thing

ordinal hour of day
type: DatatypeProperty
comment: The ordinal number of the hour of day in which a (contained) instant or interval (of less than one hour duration) occurs. The first hour of a day has ordinal number 0.
domain: http://lodlaundromat.org/.well-known/genid/b15634fcd88e4a40e28a2f022818e851#173
range: integer
type: Property
domain: Thing
domain: Resource
range: Resource
range: decimal

1 half of a year
hasXsdDurationDescription (DataTypeProperty): P6M
type: DurationDescriptions
comment: A duration of one half year, typically 6 months
months: 6
type: http://lodlaundromat.org/.well-known/genid/b15634fcd88e4a40e28a2f022818e851#135
type: Thing
type: DurationDescription
type: http://lodlaundromat.org/.well-known/genid/b15634fcd88e4a40e28a2f022818e851#46

Next Annual Reference Date.
type: FunctionalProperty
comment: A reference to the companies house annual reference date at the end of the previous reporting year. Annual reporting periods are required to end with 7 days of this date. Success annual reference dates normally advance by 1 whole year each year. However, companies can always apply for an earlier reference date and under restricted circumstance request a later reference date (upto 6 months later) see http://www.companieshouse.gov.uk/about/gbhtml/gp2.shtml#ch2
domain: Business Intervals
range: Calendar Day
type: Property
domain: DateTimeInterval
domain: Dimension
domain: Thing
domain: Resource
range: http://lodlaundromat.org/.well-known/genid/b15634fcd88e4a40e28a2f022818e851#208
range: http://lodlaundromat.org/.well-known/genid/b15634fcd88e4a40e28a2f022818e851#12
range: http://lodlaundromat.org/.well-known/genid/b15634fcd88e4a40e28a2f022818e851#135
range: Thing
range: http://lodlaundromat.org/.well-known/genid/b15634fcd88e4a40e28a2f022818e851#1
range: http://lodlaundromat.org/.well-known/genid/b15634fcd88e4a40e28a2f022818e851#8
range: Resource
range: http://lodlaundromat.org/.well-known/genid/b15634fcd88e4a40e28a2f022818e851#34
range: http://lodlaundromat.org/.well-known/genid/b15634fcd88e4a40e28a2f022818e851#14
range: Interval
range: http://lodlaundromat.org/.well-known/genid/b15634fcd88e4a40e28a2f022818e851#9
range: http://lodlaundromat.org/.well-known/genid/b15634fcd88e4a40e28a2f022818e851#16
range: http://lodlaundromat.org/.well-known/genid/b15634fcd88e4a40e28a2f022818e851#164
range: http://lodlaundromat.org/.well-known/genid/b15634fcd88e4a40e28a2f022818e851#138
range: http://lodlaundromat.org/.well-known/genid/b15634fcd88e4a40e28a2f022818e851#2
range: http://lodlaundromat.org/.well-known/genid/b15634fcd88e4a40e28a2f022818e851#151
range: http://lodlaundromat.org/.well-known/genid/b15634fcd88e4a40e28a2f022818e851#33
range: http://lodlaundromat.org/.well-known/genid/b15634fcd88e4a40e28a2f022818e851#35
range: http://lodlaundromat.org/.well-known/genid/b15634fcd88e4a40e28a2f022818e851#32
range: http://lodlaundromat.org/.well-known/genid/b15634fcd88e4a40e28a2f022818e851#190
range: http://lodlaundromat.org/.well-known/genid/b15634fcd88e4a40e28a2f022818e851#215
range: http://lodlaundromat.org/.well-known/genid/b15634fcd88e4a40e28a2f022818e851#11
range: http://lodlaundromat.org/.well-known/genid/b15634fcd88e4a40e28a2f022818e851#201
range: http://lodlaundromat.org/.well-known/genid/b15634fcd88e4a40e28a2f022818e851#13
range: http://lodlaundromat.org/.well-known/genid/b15634fcd88e4a40e28a2f022818e851#182
range: Generic Day (Class)
range: CalendarInterval (class)
range: http://lodlaundromat.org/.well-known/genid/b15634fcd88e4a40e28a2f022818e851#145
range: http://lodlaundromat.org/.well-known/genid/b15634fcd88e4a40e28a2f022818e851#158
range: http://lodlaundromat.org/.well-known/genid/b15634fcd88e4a40e28a2f022818e851#64
range: http://lodlaundromat.org/.well-known/genid/b15634fcd88e4a40e28a2f022818e851#10
range: http://lodlaundromat.org/.well-known/genid/b15634fcd88e4a40e28a2f022818e851#58
range: http://lodlaundromat.org/.well-known/genid/b15634fcd88e4a40e28a2f022818e851#15
range: DateTimeInterval
range: Dimension

has half of year
type: DatatypeProperty
comment: The ordinal number of the half of a year in which a contained instant or interval (of duration one half year or less) occurs. The first half of a year has the ordinal number 1.
domain: http://lodlaundromat.org/.well-known/genid/b15634fcd88e4a40e28a2f022818e851#164
range: integer
type: Property
domain: Resource
domain: Thing
range: Resource
range: decimal

1 week
hasXsdDurationDescription (DataTypeProperty): P7D
type: DurationDescriptions
comment: A duration of one week
type: http://lodlaundromat.org/.well-known/genid/b15634fcd88e4a40e28a2f022818e851#135
type: http://lodlaundromat.org/.well-known/genid/b15634fcd88e4a40e28a2f022818e851#123
type: Thing
type: DurationDescription