http://lodlaundromat.org/.well-known/genid/b15634fcd88e4a40e28a2f022818e851#115
type: Restriction
has value: P3M
on property: hasXsdDurationDescription (DataTypeProperty)

http://lodlaundromat.org/.well-known/genid/b15634fcd88e4a40e28a2f022818e851#121
type: Restriction
has value: PT1S
on property: hasXsdDurationDescription (DataTypeProperty)

http://lodlaundromat.org/.well-known/genid/b15634fcd88e4a40e28a2f022818e851#122
type: Restriction
cardinality: 7
on property: intervalContainsDay

http://lodlaundromat.org/.well-known/genid/b15634fcd88e4a40e28a2f022818e851#123
type: Restriction
has value: P7D
on property: hasXsdDurationDescription (DataTypeProperty)

http://lodlaundromat.org/.well-known/genid/b15634fcd88e4a40e28a2f022818e851#128
type: Restriction
min cardinality: 351
on property: intervalContainsDay

http://lodlaundromat.org/.well-known/genid/b15634fcd88e4a40e28a2f022818e851#129
type: Restriction
cardinality: 4
on property: intervalContainsQuarter

http://lodlaundromat.org/.well-known/genid/b15634fcd88e4a40e28a2f022818e851#130
type: Restriction
cardinality: 2
on property: intervalContainsHalf

http://lodlaundromat.org/.well-known/genid/b15634fcd88e4a40e28a2f022818e851#132
type: Restriction
has value: P1Y
on property: hasXsdDurationDescription (DataTypeProperty)

http://lodlaundromat.org/.well-known/genid/b15634fcd88e4a40e28a2f022818e851#134
type: Restriction
max cardinality: 380
on property: intervalContainsDay

http://lodlaundromat.org/.well-known/genid/b15634fcd88e4a40e28a2f022818e851#21
type: Restriction
max cardinality: 31
on property: intervalContainsDay

http://lodlaundromat.org/.well-known/genid/b15634fcd88e4a40e28a2f022818e851#22
type: Restriction
min cardinality: 28
on property: intervalContainsDay

http://lodlaundromat.org/.well-known/genid/b15634fcd88e4a40e28a2f022818e851#23
type: Restriction
cardinality: 3
on property: intervalContainsMonth

http://lodlaundromat.org/.well-known/genid/b15634fcd88e4a40e28a2f022818e851#27
type: Restriction
max cardinality: 366
on property: intervalContainsDay

http://lodlaundromat.org/.well-known/genid/b15634fcd88e4a40e28a2f022818e851#28
type: Restriction
min cardinality: 365
on property: intervalContainsDay

http://lodlaundromat.org/.well-known/genid/b15634fcd88e4a40e28a2f022818e851#31
type: Restriction
cardinality: 12
on property: intervalContainsMonth

http://lodlaundromat.org/.well-known/genid/b15634fcd88e4a40e28a2f022818e851#35
type: Restriction
has value: P1D
on property: hasXsdDurationDescription (DataTypeProperty)

http://lodlaundromat.org/.well-known/genid/b15634fcd88e4a40e28a2f022818e851#3
type: Restriction
cardinality: 6
on property: intervalContainsMonth

http://lodlaundromat.org/.well-known/genid/b15634fcd88e4a40e28a2f022818e851#46
type: Restriction
has value: P6M
on property: hasXsdDurationDescription (DataTypeProperty)

http://lodlaundromat.org/.well-known/genid/b15634fcd88e4a40e28a2f022818e851#49
type: Restriction
cardinality: 2
on property: intervalContainsQuarter

http://lodlaundromat.org/.well-known/genid/b15634fcd88e4a40e28a2f022818e851#50
type: Restriction
min cardinality: 3599
on property: intervalContainsSecond

http://lodlaundromat.org/.well-known/genid/b15634fcd88e4a40e28a2f022818e851#51
type: Restriction
has value: PT1H
on property: hasXsdDurationDescription (DataTypeProperty)

http://lodlaundromat.org/.well-known/genid/b15634fcd88e4a40e28a2f022818e851#53
type: Restriction
max cardinality: 3601
on property: intervalContainsSecond

http://lodlaundromat.org/.well-known/genid/b15634fcd88e4a40e28a2f022818e851#55
type: Restriction
cardinality: 60
on property: intervalContainsMinute

http://lodlaundromat.org/.well-known/genid/b15634fcd88e4a40e28a2f022818e851#62
type: Restriction
cardinality: 7
on property: intervalContainsDay

http://lodlaundromat.org/.well-known/genid/b15634fcd88e4a40e28a2f022818e851#66
type: Restriction
max cardinality: 61
on property: intervalContainsSecond

http://lodlaundromat.org/.well-known/genid/b15634fcd88e4a40e28a2f022818e851#68
type: Restriction
min cardinality: 59
on property: intervalContainsSecond

http://lodlaundromat.org/.well-known/genid/b15634fcd88e4a40e28a2f022818e851#69
type: Restriction
has value: PT1M
on property: hasXsdDurationDescription (DataTypeProperty)

http://lodlaundromat.org/.well-known/genid/b15634fcd88e4a40e28a2f022818e851#74
type: Restriction
has value: P1M
on property: hasXsdDurationDescription (DataTypeProperty)

intervals
type: Ontology
imports: event.owl
imports: scovo
imports: dcam
imports: http://purl.org/dc/elements/1.1/
imports: terms
imports: core
imports: time
imports: skos-xl
version info: Created with TopBraid Composer

April
type: month of year
comment: The month of April

August
type: month of year
comment: The month of August

Half Year Interval
type: Class
comment: A class for business half year intervals. These intervals are not necessarily calendar aligned with month boundaries.
subclass of: Business Intervals
subclass of: Generic Half (Class)

Business Intervals
type: Class
comment: A top-level class for business intervals
subclass of: Dimension
subclass of: DateTimeInterval

Business Year
type: Class
comment: A class for regular annual business reporting and planning intervals, not necessarily calendar aligned.
subclass of: Business Intervals
subclass of: Generic Year (Class)

Calendar Day
type: Class
comment: A class for calendar aligned one day intervals, starting at 00:00 (midnight) on the relevant day. ISO 8601(E):2004 Section 2.2.6
subclass of: http://lodlaundromat.org/.well-known/genid/b15634fcd88e4a40e28a2f022818e851#1
subclass of: http://lodlaundromat.org/.well-known/genid/b15634fcd88e4a40e28a2f022818e851#2
subclass of: CalendarInterval (class)
subclass of: Generic Day (Class)

CalendarHalf (class)
type: Class
comment: A class for calendar aligned intervals that represent a calendar half year, a year being split into two half year periods of 6 months each.
subclass of: http://lodlaundromat.org/.well-known/genid/b15634fcd88e4a40e28a2f022818e851#3
subclass of: http://lodlaundromat.org/.well-known/genid/b15634fcd88e4a40e28a2f022818e851#4
subclass of: http://lodlaundromat.org/.well-known/genid/b15634fcd88e4a40e28a2f022818e851#5
subclass of: CalendarInterval (class)
subclass of: Generic Half (Class)

Calendar Hour (Class)
type: Class
comment: A class for calendar aligned hour-long intervals. ISO 8601(E):2004 Section 2.2.4
subclass of: http://lodlaundromat.org/.well-known/genid/b15634fcd88e4a40e28a2f022818e851#6
subclass of: http://lodlaundromat.org/.well-known/genid/b15634fcd88e4a40e28a2f022818e851#7
subclass of: CalendarInterval (class)
subclass of: Generic Hour (class)

CalendarInterval (class)
type: Class
comment: A class for all calendar aligned intervals. The start of a given interval is aligned with the start of each of its first (temporally) subordinate CalendarInterval. Halfs are align the start of the first and seventh month of a year; quarters with the first, forth, seventh and tenth months; months with calendar months sof forth for calendar days, hours,minutes and seconds align
subclass of: http://lodlaundromat.org/.well-known/genid/b15634fcd88e4a40e28a2f022818e851#10
subclass of: http://lodlaundromat.org/.well-known/genid/b15634fcd88e4a40e28a2f022818e851#11
subclass of: http://lodlaundromat.org/.well-known/genid/b15634fcd88e4a40e28a2f022818e851#12
subclass of: http://lodlaundromat.org/.well-known/genid/b15634fcd88e4a40e28a2f022818e851#13
subclass of: http://lodlaundromat.org/.well-known/genid/b15634fcd88e4a40e28a2f022818e851#14
subclass of: http://lodlaundromat.org/.well-known/genid/b15634fcd88e4a40e28a2f022818e851#15
subclass of: http://lodlaundromat.org/.well-known/genid/b15634fcd88e4a40e28a2f022818e851#16
subclass of: http://lodlaundromat.org/.well-known/genid/b15634fcd88e4a40e28a2f022818e851#8
subclass of: http://lodlaundromat.org/.well-known/genid/b15634fcd88e4a40e28a2f022818e851#9
subclass of: Dimension
subclass of: DateTimeInterval

Calendar Minute
type: Class
comment: A class for calendar align one minute intervals. ISO 8601(E):2004 Section 2.2.3 (for units - 1 minute interval are not defined).
subclass of: http://lodlaundromat.org/.well-known/genid/b15634fcd88e4a40e28a2f022818e851#17
subclass of: http://lodlaundromat.org/.well-known/genid/b15634fcd88e4a40e28a2f022818e851#18
subclass of: CalendarInterval (class)
subclass of: Generic Minute (Class)

Calendar Month
type: Class
comment: A class for calendar aligned intervals of one calendar month. ISO 8601(E):2004 Section 2.2.11
subclass of: http://lodlaundromat.org/.well-known/genid/b15634fcd88e4a40e28a2f022818e851#19
subclass of: http://lodlaundromat.org/.well-known/genid/b15634fcd88e4a40e28a2f022818e851#20
subclass of: http://lodlaundromat.org/.well-known/genid/b15634fcd88e4a40e28a2f022818e851#21
subclass of: http://lodlaundromat.org/.well-known/genid/b15634fcd88e4a40e28a2f022818e851#22
subclass of: CalendarInterval (class)
subclass of: Generic Month (Class)

Calendar Quarter
type: Class
comment: A class for calendar aligned one-quarter year (3 month) intervals
subclass of: http://lodlaundromat.org/.well-known/genid/b15634fcd88e4a40e28a2f022818e851#23
subclass of: http://lodlaundromat.org/.well-known/genid/b15634fcd88e4a40e28a2f022818e851#24
subclass of: CalendarInterval (class)
subclass of: Generic Quarter (Class)

Calendar Second
type: Class
comment: A class for calendar aligned one-second intervals. ISO 8601(E):2004 Section 2.2.1 (and 2.2.2 for leap seconds)(for units - 1 second interval are not defined).
subclass of: http://lodlaundromat.org/.well-known/genid/b15634fcd88e4a40e28a2f022818e851#25
subclass of: http://lodlaundromat.org/.well-known/genid/b15634fcd88e4a40e28a2f022818e851#26
subclass of: CalendarInterval (class)
subclass of: Generic Second (Class)

Calendar Year
type: Class
comment: A class for calendar aligned intervals of one whole year, ie. year long intervals that are aligned with a Calendar.
subclass of: http://lodlaundromat.org/.well-known/genid/b15634fcd88e4a40e28a2f022818e851#27
subclass of: http://lodlaundromat.org/.well-known/genid/b15634fcd88e4a40e28a2f022818e851#28
subclass of: http://lodlaundromat.org/.well-known/genid/b15634fcd88e4a40e28a2f022818e851#29
subclass of: http://lodlaundromat.org/.well-known/genid/b15634fcd88e4a40e28a2f022818e851#30
subclass of: http://lodlaundromat.org/.well-known/genid/b15634fcd88e4a40e28a2f022818e851#31
subclass of: CalendarInterval (class)
subclass of: Generic Year (Class)

Generic Day (Class)
type: Class
comment: A generic superclass for all day like entities.
subclass of: http://lodlaundromat.org/.well-known/genid/b15634fcd88e4a40e28a2f022818e851#32
subclass of: http://lodlaundromat.org/.well-known/genid/b15634fcd88e4a40e28a2f022818e851#33
subclass of: http://lodlaundromat.org/.well-known/genid/b15634fcd88e4a40e28a2f022818e851#34
subclass of: http://lodlaundromat.org/.well-known/genid/b15634fcd88e4a40e28a2f022818e851#35
subclass of: Interval

December
type: month of year
comment: The month of December

February
type: month of year
comment: The month of February

H1 Interval
type: Class
comment: A class for intervals that the first half of a (nominally) annual cycle.
subclass of: http://lodlaundromat.org/.well-known/genid/b15634fcd88e4a40e28a2f022818e851#36
subclass of: Generic Half (Class)

H2 Interval
type: Class
comment: A class for intervals that the second half of a (nominally) annual cycle.
subclass of: http://lodlaundromat.org/.well-known/genid/b15634fcd88e4a40e28a2f022818e851#40
subclass of: Generic Half (Class)

H3 Interval
type: Class
comment: A class for 3rd half year intervals in an abnormally long annual interval - in the UK a buisness interval may exceptionally extent to 6 quarters.
subclass of: http://lodlaundromat.org/.well-known/genid/b15634fcd88e4a40e28a2f022818e851#44
subclass of: Generic Half (Class)

Generic Half (Class)
type: Class
comment: A generic superclass for all half-year (6 month) like intervals
subclass of: http://lodlaundromat.org/.well-known/genid/b15634fcd88e4a40e28a2f022818e851#45
subclass of: http://lodlaundromat.org/.well-known/genid/b15634fcd88e4a40e28a2f022818e851#46
subclass of: http://lodlaundromat.org/.well-known/genid/b15634fcd88e4a40e28a2f022818e851#47
subclass of: http://lodlaundromat.org/.well-known/genid/b15634fcd88e4a40e28a2f022818e851#48
subclass of: http://lodlaundromat.org/.well-known/genid/b15634fcd88e4a40e28a2f022818e851#49
subclass of: Interval

Generic Hour (class)
type: Class
comment: A generic superclass for hour-long intervals. An hour may contain a positive or negative leap second (see http://en.wikipedia.org/wiki/Hour).
subclass of: http://lodlaundromat.org/.well-known/genid/b15634fcd88e4a40e28a2f022818e851#50
subclass of: http://lodlaundromat.org/.well-known/genid/b15634fcd88e4a40e28a2f022818e851#51
subclass of: http://lodlaundromat.org/.well-known/genid/b15634fcd88e4a40e28a2f022818e851#52
subclass of: http://lodlaundromat.org/.well-known/genid/b15634fcd88e4a40e28a2f022818e851#53
subclass of: http://lodlaundromat.org/.well-known/genid/b15634fcd88e4a40e28a2f022818e851#54
subclass of: http://lodlaundromat.org/.well-known/genid/b15634fcd88e4a40e28a2f022818e851#55
subclass of: http://lodlaundromat.org/.well-known/genid/b15634fcd88e4a40e28a2f022818e851#56
subclass of: Interval

Irregular Business interval
type: Class
comment: A business interval outside of the normal pattern of business intervals. In the UK companies house allow an annual reporting interval to be extended by upto 6 months once in 5 years (and at other exceptional times)
subclass of: Business Intervals

Calendar Week
type: Class
comment: A class for calendar weeks. Strictly not all calendar week intervals are contained within the year to which they may be attributed. The first or last week of a given calendar year may inculde days from the preceding or following calendar year respectively. An ISO 8601 week starts at 00:00:00 in a Monday and ends at the last moment of 23:59:59 on the following Sunday. ISO 8601(E):2004 Section 2.2.8
subclass of: http://lodlaundromat.org/.well-known/genid/b15634fcd88e4a40e28a2f022818e851#62
subclass of: http://lodlaundromat.org/.well-known/genid/b15634fcd88e4a40e28a2f022818e851#63
subclass of: http://lodlaundromat.org/.well-known/genid/b15634fcd88e4a40e28a2f022818e851#64
subclass of: http://lodlaundromat.org/.well-known/genid/b15634fcd88e4a40e28a2f022818e851#65
subclass of: CalendarInterval (class)
subclass of: Generic Week (Class)
preferred label: ISO 8601 Week

January
type: month of year
comment: The month of January

July
type: month of year
comment: The month of July

January
type: month of year
comment: The month of June
preferred label: June

March
type: month of year
comment: The month of March

May
type: month of year
comment: The month of May

Generic Minute (Class)
type: Class
comment: A generic superclass for all minute-long intervals. A minute may contain a positive or negative leap second.
subclass of: http://lodlaundromat.org/.well-known/genid/b15634fcd88e4a40e28a2f022818e851#66
subclass of: http://lodlaundromat.org/.well-known/genid/b15634fcd88e4a40e28a2f022818e851#67
subclass of: http://lodlaundromat.org/.well-known/genid/b15634fcd88e4a40e28a2f022818e851#68
subclass of: http://lodlaundromat.org/.well-known/genid/b15634fcd88e4a40e28a2f022818e851#69
subclass of: http://lodlaundromat.org/.well-known/genid/b15634fcd88e4a40e28a2f022818e851#70
subclass of: http://lodlaundromat.org/.well-known/genid/b15634fcd88e4a40e28a2f022818e851#71
subclass of: Interval

Generic Month (Class)
type: Class
comment: A generic superclass class for all month-long like intervals.
subclass of: http://lodlaundromat.org/.well-known/genid/b15634fcd88e4a40e28a2f022818e851#72
subclass of: http://lodlaundromat.org/.well-known/genid/b15634fcd88e4a40e28a2f022818e851#73
subclass of: http://lodlaundromat.org/.well-known/genid/b15634fcd88e4a40e28a2f022818e851#74
subclass of: http://lodlaundromat.org/.well-known/genid/b15634fcd88e4a40e28a2f022818e851#75
subclass of: Interval

month of year
type: Class
comment: A class for the months of a calendar year. A month of year is a recurring interval of about 12th of a year that re-occurs annually.
subclass of: Thing
one of: http://lodlaundromat.org/.well-known/genid/b15634fcd88e4a40e28a2f022818e851#76

November
type: month of year
comment: The month of Novermber

October
type: month of year
comment: The month of October

Q1 Interval
type: Class
comment: A class for intervals that are the first quarter of a (nominally) annual cycle.
subclass of: http://lodlaundromat.org/.well-known/genid/b15634fcd88e4a40e28a2f022818e851#88
subclass of: Generic Quarter (Class)

Q2 Interval
type: Class
comment: A class for intervals that are 2nd quarters of a (nominally) annual cycle
subclass of: http://lodlaundromat.org/.well-known/genid/b15634fcd88e4a40e28a2f022818e851#92
subclass of: http://lodlaundromat.org/.well-known/genid/b15634fcd88e4a40e28a2f022818e851#96
subclass of: Generic Quarter (Class)

Q3 Interval
type: Class
comment: A class for intervals that are 3rd quarters of a (nominally) annual cycle
subclass of: http://lodlaundromat.org/.well-known/genid/b15634fcd88e4a40e28a2f022818e851#97
subclass of: http://lodlaundromat.org/.well-known/genid/b15634fcd88e4a40e28a2f022818e851#98
subclass of: Generic Quarter (Class)

Q4 Interval
type: Class
comment: A class for intervals that are 4th quarters of a (nominally) annual cycle.
subclass of: http://lodlaundromat.org/.well-known/genid/b15634fcd88e4a40e28a2f022818e851#102
subclass of: http://lodlaundromat.org/.well-known/genid/b15634fcd88e4a40e28a2f022818e851#103
subclass of: Generic Quarter (Class)

Q5 Interval
type: Class
comment: A class for 5th quarters of an abnormally long annual interval - in the UK a buisness interval may exceptionally extent to 6 quarters.
subclass of: http://lodlaundromat.org/.well-known/genid/b15634fcd88e4a40e28a2f022818e851#107
subclass of: http://lodlaundromat.org/.well-known/genid/b15634fcd88e4a40e28a2f022818e851#111
subclass of: Generic Quarter (Class)

Q6 Interval
type: Class
comment: A class for 6th quarters of an abnormally long annual interval - in the UK a buisness interval may exceptionally extent to 6 quarters.
subclass of: http://lodlaundromat.org/.well-known/genid/b15634fcd88e4a40e28a2f022818e851#112
subclass of: http://lodlaundromat.org/.well-known/genid/b15634fcd88e4a40e28a2f022818e851#113
subclass of: Generic Quarter (Class)

Generic Quarter (Class)
type: Class
comment: A generic superclass for all Quarter (3-month) long intervals
subclass of: http://lodlaundromat.org/.well-known/genid/b15634fcd88e4a40e28a2f022818e851#114
subclass of: http://lodlaundromat.org/.well-known/genid/b15634fcd88e4a40e28a2f022818e851#115
subclass of: http://lodlaundromat.org/.well-known/genid/b15634fcd88e4a40e28a2f022818e851#116
subclass of: http://lodlaundromat.org/.well-known/genid/b15634fcd88e4a40e28a2f022818e851#117
subclass of: Interval

Generic Second (Class)
type: Class
comment: A generic superclass for all one-second long like intervals
subclass of: http://lodlaundromat.org/.well-known/genid/b15634fcd88e4a40e28a2f022818e851#118
subclass of: http://lodlaundromat.org/.well-known/genid/b15634fcd88e4a40e28a2f022818e851#119
subclass of: http://lodlaundromat.org/.well-known/genid/b15634fcd88e4a40e28a2f022818e851#120
subclass of: http://lodlaundromat.org/.well-known/genid/b15634fcd88e4a40e28a2f022818e851#121
subclass of: Interval

September
type: month of year
comment: The month of September

Generic Week (Class)
type: Class
comment: A generic superclass for all one-week long (7 day) intervals.
subclass of: http://lodlaundromat.org/.well-known/genid/b15634fcd88e4a40e28a2f022818e851#122
subclass of: http://lodlaundromat.org/.well-known/genid/b15634fcd88e4a40e28a2f022818e851#123
subclass of: http://lodlaundromat.org/.well-known/genid/b15634fcd88e4a40e28a2f022818e851#124
subclass of: http://lodlaundromat.org/.well-known/genid/b15634fcd88e4a40e28a2f022818e851#125
subclass of: http://lodlaundromat.org/.well-known/genid/b15634fcd88e4a40e28a2f022818e851#126
subclass of: Interval
preferred label: Generice Week (Class)

Generic Year (Class)
type: Class
comment: A generic superclass for all manner of Year like intervals. The the cardinality of days in a year is set to between 351 and 380 because in the UK the end of a business reporting year must be within 7 days of an annual reference date. In the worst cases this allows a reporting interval to be shortened or extended by up to two weeks.
subclass of: http://lodlaundromat.org/.well-known/genid/b15634fcd88e4a40e28a2f022818e851#127
subclass of: http://lodlaundromat.org/.well-known/genid/b15634fcd88e4a40e28a2f022818e851#128
subclass of: http://lodlaundromat.org/.well-known/genid/b15634fcd88e4a40e28a2f022818e851#129
subclass of: http://lodlaundromat.org/.well-known/genid/b15634fcd88e4a40e28a2f022818e851#130
subclass of: http://lodlaundromat.org/.well-known/genid/b15634fcd88e4a40e28a2f022818e851#131
subclass of: http://lodlaundromat.org/.well-known/genid/b15634fcd88e4a40e28a2f022818e851#132
subclass of: http://lodlaundromat.org/.well-known/genid/b15634fcd88e4a40e28a2f022818e851#133
subclass of: http://lodlaundromat.org/.well-known/genid/b15634fcd88e4a40e28a2f022818e851#134
subclass of: Interval

day of week
type: ObjectProperty
comment: The day of the week in which an instant or interval (of duration one day or less) occurs.
range: DayOfWeek

hasXsdDurationDescription (DataTypeProperty)
type: DatatypeProperty
comment: hasXsdDurationDescription: a data type property for associating an xsd:duration with an Interval. Inspired by "durationDescriptionDataType" mentioned in "http://www.w3.org/TR/owl-time" but which seems to have failed to make it into the formal ontology.
domain: http://lodlaundromat.org/.well-known/genid/b15634fcd88e4a40e28a2f022818e851#135
range: duration

month of year
type: ObjectProperty
comment: The month of the year in which a contained instant or interval (of duration one month or less) occurs.
domain: http://lodlaundromat.org/.well-known/genid/b15634fcd88e4a40e28a2f022818e851#138
range: month of year

Next Annual Reference Date.
type: FunctionalProperty
comment: A reference to the companies house annual reference date at the end of the previous reporting year. Annual reporting periods are required to end with 7 days of this date. Success annual reference dates normally advance by 1 whole year each year. However, companies can always apply for an earlier reference date and under restricted circumstance request a later reference date (upto 6 months later) see http://www.companieshouse.gov.uk/about/gbhtml/gp2.shtml#ch2
domain: Business Intervals
range: Calendar Day

1 day
hasXsdDurationDescription (DataTypeProperty): P1D
type: DurationDescriptions
comment: A duration of one day, typically 24 hours)
days: 1

1 half of a year
hasXsdDurationDescription (DataTypeProperty): P6M
type: DurationDescriptions
comment: A duration of one half year, typically 6 months
months: 6

1 hour
hasXsdDurationDescription (DataTypeProperty): PT1H
type: DurationDescriptions
comment: A duration of one hour
hours: 1

1 minute
hasXsdDurationDescription (DataTypeProperty): PT1M
type: DurationDescriptions
comment: A duration of 1 minute
minutes: 1

1 month
hasXsdDurationDescription (DataTypeProperty): P1M
type: DurationDescriptions
comment: A duration of one month
months: 1

1 quarter of a year
hasXsdDurationDescription (DataTypeProperty): P3M
type: DurationDescriptions
comment: A duration of one quarter, typically 3 months.
months: 3

1 second
hasXsdDurationDescription (DataTypeProperty): PT1S
type: DurationDescriptions
comment: A duration of one second
seconds: 1

1 week
hasXsdDurationDescription (DataTypeProperty): P7D
type: DurationDescriptions
comment: A duration of one week

1 year
hasXsdDurationDescription (DataTypeProperty): P1Y
type: DurationDescriptions
comment: A duration of one year
years: 1

ordinal day of month
type: DatatypeProperty
comment: The ordinal number of the day of the month in in which an instant or interval (of duration less than one day) occurs. The first day of a month has the ordinal number 1.
domain: http://lodlaundromat.org/.well-known/genid/b15634fcd88e4a40e28a2f022818e851#145
range: integer

ordinal day of week {en}
type: DatatypeProperty
comment: The ordinal number of the day of the week in which a (contained) instant or interval (of one day or less in duration) occurs. The Monday has an ordinal number of 1.
domain: http://lodlaundromat.org/.well-known/genid/b15634fcd88e4a40e28a2f022818e851#151
range: integer

ordinal day of month
type: DatatypeProperty
comment: The ordinal number of the day of the year in in which an instant or interval (of duration one day or less) occurs. The first day of a year has the ordinal number 1.
domain: http://lodlaundromat.org/.well-known/genid/b15634fcd88e4a40e28a2f022818e851#158
range: integer

has half of year
type: DatatypeProperty
comment: The ordinal number of the half of a year in which a contained instant or interval (of duration one half year or less) occurs. The first half of a year has the ordinal number 1.
domain: http://lodlaundromat.org/.well-known/genid/b15634fcd88e4a40e28a2f022818e851#164
range: integer

ordinal hour of day
type: DatatypeProperty
comment: The ordinal number of the hour of day in which a (contained) instant or interval (of less than one hour duration) occurs. The first hour of a day has ordinal number 0.
domain: http://lodlaundromat.org/.well-known/genid/b15634fcd88e4a40e28a2f022818e851#173
range: integer

ordinal minute of hour
type: DatatypeProperty
comment: The ordinal number of the minute of the hour in which a contained instant or interval (of duration one hour or less) occurs. The first minute of an hour has ordinal number 0.
domain: http://lodlaundromat.org/.well-known/genid/b15634fcd88e4a40e28a2f022818e851#178
range: integer

ordinal month of year
type: DatatypeProperty
comment: The ordinal number of the month of the year in in which an instant or interval (of duration one day or less) occurs. The January has the ordinal number 1.
domain: http://lodlaundromat.org/.well-known/genid/b15634fcd88e4a40e28a2f022818e851#182
range: integer

ordinal quarter of year
type: DatatypeProperty
comment: The ordinal number of the quarter of the year in which a contained instant or interval (of duration one quarter year or less) occurs. The ordinal number of the first quarter of a year is 1.
domain: http://lodlaundromat.org/.well-known/genid/b15634fcd88e4a40e28a2f022818e851#190
range: integer

ordinal second of minute
type: DatatypeProperty
comment: The ordinal number of the second of the minute in which a contained instant or interval (of one second duration or less) occurs. The ordinal number of the first second of a minute is 0.
domain: http://lodlaundromat.org/.well-known/genid/b15634fcd88e4a40e28a2f022818e851#198
range: integer

ordinal week of year
type: DatatypeProperty
comment: The ordinal number of the week of the year in which a contained instant or interval of one week duration or less occurs. The ordinal number of the first week of a year is 1. The first week of a year is the week that contains the first Thursday of the year.
domain: http://lodlaundromat.org/.well-known/genid/b15634fcd88e4a40e28a2f022818e851#201
range: integer

ordinal week of year year
type: DatatypeProperty
comment: The ordinal number of the week of year year in which an instant or interval (of duration one week or less) occurs. The first year of the AD era has ordinal number 1. The Week Of Year is the year to which a week of year pertains, which is usually the same as the calendar year except aorund the end of year where some days of the week may be deemed to be in the yearr following or the year previous depending on the alignment of the year boundary with the weekly cycle.
domain: http://lodlaundromat.org/.well-known/genid/b15634fcd88e4a40e28a2f022818e851#208
range: integer

ordinal year
type: DatatypeProperty
comment: The ordinal year of the year in which an instant or interval (of duration one year or less) occurs. The first year of the AD era has ordinal number 1.
domain: http://lodlaundromat.org/.well-known/genid/b15634fcd88e4a40e28a2f022818e851#215
range: integer

Previous Annual Reference Date.
type: FunctionalProperty
comment: A reference to the companies house annual reference date at the end of the previous reporting year. Annual reporting periods are required to end with 7 days of this date. Success annual reference dates normally advance by 1 whole year each year. However, companies can always apply for an earlier reference date and under restricted circumstance request a later reference date (upto 6 months later) see http://www.companieshouse.gov.uk/about/gbhtml/gp2.shtml#ch2.
domain: Business Intervals
range: Calendar Day

Friday
ordinal day of week {en}: 5

Monday
ordinal day of week {en}: 1

Saturday
ordinal day of week {en}: 6

Sunday
ordinal day of week {en}: 7

Thursday
ordinal day of week {en}: 4

Tuesday
ordinal day of week {en}: 2

Wednesday
ordinal day of week {en}: 3