(foaf) OnlineAccount
subclass of: http://lodlaundromat.org/.well-known/genid/9d396f826af70bb26e6c953fbd3fce0b#6
subclass of: http://lodlaundromat.org/.well-known/genid/9d396f826af70bb26e6c953fbd3fce0b#10
subclass of: http://lodlaundromat.org/.well-known/genid/9d396f826af70bb26e6c953fbd3fce0b#23
subclass of: Resource
subclass of: Thing
type: Class
nsterm status: unstable
comment: An online account.
disjoint with: (foaf) Agent
disjoint with: (foaf) Document
disjoint with: (foaf) Project

at time
range: Thing
domain: Thing
type: ObjectProperty
comment: It specifies the particular temporal instant or time period in which the situation takes place.
domain: value in time
sub property of: isSettingFor
range: TemporalEntity
type: Property
range: Resource
domain: Resource
domain: http://lodlaundromat.org/.well-known/genid/ae02cc16831f9433d7ffd24b36c29bf2#2
domain: http://lodlaundromat.org/.well-known/genid/ae02cc16831f9433d7ffd24b36c29bf2#1
domain: http://lodlaundromat.org/.well-known/genid/ae02cc16831f9433d7ffd24b36c29bf2#6
domain: TimeIndexedSituation

within context
domain: Thing
type: ObjectProperty
comment: It links to the specific context within which the fact of the entity having the value is relevant.
domain: value in time
sub property of: forEntity
range: Thing
type: Property
range: Resource
domain: Resource
domain: http://lodlaundromat.org/.well-known/genid/ae02cc16831f9433d7ffd24b36c29bf2#2
domain: http://lodlaundromat.org/.well-known/genid/ae02cc16831f9433d7ffd24b36c29bf2#1
domain: http://lodlaundromat.org/.well-known/genid/ae02cc16831f9433d7ffd24b36c29bf2#6
domain: TimeIndexedSituation

with value
domain: Thing
type: ObjectProperty
comment: It holds the value had by the entity taking part to the situation.
domain: value in time
sub property of: forEntity
range: Thing
type: Property
range: Resource
domain: Resource
domain: http://lodlaundromat.org/.well-known/genid/ae02cc16831f9433d7ffd24b36c29bf2#2
domain: http://lodlaundromat.org/.well-known/genid/ae02cc16831f9433d7ffd24b36c29bf2#1
domain: http://lodlaundromat.org/.well-known/genid/ae02cc16831f9433d7ffd24b36c29bf2#6
domain: TimeIndexedSituation

(foaf) Person
subclass of: Thing
subclass of: Resource
type: Class
nsterm status: stable
comment: A person.
subclass of: (foaf) Agent
disjoint with: (foaf) Group
disjoint with: (foaf) Organization
subclass of: http://lodlaundromat.org/.well-known/genid/9d396f826af70bb26e6c953fbd3fce0b#23
subclass of: http://lodlaundromat.org/.well-known/genid/9d396f826af70bb26e6c953fbd3fce0b#1
subclass of: http://lodlaundromat.org/.well-known/genid/9d396f826af70bb26e6c953fbd3fce0b#6
subclass of: http://lodlaundromat.org/.well-known/genid/9d396f826af70bb26e6c953fbd3fce0b#13
subclass of: http://lodlaundromat.org/.well-known/genid/9d396f826af70bb26e6c953fbd3fce0b#18

(foaf) Project
subclass of: http://lodlaundromat.org/.well-known/genid/9d396f826af70bb26e6c953fbd3fce0b#13
subclass of: Thing
subclass of: Resource
subclass of: http://lodlaundromat.org/.well-known/genid/9d396f826af70bb26e6c953fbd3fce0b#18
subclass of: http://lodlaundromat.org/.well-known/genid/9d396f826af70bb26e6c953fbd3fce0b#1
subclass of: http://lodlaundromat.org/.well-known/genid/9d396f826af70bb26e6c953fbd3fce0b#23
type: Class
nsterm status: unstable
comment: A project (a collective endeavour of some kind).
disjoint with: (foaf) Document
disjoint with: (foaf) Agent
disjoint with: (foaf) OnlineAccount

(foaf) Image
subclass of: Thing
subclass of: Resource
type: Class
nsterm status: testing
comment: An image.
subclass of: (foaf) Document
disjoint with: (foaf) PersonalProfileDocument
subclass of: http://lodlaundromat.org/.well-known/genid/9d396f826af70bb26e6c953fbd3fce0b#18
subclass of: http://lodlaundromat.org/.well-known/genid/9d396f826af70bb26e6c953fbd3fce0b#10
subclass of: http://lodlaundromat.org/.well-known/genid/9d396f826af70bb26e6c953fbd3fce0b#1
subclass of: http://lodlaundromat.org/.well-known/genid/9d396f826af70bb26e6c953fbd3fce0b#23

value in time
subclass of: Thing
subclass of: Resource
type: Class
subclass of: TimeIndexedSituation
subclass of: http://lodlaundromat.org/.well-known/genid/ae02cc16831f9433d7ffd24b36c29bf2#1
subclass of: http://lodlaundromat.org/.well-known/genid/ae02cc16831f9433d7ffd24b36c29bf2#2
subclass of: http://lodlaundromat.org/.well-known/genid/ae02cc16831f9433d7ffd24b36c29bf2#6
description: Having the role "graduate student" in a specific time (e.g., now) and context (e.g., "University of Bologna").
comment: It defines a particular kind of time-indexed situation that represents a hub linking the entity having a particular value, the value itself and the temporal and contextual extents from which the entity-value relationship depends.

(foaf) Document
subclass of: http://lodlaundromat.org/.well-known/genid/9d396f826af70bb26e6c953fbd3fce0b#18
subclass of: http://lodlaundromat.org/.well-known/genid/9d396f826af70bb26e6c953fbd3fce0b#1
subclass of: http://lodlaundromat.org/.well-known/genid/9d396f826af70bb26e6c953fbd3fce0b#10
subclass of: http://lodlaundromat.org/.well-known/genid/9d396f826af70bb26e6c953fbd3fce0b#23
subclass of: Thing
subclass of: Resource
type: Class
nsterm status: testing
comment: A document.
disjoint with: (foaf) Agent
disjoint with: (foaf) Project
disjoint with: (foaf) OnlineAccount

(foaf) Group
subclass of: Thing
subclass of: Resource
type: Class
nsterm status: unstable
comment: A class of Agents.
subclass of: (foaf) Agent
disjoint with: (foaf) Organization
disjoint with: (foaf) Person
subclass of: http://lodlaundromat.org/.well-known/genid/9d396f826af70bb26e6c953fbd3fce0b#13
subclass of: http://lodlaundromat.org/.well-known/genid/9d396f826af70bb26e6c953fbd3fce0b#1
subclass of: http://lodlaundromat.org/.well-known/genid/9d396f826af70bb26e6c953fbd3fce0b#6
subclass of: http://lodlaundromat.org/.well-known/genid/9d396f826af70bb26e6c953fbd3fce0b#18
subclass of: http://lodlaundromat.org/.well-known/genid/9d396f826af70bb26e6c953fbd3fce0b#23

(foaf) Agent
subclass of: http://lodlaundromat.org/.well-known/genid/9d396f826af70bb26e6c953fbd3fce0b#13
subclass of: http://lodlaundromat.org/.well-known/genid/9d396f826af70bb26e6c953fbd3fce0b#18
subclass of: http://lodlaundromat.org/.well-known/genid/9d396f826af70bb26e6c953fbd3fce0b#1
subclass of: http://lodlaundromat.org/.well-known/genid/9d396f826af70bb26e6c953fbd3fce0b#6
subclass of: http://lodlaundromat.org/.well-known/genid/9d396f826af70bb26e6c953fbd3fce0b#23
subclass of: Thing
subclass of: Resource
type: Class
nsterm status: unstable
comment: An agent (eg. person, group, software or physical artifact).
disjoint with: (foaf) Document
disjoint with: (foaf) Project
disjoint with: (foaf) OnlineAccount

(foaf) Organization
subclass of: Resource
subclass of: Thing
type: Class
nsterm status: unstable
comment: An organization.
subclass of: (foaf) Agent
disjoint with: (foaf) Person
disjoint with: (foaf) Group
subclass of: http://lodlaundromat.org/.well-known/genid/9d396f826af70bb26e6c953fbd3fce0b#23
subclass of: http://lodlaundromat.org/.well-known/genid/9d396f826af70bb26e6c953fbd3fce0b#13
subclass of: http://lodlaundromat.org/.well-known/genid/9d396f826af70bb26e6c953fbd3fce0b#18
subclass of: http://lodlaundromat.org/.well-known/genid/9d396f826af70bb26e6c953fbd3fce0b#6
subclass of: http://lodlaundromat.org/.well-known/genid/9d396f826af70bb26e6c953fbd3fce0b#1

has value
range: Thing
type: ObjectProperty
comment: It links an entity (e.g., a Person) to a particular ValueInTime situation;
range: value in time
sub property of: hasTimeIndexedSetting
domain: Thing
type: Property
range: Resource
range: http://lodlaundromat.org/.well-known/genid/ae02cc16831f9433d7ffd24b36c29bf2#6
range: http://lodlaundromat.org/.well-known/genid/ae02cc16831f9433d7ffd24b36c29bf2#2
range: http://lodlaundromat.org/.well-known/genid/ae02cc16831f9433d7ffd24b36c29bf2#1
range: TimeIndexedSituation
domain: Resource

(foaf) PersonalProfileDocument
subclass of: Resource
subclass of: Thing
type: Class
nsterm status: testing
comment: A personal profile RDF document.
subclass of: (foaf) Document
disjoint with: (foaf) Image
subclass of: http://lodlaundromat.org/.well-known/genid/9d396f826af70bb26e6c953fbd3fce0b#18
subclass of: http://lodlaundromat.org/.well-known/genid/9d396f826af70bb26e6c953fbd3fce0b#10
subclass of: http://lodlaundromat.org/.well-known/genid/9d396f826af70bb26e6c953fbd3fce0b#23
subclass of: http://lodlaundromat.org/.well-known/genid/9d396f826af70bb26e6c953fbd3fce0b#1

time-indexed value in context
contributor: Fabio Vitali
type: Ontology
contributor: David Shotton
comment: A pattern for the description of scenarios that involve entities having some value during a particular time and within a particular context.
description: Sometimes, we need to describe scenarios in which someone (e.g., a person) has a value (e.g., a particular role) during a particular time and for a particular context. Four different things are involved in these kinds of scenarios: 1. the entity having some value, e.g. a person or a document possessing a role or a status; 2. the value had by someone, e.g. a role or a status; 3. the time period during which the entity has that value, e.g. from April 2008 to September 2008; 4. the particular context that characterises the act of having that value, e.g. being a member of an institution or an editor of a particular journal. Thought as natural extension of the Time-indexed Situation pattern (http://ontologydesignpatterns.org/wiki/Submissions:TimeIndexedSituation), this ontological pattern, called Time-indexed Value in Context (TVC), is able to describe these kinds of scenarios.
creator: Silvio Peroni
title: The Time-indexed Value in Context
date: 2012-06-08
imports: time
imports: timeindexedsituation.owl

FOAF Essential v. 2.0
prior version: foaf-essential.owl
creator: me
publisher: Mindinformatics, Massachusetts General Hospital
contributor: Alan Ruttenberg
version info: 2.0
contributor: Paolo Ciccarese
title: FOAF Essential ontology
date: October 12, 2010
type: Ontology
language: en
format: rdf/xml