results in acquiring
range: Thing
range: status in time
domain: Thing
domain: event
type: ObjectProperty
comment: The property relating an event to the consequential acquisition of a particular publishing status.
sub property of: hasTimeIndexedSetting
inverse of: is acquired as consequence of
type: Property
range: Resource
domain: Resource
range: http://lodlaundromat.org/.well-known/genid/97a3a43eeabef5b5f9ca5d4c942ab5cd#9
range: http://lodlaundromat.org/.well-known/genid/97a3a43eeabef5b5f9ca5d4c942ab5cd#1
range: http://lodlaundromat.org/.well-known/genid/97a3a43eeabef5b5f9ca5d4c942ab5cd#8
range: ValueInTime
range: http://lodlaundromat.org/.well-known/genid/97a3a43eeabef5b5f9ca5d4c942ab5cd#2
range: http://lodlaundromat.org/.well-known/genid/97a3a43eeabef5b5f9ca5d4c942ab5cd#7

publishing status
subclass of: Resource
type: Class
subclass of: Thing
comment: A state or condition that a document may have that relates to the publication of such document.
subclass of: status

at time
range: Thing
domain: Thing
type: FunctionalProperty
type: ObjectProperty
comment: A time interval during which a status is held by a document.
type: Property
domain: Resource
range: Resource

is lost as consequence of
range: Thing
domain: Thing
inverse of: results in losing
type: ObjectProperty
comment: The property relating a particular publishing status to the event that causes its loss.
domain: status in time
range: event
sub property of: withinContext
type: Property
range: Resource
domain: Resource
domain: http://lodlaundromat.org/.well-known/genid/97a3a43eeabef5b5f9ca5d4c942ab5cd#8
domain: ValueInTime
domain: http://lodlaundromat.org/.well-known/genid/97a3a43eeabef5b5f9ca5d4c942ab5cd#9
domain: http://lodlaundromat.org/.well-known/genid/97a3a43eeabef5b5f9ca5d4c942ab5cd#7
domain: http://lodlaundromat.org/.well-known/genid/97a3a43eeabef5b5f9ca5d4c942ab5cd#2
domain: http://lodlaundromat.org/.well-known/genid/97a3a43eeabef5b5f9ca5d4c942ab5cd#1

status in time
subclass of: Resource
subclass of: Thing
type: Class
subclass of: http://lodlaundromat.org/.well-known/genid/97a3a43eeabef5b5f9ca5d4c942ab5cd#8
subclass of: http://lodlaundromat.org/.well-known/genid/97a3a43eeabef5b5f9ca5d4c942ab5cd#1
description: A status in time describes always: - a particular status S - a particular document D holding S - a particular time interval T in which D holds S - a particular event that causes the acquisition of S by D
subclass of: http://lodlaundromat.org/.well-known/genid/97a3a43eeabef5b5f9ca5d4c942ab5cd#2
subclass of: http://lodlaundromat.org/.well-known/genid/97a3a43eeabef5b5f9ca5d4c942ab5cd#7
comment: A particular situation that describe a state or condition some documents may have at a particular time as consequence of one or more events.
subclass of: http://lodlaundromat.org/.well-known/genid/97a3a43eeabef5b5f9ca5d4c942ab5cd#9
subclass of: ValueInTime

is status in
range: Thing
domain: Thing
type: ObjectProperty
comment: The property relating the definition of a specific status to the situation of the document, a dataset or something else holding that status at a specific time.
range: status in time
sub property of: hasTimeIndexedSetting
inverse of: with status
type: Property
range: Resource
domain: Resource
range: http://lodlaundromat.org/.well-known/genid/97a3a43eeabef5b5f9ca5d4c942ab5cd#9
range: http://lodlaundromat.org/.well-known/genid/97a3a43eeabef5b5f9ca5d4c942ab5cd#1
range: http://lodlaundromat.org/.well-known/genid/97a3a43eeabef5b5f9ca5d4c942ab5cd#8
range: ValueInTime
range: http://lodlaundromat.org/.well-known/genid/97a3a43eeabef5b5f9ca5d4c942ab5cd#2
range: http://lodlaundromat.org/.well-known/genid/97a3a43eeabef5b5f9ca5d4c942ab5cd#7

is status held by
range: Thing
domain: Thing
type: ObjectProperty
comment: A property relating a status held at a specific time to the document, dataset or other thing holding that status.
domain: status in time
sub property of: forEntity
inverse of: holds status in time
type: Property
range: Resource
domain: Resource
domain: http://lodlaundromat.org/.well-known/genid/97a3a43eeabef5b5f9ca5d4c942ab5cd#8
domain: ValueInTime
domain: http://lodlaundromat.org/.well-known/genid/97a3a43eeabef5b5f9ca5d4c942ab5cd#9
domain: http://lodlaundromat.org/.well-known/genid/97a3a43eeabef5b5f9ca5d4c942ab5cd#7
domain: http://lodlaundromat.org/.well-known/genid/97a3a43eeabef5b5f9ca5d4c942ab5cd#2
domain: http://lodlaundromat.org/.well-known/genid/97a3a43eeabef5b5f9ca5d4c942ab5cd#1

agent
subclass of: Resource
type: Class
subclass of: Thing
comment: An entity, such as a person, a group, an organization or a software agent, involved in one or more events.
subclass of: Object
subclass of: Agent

document
subclass of: Resource
type: Class
subclass of: Thing
comment: An abstract class defining any kinds of publishing work.

results in losing
range: status in time
domain: event
range: Thing
domain: Thing
type: ObjectProperty
comment: The property relating an event to the consequential loss of a particular publishing status.
sub property of: hasTimeIndexedSetting
inverse of: is lost as consequence of
type: Property
range: Resource
domain: Resource
range: http://lodlaundromat.org/.well-known/genid/97a3a43eeabef5b5f9ca5d4c942ab5cd#9
range: http://lodlaundromat.org/.well-known/genid/97a3a43eeabef5b5f9ca5d4c942ab5cd#1
range: http://lodlaundromat.org/.well-known/genid/97a3a43eeabef5b5f9ca5d4c942ab5cd#8
range: ValueInTime
range: http://lodlaundromat.org/.well-known/genid/97a3a43eeabef5b5f9ca5d4c942ab5cd#2
range: http://lodlaundromat.org/.well-known/genid/97a3a43eeabef5b5f9ca5d4c942ab5cd#7

holds status in time
range: Thing
domain: Thing
inverse of: is status held by
type: ObjectProperty
comment: A property relating a document, a dataset or some other thing to a status that it holds at a specific time.
range: status in time
sub property of: hasValue
type: Property
range: Resource
domain: Resource
range: http://lodlaundromat.org/.well-known/genid/97a3a43eeabef5b5f9ca5d4c942ab5cd#9
range: http://lodlaundromat.org/.well-known/genid/97a3a43eeabef5b5f9ca5d4c942ab5cd#1
range: http://lodlaundromat.org/.well-known/genid/97a3a43eeabef5b5f9ca5d4c942ab5cd#8
range: ValueInTime
range: http://lodlaundromat.org/.well-known/genid/97a3a43eeabef5b5f9ca5d4c942ab5cd#2
range: http://lodlaundromat.org/.well-known/genid/97a3a43eeabef5b5f9ca5d4c942ab5cd#7

status
subclass of: Resource
type: Class
comment: A state or condition that a document may have.
subclass of: Thing

time interval
subclass of: Resource
type: Class
subclass of: Thing
comment: Two (starting and ending) points in time that define a particular period of time.

is acquired as consequence of
inverse of: results in acquiring
range: Thing
domain: Thing
type: ObjectProperty
comment: The property relating a particular publishing status to the event that causes its acquisition.
domain: status in time
range: event
sub property of: withinContext
type: Property
range: Resource
domain: Resource
domain: http://lodlaundromat.org/.well-known/genid/97a3a43eeabef5b5f9ca5d4c942ab5cd#8
domain: ValueInTime
domain: http://lodlaundromat.org/.well-known/genid/97a3a43eeabef5b5f9ca5d4c942ab5cd#9
domain: http://lodlaundromat.org/.well-known/genid/97a3a43eeabef5b5f9ca5d4c942ab5cd#7
domain: http://lodlaundromat.org/.well-known/genid/97a3a43eeabef5b5f9ca5d4c942ab5cd#2
domain: http://lodlaundromat.org/.well-known/genid/97a3a43eeabef5b5f9ca5d4c942ab5cd#1

with status
range: Thing
domain: Thing
inverse of: is status in
type: ObjectProperty
comment: The property relating the holding of a status by a document, a dataset or something else at a specific time to the definition of that status.
domain: status in time
sub property of: withValue
type: Property
range: Resource
domain: Resource
domain: http://lodlaundromat.org/.well-known/genid/97a3a43eeabef5b5f9ca5d4c942ab5cd#8
domain: ValueInTime
domain: http://lodlaundromat.org/.well-known/genid/97a3a43eeabef5b5f9ca5d4c942ab5cd#9
domain: http://lodlaundromat.org/.well-known/genid/97a3a43eeabef5b5f9ca5d4c942ab5cd#7
domain: http://lodlaundromat.org/.well-known/genid/97a3a43eeabef5b5f9ca5d4c942ab5cd#2
domain: http://lodlaundromat.org/.well-known/genid/97a3a43eeabef5b5f9ca5d4c942ab5cd#1

http://lodlaundromat.org/.well-known/genid/97a3a43eeabef5b5f9ca5d4c942ab5cd#7
type: Class
subclass of: Resource
subclass of: Thing
type: Restriction
cardinality: 1
on property: is status held by

article processing charge status
subclass of: Resource
type: Class
subclass of: Thing
comment: A state or condition that a document may have that relates to a fee levied by a publisher on an author or an institution to cover the cost of publishing an Open Access journal article.
subclass of: status

event
subclass of: Resource
type: Class
subclass of: Thing
comment: An event that may happen during a publishing process, such as writing a draft, sending a preprint, publishing a paper, etc.

open access
type: publishing status
type: NamedIndividual
comment: The status of a published work (typically a scholarly publication or a dataset) that is freely available via the Internet for third parties to read without payment of access or subscription fees, and (in the case of a work published under a full open-access license) that is freely available to download and reuse for any purposes including commercial ones, including modification of the original work, its integration with other material, and its re-publication, subject typically to a requirement that the original authors and the source of the original work are acknowledged in compliance with scholarly citation norms. [See also: pso:gratis-open-access, pso:libre-open-access, pso:gold-open-access, pso:green-open-access, pso:embargoed and pso:subscription-access.]
type: Thing
type: status

corrected
type: publishing status
type: NamedIndividual
comment: The status of a work (for example a document or a dataset) in which errors, that may have introduced by the author, by a publisher, or by some automated process, have been corrected.
type: Thing
type: status

green open access
type: publishing status
type: NamedIndividual
comment: The status of a published work made available by the author, by self-archiving a version of the work for free and open public use in their institutional repository, in a central repository, or elsewhere, in parallel with publication of a subscription-access Version of Record of the work by a publisher. The green open-access version of the work may be a preprint (the version of the article as first submitted for publication) or a postprint (the pre-publication version of the article after incorporation of authors’ responses to peer reviewers’ comments). Its availability may have an embargo restriction imposed by the publisher of the subscription-access version of the work, that prevents the green open-access version from being freely available until some substantial time after publication of the subscription-access journal issue containing that article. A green open-access work should be accompanied by a license explicitly defining usage rights, for example a Creative Commons Attribution License. [See also: pso:open-access, pso:gratis-open-access, pso:libre-open-access, pso:gold-open-access, pso:embargoed and pso:subscription-access.]
type: Thing
type: status

draft
type: publishing status
type: NamedIndividual
comment: The status of a work (for example a document or a dataset) prior to completion and publication.
type: Thing
type: status

initial draft
type: publishing status
type: NamedIndividual
comment: The status of a pre-publication work (for example a document or a dataset) when in its initial stage of development.
type: Thing
type: status

gratis open access
type: publishing status
type: NamedIndividual
comment: The status of a published work which is free to read on-line, in contrast to subscription-access works, but to which licensing restrictions apply, limiting the possibilities for downloading, text mining, modification, re-publication or re-use of the published work. The term Gratis Open Access thus signifies absence of a price barrier to view. While both imply ‘free’ (a potentially ambiguous word), Gratis Open Access equates to ‘free as in beer’ while Libre Open Access (q.v.) equates to ‘free as in speech’. Gratis Open Access is thus a necessary but not a sufficient condition for true Libre Open Access. Many ‘open access’ publications by commercial scholarly publishers are only Gratis Open Access, while almost all publications by ‘pure’ Open Access scholarly publishers are Libre Open Access. [See also: pso:open-access, pso:libre-open-access, pso:gold-open-access, pso:green-open-access, pso:embargoed and pso:subscription-access.]
type: Thing
type: status

archived
type: publishing status
type: NamedIndividual
comment: The status of a work (for example a document or a dataset) that has been saved for long-term preservation in a physical or electronic archive.
type: Thing
type: status

proof
type: publishing status
type: NamedIndividual
comment: The status of a pre-publication document late in the publication process, once it has been accepted for publication by a publisher, after the inclusion of any author corrections required by the editor following peer-review, following copy editing and formatting to bring the manuscript into the house style, and prior to final checking by the editor, proof-reader and author to detect and eliminate any errors prior to publication.
type: Thing
type: status

unpublished
type: publishing status
type: NamedIndividual
comment: The status of a work (for example a document or a dataset) that has not been published by the author, a publisher or a data repository.
type: Thing
type: status

APC partially waived
type: article processing charge status
type: NamedIndividual
comment: The status of an article for which payment of the article processing charge has been partially waived by the publisher.
type: status
type: Thing

in press
type: publishing status
type: NamedIndividual
comment: The status of a document after it has been accepted for publication and prior to its formal publication in print. (Note that for many journal articles that are published electronically, this status rarely exists, since there is commonly no delay between acceptance and publication.)
type: Thing
type: status

enhanced
type: publishing status
type: NamedIndividual
comment: The status of a work (for example a document or a dataset) that has been updated or enhanced, for example by the provision of additional or supplementary material.
type: Thing
type: status

reviewed
type: publishing status
type: NamedIndividual
comment: The status of a published work, for example a book or a journal article, that has been subjected to a written review giving critical analysis of its content, scope and quality. [See also pso:peer-reviewed.]
type: Thing
type: status

withdrawn from submission
type: publishing status
type: NamedIndividual
comment: The status of a work (for example a pre-publication document or dataset) that has been voluntarily withdrawn by the author, having previously been submitted for publication, perhaps because the revisions requested by the peer-reviewers were considered impossible to achieve, or because the author wishes to submit it for publication elsewhere.
type: Thing
type: status

under review
type: publishing status
type: NamedIndividual
comment: The status of a document that has been received from the author(s) by an editor or a publisher for potential publication, and then has been sent to independent reviewers for their comments as to its suitability for publication, prior to receipt of such reviews.
type: Thing
type: status

confidential
type: publishing status
type: NamedIndividual
comment: The status of a document containing information that must be kept confidential.
type: Thing
type: status

APC fully waived
type: article processing charge status
type: NamedIndividual
comment: The status of an article for which payment of the article processing charge has been fully waived by the publisher.
type: status
type: Thing

libre open access
type: publishing status
type: NamedIndividual
comment: The status of a published work which is both free to read on-line, and to which additional usage rights apply, for example the right to text mine, make derivative works, re-use and re-publish the published work, such rights frequently being defined by application of an explicit license such as a Creative Commons license. [See also: pso:open-access, pso:gratis-open-access, pso:gold-open-access, pso:green-open-access, pso:embargoed and pso:subscription-access.]
type: Thing
type: status

published
type: publishing status
type: NamedIndividual
comment: The status of material (for example a document or a dataset) that has been published, i.e. made available for people to access, read or use, either freely or for a purchase price or an access fee.
type: Thing
type: status

copy-edited
type: publishing status
type: NamedIndividual
comment: The status of a document that has been subjected to copy editing, i.e. alterations to the text undertaken by someone other than the author that are designed to improve the formatting, style and accuracy of text, or to bring the text into the house style of the publisher (e.g. Americanization of British spelling), but that are not designed to alter the substance or meaning of the text.
type: Thing
type: status

subscription access
type: publishing status
type: NamedIndividual
comment: The status of a published work, typically an article in a journal issue, that is not available to read without payment of an article access fee or a journal subscription fee for that publication.
type: Thing
type: status

embargoed
type: publishing status
type: NamedIndividual
comment: The status of a work that is subjected to an embargo, which means that the work cannot be published, or in the case of a press release that it cannot be reported on, until a particular date known as the embargo date. For open-access journal articles, an embargoed article is one in which availability of the open-access version of the article is delayed by the publisher for a substantial embargo period, typically of six or twelve months, after subscription-access availability of the published work.
type: Thing
type: status

rejected for publication
type: publishing status
type: NamedIndividual
comment: The status of material (for example a document or a dataset) after it has been rejected for publication by a publisher or data repository.
type: Thing
type: status

PSO, the Publishing Status Ontology
rights: This work is distributed under a Creative Commons Attribution License (http://creativecommons.org/licenses/by/3.0/).
version info: 1.7.1
date: 2014-02-01
comment: PSO, the Publishing Status Ontology, is an ontology for describing the status held by a bibliographic document or other publication entity at each of the various stages in the publishing process. It forms part of SPAR, a suite of Semantic Publishing and Referencing Ontologies. Other SPAR ontologies are described at http://purl.org/spar/.
imports: participation.owl
imports: tvc
description: PSO, the Publishing Status Ontology, is an ontology written in OWL 2 DL for characterizing the publication status of a document or other publication entity at each of the various stages in the publishing process (e.g. draft, submitted, under review, rejected, accepted for publication, proof, published, Version of Record, catalogued, archived). Because it is based on the Time-indexed Value in Context ontology pattern (http://www.essepuntato.it/2012/04/tvc), it is easy to extends the set of specified statuses, simply by adding new individual to the class pso:Status or its sub-class pso:PublicationStatus.
type: Ontology
imports: foaf-essential
creator: Silvio Peroni
creator: David Shotton

retracted from publication
type: publishing status
type: NamedIndividual
comment: The status of a publication that has been subsequently retracted by the publisher, for example because it was subsequently found to contain erroneous or fraudulent information.
type: Thing
type: status

final draft
type: publishing status
type: NamedIndividual
comment: The status of a pre-publication work (for example a document or a dataset) when in the authors' opinion it has been brought to a stage of development that renders it suitable for publication.
type: Thing
type: status

gold open access
type: publishing status
type: NamedIndividual
comment: The status of a published work, typically a journal article, made available by the publisher on the publisher's own web site for third parties to read without payment of access or subscription fees. Gold open access has the benefit that the article is findable where you expect it to be, but licensing restrictions may limit the possibilities for downloading, text mining, modification, re-publication or re-use of the published work. Gold open-access publication typically involves payment by the author or his/her institution to the publisher of an article processing charge (aka an author publishing charge). [See also: pso:open-access, pso:gratis-open-access, pso:libre-open-access, pso:green-open-access, pso:embargoed and pso:subscription-access.]
type: Thing
type: status

APC paid
type: article processing charge status
type: NamedIndividual
comment: The status of an article for which the article processing charge has been paid to the publisher by the author or his/her institution.
type: status
type: Thing

version of record
type: publishing status
type: NamedIndividual
comment: The final version of a document that has been formally published as a peer-reviewed journal article, citable via a permanent identifier, and forming an abiding component of the scholarly record.
type: Thing
type: status

APC not required
type: article processing charge status
type: NamedIndividual
comment: The status of an article for which an article processing charge is not required by the publisher.
type: status
type: Thing

non-confidential
type: publishing status
type: NamedIndividual
comment: The status of a document containing information that may be shared publicly.
type: Thing
type: status

accepted for publication
type: publishing status
type: NamedIndividual
comment: The status of a work (for example a document or a dataset) once it has been accepted for publication by a publisher or data repository.
type: Thing
type: status

revised
type: publishing status
type: NamedIndividual
comment: The status of s work (for example a document or a dataset) that has been altered or improved, typically by the original author.
type: Thing
type: status

restricted access
type: publishing status
type: NamedIndividual
comment: The status of a work (typically a scholarly paper or a dataset) to which access is restricted. For example, confidential information to which access is made available only to those who have been approved by the owner or copyright holder of the asset after personal application, or to those with appropriate security clearance, or to those within a partnership.
type: Thing
type: status

APC not charged
type: article processing charge status
type: NamedIndividual
comment: The status of an article for which an article processing charge is not charged by the publisher.
type: status
type: Thing

catalogued
type: publishing status
type: NamedIndividual
comment: The status of a work (for example a document or a dataset) concerning which metadata has been stored in a physical or electronic catalogue.
type: Thing
type: status

anonymized
type: publishing status
type: NamedIndividual
comment: The status of a document or dataset that has been subjected to anonymization, so that individual persons, for example the authors and/or people that are the subjects described in the document or dataset, cannot be identified.
type: Thing
type: status

closed access
type: publishing status
type: NamedIndividual
comment: The status of a work (typically a private or secret paper or a confidential dataset) that is typically held unpublished in a 'dark' archive whose existence is unknown by the wider world, and that is only available to the owner or copyright holder of the asset.
type: Thing
type: status

submitted
type: publishing status
type: NamedIndividual
comment: The status of a work (for example a document or a dataset) that has been submitted for publication by the author to a publisher or a data repository, prior to its being accepted or rejected.
type: Thing
type: status

peer reviewed
type: publishing status
type: NamedIndividual
comment: The status of a work, typically a scholarly journal article, that has been peer reviewed, i.e. subjected to review by two or more independent reviewers (also know as referees) who are academic peers of the author(s), and judged by them to be of sufficient quality to merit publication, usually after further revision by the author to incorporate the reviewers' suggested modifications and improvements.
type: Thing
type: status

republished
type: publishing status
type: NamedIndividual
comment: The status of a publication (for example a book) that has been republished in a different edition or in translation, or of a work (for example a journal article or a poem) that is republished as part of a collection or an anthology, or of material (for example a figure from an existing publication) that is republished as part of a quite different publication. Where the publisher of the new work is different from the original publisher, such republication typically includes an acknowledgement of the source and copyright of the original material, and is undertaken after obtaining permission of the original copyright holder.
type: Thing
type: status

intermediate draft
type: publishing status
type: NamedIndividual
comment: The status of a pre-publication work (for example a document or a dataset) part-way through its development.
type: Thing
type: status