Agent
type: Class
comment: A resource that acts or has the power to act.
subclass of: Thing

Alternative title
type: DatatypeProperty
comment: An alternative to the title.
domain: Business Object
range: string

Contributor
type: Property
comment: An Agent who has participated in any phase of management of a BusinessObject or Resource.
domain: http://lodlaundromat.org/.well-known/genid/9614c311e239f1c4db9e2cf33b4c94f6#186

Coverage
type: Property
comment: A property to identify the Events and or Locations, all real or fictional, covered by the BusinessObject.
domain: Business Object

Creator
type: Property
comment: A creator of content such as a director or a producer.
sub property of: Contributor

date
type: DatatypeProperty
comment: A date associated with the BusinessObject, Resource or Contact/Person.
range: date

Description
type: DatatypeProperty
comment: A description of the BusinessObject or Resource.
domain: http://lodlaundromat.org/.well-known/genid/9614c311e239f1c4db9e2cf33b4c94f6#217

Format
type: Property
comment: Information about the Format of a Resource.
domain: Resource

identifier
type: DatatypeProperty
comment: An identifier associated with a BusinessObject or a resource.
domain: http://lodlaundromat.org/.well-known/genid/9614c311e239f1c4db9e2cf33b4c94f6#232
range: anyURI

Issued
type: DatatypeProperty
sub property of: date

Language
type: Property
comment: A Languages used in the BusinessObject or Resource.
domain: http://lodlaundromat.org/.well-known/genid/9614c311e239f1c4db9e2cf33b4c94f6#183

Modified
type: DatatypeProperty
sub property of: date

Publisher
type: Property
comment: An Agent involved in the distribution of content.
sub property of: Contributor

Relation
type: Property
comment: A relation between BusinessObjects and resources.

Rights
type: Property
comment: Rights information related to an Asset, aPublicationEvent, a BusinessObject or a resource.
domain: http://lodlaundromat.org/.well-known/genid/9614c311e239f1c4db9e2cf33b4c94f6#172

Source
type: Property
comment: To identify a Resource as the source of another Resource.
domain: Resource

Subject
type: Property
comment: To associate a Subject or topic addressed by a BusinessObject / Resource.
domain: http://lodlaundromat.org/.well-known/genid/9614c311e239f1c4db9e2cf33b4c94f6#180

Title
type: DatatypeProperty
comment: The title by which a BusinessObject is known.
domain: http://lodlaundromat.org/.well-known/genid/9614c311e239f1c4db9e2cf33b4c94f6#208

type
type: Property
comment: A concept associated with a BusinessObject or Resource.
domain: http://lodlaundromat.org/.well-known/genid/9614c311e239f1c4db9e2cf33b4c94f6#189

contributor
type: Property

coverage
type: Property

Creator
type: Property

Description
type: DatatypeProperty
range: string

format
type: Property

language
type: Property

Publisher
type: Property

Relation
type: Property

Rights
type: Property

Source
type: Property

Subject
type: Property

Title
type: DatatypeProperty
range: string

type
type: Property

Event
type: Class
comment: Music events, historic events, sports events, politics events, e.t.c.
subclass of: Event

Organisation
type: Class
comment: E.g., Businesses.
subclass of: Organisation

Person
type: Class
comment: all types of people such as politicians, athletes, historic figures, contributors in programmes e.t.c.
subclass of: Contact

Place
type: Class
comment: Another type of location.
subclass of: Location

Theme
type: Class
comment: This concept is used to represent intangible things or abstract concepts. For example, Financial Crisis, Midwifery, Happiness.
subclass of: Keyword

Date of birth
type: DatatypeProperty
comment: The date when a Contact/Person is born.
domain: Contact
sub property of: date

Date of death
type: DatatypeProperty
comment: The date when a Contact/Person has passed away.
domain: Contact
sub property of: date

Gender
type: DatatypeProperty
comment: The gender of a person e.g. male or female.
domain: Contact

Place of birth
type: DatatypeProperty
comment: The place where a person is born.

Place of death
type: DatatypeProperty
comment: The place where a person has passed away.

Primary topic
type: DatatypeProperty
comment: The main subject of interest.
sub property of: Description

Slug
type: DatatypeProperty
comment: One or more keywords.
sub property of: Description

Access conditions
type: Class
comment: The conditions under which content can be accessed.
subclass of: Rights

Agent
type: Class
comment: A person / contact or organisation contributing to the media resource.
subclass of: Agent

Ancillary data
type: Class
comment: Any ancillary data provided with the content other than captioning and subtitling.
subclass of: Data track

Ancillary data format
type: Class
comment: To define the format of AncillaryData such as legacy data used to be carried in vertical blanking intervals. This is provided as free text in an annotation label or as an identifier pointing to a term in a classification scheme.
subclass of: Data format

Annotation
type: Class
comment: A set of descriptive or technical metadata. Annotation can also be made in the form of a document or media resource such as an or video audio file . An annotation can exist on its own and be related / associated to other editorial objects or resources.
subclass of: Thing

Asset
type: Class
comment: The Class "Asset" is an object to which an identifier will be associated at commissioning. It will serve as a central reference point to manage rights associated to EditorialObjects, Resources, MediaResources or Essences, and PublicationEvents (distribution and exploitation conditions).
subclass of: Thing

Audience level
type: Class
comment: The age or occupational group of users for which the BusinessObject or resource has been designed or conceptualised.
subclass of: Target audience

Audience rating
type: Class
comment: The audience by which the Resource can be seen according to ratings like MPAA (http://en.wikipedia.org/wiki/Motion_picture_rating_system) or other organisational / national / local standards.
subclass of: Target audience

Audio block
type: Class
comment: An audioBlock represents a single sequence of audio samples with fixed parameters, including position, within a specified time. The sub-elements with audioBlock are dependent upon the typeDefintion or typeLabel of the parent audioChannel element.
subclass of: Essence

Binaural
type: Class
comment: For binaural audio, where playback is over headphones.
subclass of: Audio block

Direct speakers
type: Class
comment: For channel-based audio, where each channel feeds a speaker directly.
subclass of: Audio block

HOA
type: Class
comment: For scene-based audio where Ambisonics and HOA are used.
subclass of: Audio block

Matrix
type: Class
comment: For channel-based audio where channels are matrixed together, such as Mid-Side, Lt/Rt.
subclass of: Audio block

Objects
type: Class
comment: For object-based audio where channels represent audio objects (or parts of objects), so include positional information.
subclass of: Audio block

Audio channel
type: Class
comment: An audioChannel represents a single sequence of audio samples. It is sub-divided in the time domain into audioBlocks, which is must contain at least one of. The typeDefintion of the audioChannel format specifies the type of audio it is describing, and also determines which parameters are used within its audioBlock children.
subclass of: Essence

Binaural
type: Class
comment: For binaural audio, where playback is over headphones.
subclass of: Audio channel

Direct speakers
type: Class
comment: For channel-based audio, where each channel feeds a speaker directly.
subclass of: Audio channel

HOA
type: Class
comment: For scene-based audio where Ambisonics and HOA are used.
subclass of: Audio channel

Matrix
type: Class
comment: For channel-based audio where channels are matrixed together, such as Mid-Side, Lt/Rt.
subclass of: Audio channel

Objects
type: Class
comment: For object-based audio where channels represent audio objects (or parts of objects), so include positional information.
subclass of: Audio channel

Audio content
type: Class
comment: An audioContent defines one component of a programme (e.g. background music), its association with an audioGroup (e.g. a 2.0 audioPackFormat of audioChannelFormats for stereo reproduction), its association with an audioStreamFormat, and its set of loudness parameters.
subclass of: Audio programme

Audio encoding format
type: Class
comment: The encoding format for the audio.
subclass of: Encoding

Audio Format
type: Class
comment: The technical characteristics of an AudioResource such as the sampleRate. This is provided as free text in an annotation label or as an identifier pointing to a term in a classification scheme e.g. http://www.ebu.ch/metadata/ontologies/skos/ebu_AudioFormatCodeCS.rdf.
subclass of: Format

Audio object
type: Class
comment: Establish the relationship between the content using track UIDs and the format via audio packs. These can be nested, so refer to other audioObjects.
subclass of: Audio content

Audio pack
type: Class
comment: The audioPack brings together one or more audioChannels that belong together. For example 'stereo' and '5.1' would be an audioPack for channel-based formats. It can also contain references to other packs to allow nesting. To help define the type of channels described within the pack, a typeDefintion is used to define them.
subclass of: Essence

Binaural
type: Class
comment: For binaural audio, where playback is over headphones.
subclass of: Audio pack

Direct speakers
type: Class
comment: For channel-based audio, where each channel feeds a speaker directly.
subclass of: Audio pack

Audio pack format
type: Class
comment: The format of an AudioPack. Examples of audioPackFormats are 'stereo' and '5.1' for channel-based formats.
subclass of: Audio Format

HOA
type: Class
comment: For scene-based audio where Ambisonics and HOA are used.
subclass of: Audio pack

Matrix
type: Class
comment: For channel-based audio where channels are matrixed together, such as Mid-Side, Lt/Rt.
subclass of: Audio pack

Objects
type: Class
comment: For object-based audio where channels represent audio objects (or parts of objects), so include positional information.
subclass of: Audio pack

Audio programme
type: Class
comment: A set of one or more audioContent that derive from the same material, i.e. an audioMultiplex, and the definition of its multiplexed audioContents (e.g. foreground and commentary, background music).
subclass of: Programme

Audio stream
type: Class
comment: An audioStreamFormat describes a decodable signal - PCM signal or a Dolby E stream for example. It is composed of one or more AudioTracks.
subclass of: Stream

Audio stream format
type: Class
comment: The format of an AudioStream, e.g. PCM_FrontLeft or Dolby E.
subclass of: Audio Format

Audio track
type: Class
comment: An audioTrack is the basic audio data container of a medium. Attribute is an unambiguous reference to this container in a given medium.
comment: An audioTrack object defines a component of an audioStream. A single set of samples or data in the storage medium.
comment: Represents a physical container or carrier to hold an audio stream. This should be usually defined by many attributes such as ID, format (e.g. 48 kHz/24 bits), linkage information (e.g. odd/even)…
subclass of: Track

Audio track format
type: Class
comment: The format of an AudioTrack e.g. PCM_FrontLeft.
subclass of: Audio Format

Audio track UID
type: Class
comment: The association of AudioTracks with different file configurations e.g. BWF or MXF.
subclass of: Essence

Brand
type: Class
comment: A group of EditorialObjects having a Brand as a common denominator
subclass of: Group

Business Object
type: Class
comment: An image, a document, an annotation (descriptive textual metadata or audio/video tag), a tag (time related in audiovisual media resources), or an audiovisual media resource (optionally composed of one or more fragment / part and / or audio, video data tracks). Other types of BusinessObjects may be defined as subclasses.
subclass of: Thing

Captioning
type: Class
comment: To signal the presence of hard of hearing captioning.
subclass of: Data track

Captioning format
type: Class
comment: To define the format of captioning. Captioning's main use isfor hard of hearing transcription. This is provided as free text in an annotation label or as an identifier pointing to a term in a classification scheme.
subclass of: Data format

Cast member
type: Class
comment: A member of the cast list (a list of fictitious characters).
subclass of: Agent

Character
type: Class
comment: A fictitious contact / person.
subclass of: Agent

Closed caption
type: Class
comment: Closed captioning is provided as separate content.
subclass of: Captioning

Closed subtitling
type: Class
comment: Closed subtitles are provided as separate content.
subclass of: Subtitling

Codec
type: Class
comment: To provide information on a codec.
subclass of: Concept

Collection
type: Class
comment: A group of EditorialObjects. There can be many types of collections for which specific sub-classes should be defined. In the worl of archives, A collection corresponds to all items belonging to an individual / collector.
subclass of: Group

Colour space
type: Class
comment: The CoulourSpace of a VideoResource. A ColourSpace is defined as free text in an annotation label or as an identifier pointing to a term in a classification scheme such as http://www.ebu.ch/metadata/ontologies/skos/ebu_ColourCodeCS.rdf.
subclass of: Format

Component
type: Class
comment: A component e.g. audio, video, data or else or a MediaResource or Essence.
subclass of: Essence

Contact
type: Class
comment: A physical person.
subclass of: Agent

Container format
type: Class
comment: The container or wrapper format used to package audio, video and data components of a Mediaresource. The format is defined as free text or pointing at a term in a classification scheme e.g. http://www.ebu.ch/metadata/ontologies/skos/ebu_ContainerFormatCS.rdf.
subclass of: Format

Container Mime type
type: Class
comment: The definition of the container if available as a MIME type. This is provided as free text in an annotation label or as an identifier pointing to a term in a classification scheme. For more information: http://www.iana.org/assignments/media-types/application/index.html.
subclass of: Format

Copyright
type: Class
comment: To provide a copyright statement.
subclass of: Rights

Coverage restrictions
type: Class
comment: To provide information on possible restrictions regarding the temporal and spatial coverage for publication.
subclass of: Rights

DID
type: DatatypeProperty
comment: The Data Identifier word (along with the SDID, if used), indicates the type of ancillary data that the packet corresponds to.
domain: Ancillary data
range: integer

Data format
type: Class
comment: To provide addtional technical information on the characteristics of data streams in a MediaResource including but not limited to AncillaryData, Subtilting and Captioning. Additional specific data format may be defined as subclasses of DataFormat.
subclass of: Format

Data track
type: Class
comment: Ancillary data track e.g. ¨captioning" or "subtitling" in addition to video and audio tracks.
subclass of: Track

Department
type: Class
comment: A department within and organisation.
subclass of: Organisation

Depicted Event
type: Class
comment: A DepictedEVent is fictitious or historical or other sort of Event that the content of the BusinessObject or resource relates to.
subclass of: Event

Disclaimer
type: Class
comment: To provide a disclaimer of any form.
subclass of: Rights

Document
type: Class
comment: To describe a publication in the form of a document e.g. a html webpage (news item) or a pdf document e.g. a script.
subclass of: Resource

Document format
type: Class
comment: To provide technical information about the format of a document such as the orientation. This is provided as free text in an annotation label or as an identifier pointing to a term in a classification scheme.
subclass of: Format

Dopesheet
type: Class
comment: Provides additional information about a NewsItem, e.g. date and place, subject.
subclass of: Document

Editorial Object
type: Class
comment: In the audiovisual domain, the Class EditorialObject transforms a commissioned concept into an editorial definition of a MediaResource before fabrication (in the Production Domain) and Distribution (in the Distribution Domain). An EditorialObject is a set of descriptive metadata summarising e.g. editing decisions. An EditorialObject can also be a part of an EditorialObject, which is defined by its start time and duration. An EditorialObject can also be a group of EditorialObjects. For example a series composed of episodes is defined as an EditorialObject.
subclass of: Business Object

Encoding
type: Class
comment: To provide a definition of the encoding format for audio and video. This is provided as free text in an annotation label or as an identifier pointing to a term in a classification scheme e.g. http://www.ebu.ch/metadata/ontologies/skos/ebu_AudioCompressionCodeCS.rdf or http://www.ebu.ch/metadata/ontologies/skos/ebu_VideoCompressionCodeCS.rdf.
subclass of: Format

Essence
type: Class
comment: In some audiovisual standardisation groups, Essence is preferred to MediaResource. In also has subclasses well known as MediaObject clustered in AudioObjects and VideoObjects.
subclass of: Media Resource

Event
type: Class
comment: Additional types of event shall be defined as new sub-classes of event.
comment: An event related to the media resource, e.g. depicted in the resource (possibly fictional), etc.
subclass of: Thing

Exploitation issues
type: Class
comment: To highlight potential exploitation issues.
subclass of: Rights

File format
type: Class
comment: A file format for Resources other than audiovisual resources. The format is defined as free text or pointing at a term in a classification scheme e.g. http://www.ebu.ch/metadata/ontologies/skos/ebu_FileFormatCS.rdf.
subclass of: Format

Format
type: Class
comment: The format provides technical information on the format of a Resource. A BusinessObject can be instantiated in a variety of Resources each in a particular Format. Other specific data formats may be defined as subclasses of format.
subclass of: Concept

Genre
type: Class
comment: This class shall be used to provide information on the genre of the BusinessObject or Resource. This is provided as free text in an annotation label or as an identifier pointing to a term in a classification scheme e.g. http://www.ebu.ch/metadata/ontologies/skos/ebu_ContentGenreCS.rdf or http://www.ebu.ch/metadata/ontologies/skos/ebu_EditorialFormatCodeCS.rdf.
subclass of: Type

Group
type: Class
comment: To define a collection / group of media resources, for example a series made of episodes.
subclass of: Editorial Object

HOA parameters
type: DatatypeProperty
comment: To provide the parameters associated with an AudioBlock of type HOA.
domain: HOA
range: Literal

IPR restrictions
type: Class
comment: To provide information on intellectual property.
subclass of: Rights

Image
type: Class
comment: A still image / thumbnail / key frame / logo related to the media resource or being the media resource itself
subclass of: Business Object

Image format
type: Class
comment: To provide technical information about the format of an image such as the orientation. This is provided as free text in an annotation label or as an identifier pointing to a term in a classification scheme.
subclass of: Format

key frame
type: Class
comment: A key frame is a frame extarcted from video, e.g. representative of a part of a MediaResource.
subclass of: Picture

Keyword
type: Class
comment: To proivde keywords and define key concepts illustrating the content of the Resource or EditorialObject. This is provided as free text in an annotation label or as an identifier pointing to a term in a classification scheme.
subclass of: Concept

Language
type: Class
comment: To provide information on languages present in the BusinessObject and its purpose. This is provided as free text in an annotation label or as an identifier pointing to a term in a classification scheme.Other language specific types may be added as subclasses of language.
subclass of: Concept

Location
type: Class
comment: A location related to the media resource, e.g. depicted in the resource (possibly fictional) or where the resource was created (shooting location), etc.
comment: A type of location is defined as a sub-class of location.
comment: This is provided as free text in an annotation label or as an identifier pointing to a term in a classification scheme.
subclass of: Thing

Logo
type: Class
comment: A Logo allows to visually identify an organisation, publicationService, publicationChannel, or ratings / parentalGuidance
subclass of: Picture

Media Fragment
type: Class
comment: A MediaFragment is a temporal or spatial segment of a resource identified by a MediaGragment URI (http://www.w3.org/2008/WebVideo/Fragments/WD-media-fragments-spec/).
subclass of: Media Resource

Media Resource
type: Class
comment: The use of MediaResource is reserved to audiovisual content.
subclass of: Resource

Medium
type: Class
comment: To provide information on the medium formats in which the resource is available. This is provided as free text in an annotation label or as an identifier pointing to a term in a classification scheme.
subclass of: Format

Mime type
type: Class
comment: The definition of the container if available as a MIME type. This is provided as free text in an annotation label or as an identifier pointing to a term in a classification scheme. For more information: http://www.iana.org/assignments/media-types/index.html.
subclass of: Format

News Item
type: Class
comment: A NewsItem aggregates all information about a particular news event.
subclass of: Editorial Object

Object type
type: Class
comment: To specify the type of BusinessObject e.g. and EditorialObject of type "programme" or clip". This is provided as free text in an annotation label or as an identifier pointing to a term in a classification scheme e.g. http://www.ebu.ch/metadata/ontologies/skos/ebu_ObjectTypeCodeCS.rdf.
subclass of: Type

Open captions
type: Class
comment: Open Captions are burned in the image.
subclass of: Captioning

Open subtitling
type: Class
comment: Open subtitles are burned in the image.
subclass of: Subtitling

Organisation
type: Class
comment: An organisation (business, corporation, federation, etc.) or moral agent (gvernment body).
subclass of: Agent

OriginalLanguage
type: Class
comment: The original language in which the BusinessObject or Resource has been created and released. This is provided as free text in an annotation label or as an identifier pointing to a term in a classification scheme.
subclass of: Language

Part, Fragment, Segment
type: Class
comment: A Fragment is a particular section of a MediaResource identified by a start and end time or duration. Fragment can also be called segment or part.
comment: One of more media fragment (audio, video, data) composing an audiovisual media resource. In other ontolgies fragment is often referred to e.g. as a 'part' or 'segment' or 'fragment'.
subclass of: Editorial Object

Pictogram
type: Class
comment: A visual / graphical representation of a concept.
subclass of: Picture

Picture
type: Class
comment: A photography, a logo, a pictogram, etc.
subclass of: Resource

Programme
type: Class
comment: An EditorialObject corresponding to a MediaResource ready for publication.
subclass of: Editorial Object

Publication Channel
type: Class
comment: The name of the channel through which a Resource has been published as a PublicationEvent. A PublicationChannel can use a variety of medias e.g. broadcast or online.
subclass of: Thing

Publication Event
type: Class
comment: To describe any manifestation of a media resource on any media (live, on demand, catch-up TV, etc.) and the appropriate PublciationChannel.
subclass of: Thing

Publication History
type: Class
comment: A collection of PublicationEvents through which a resource has been published.
subclass of: Thing

Publication History
type: Class
comment: A collection of PublicationEvents organised as a PublicationPlanning.
subclass of: Thing

Radio Programme
type: Class
comment: A programme for distribution on radio channels.
subclass of: Programme

Rating
type: Class
comment: All the information about the rating/evaluation given to a media resource by an Agent i.e. a person/Contact or Organisation.
comment: This is provided as free text in an annotation label or as an identifier pointing to a term in a classification scheme.
subclass of: Thing

Resource
type: Class
comment: A manifestation of a BusinessObject.
subclass of: Thing

Rights
type: Class
comment: To provide information on the rights, including intellectual property, related to a BusinessObject or Resource.
subclass of: Thing

RightsClearance
type: Class
comment: To signal that rights have been cleared (or not)
subclass of: Rights

Role
type: Class
comment: To define the role / action of an agent. This is provided as free text in an annotation label or as an identifier pointing to a term in a classification scheme.
subclass of: Concept

SDID
type: DatatypeProperty
comment: Secondary data identification word for ancillary data. Send mode identifier. An identifier which indicates the transmission timing for closed caption data.
domain: Ancillary data
range: integer

Season
type: Class
comment: A series can be composed of one or more seasons clustering a certain number of episodes. Fro this reason, seasons are related to series using the isRelatedTo property.
subclass of: Group

Series
type: Class
comment: Series is a particular type of collection. TV or Radio Series are composed of Episodes.
subclass of: Group

Service
type: Class
comment: A service is the umbrella under which one or more PublicationChannel is operated.
subclass of: Thing

Signing
type: Class
comment: To signal the presence of Signing for hard of hearing users. The type of Signing (e.g. incursted in or else) or language of Signing can be specified using the appropriate properties.
subclass of: Video track

Signing format
type: Class
comment: To provide additional information on the signing format. This is provided as free text in an annotation label or as an identifier pointing to a term in a classification scheme.
subclass of: Video format

Sport item
type: Class
comment: A SportItem aggregates all information about a sport event.
subclass of: Editorial Object

Staff member.
type: Class
comment: Staff or crew member.
subclass of: Agent

Storage type
type: Class
comment: The type of storage used for the repository. This is provided as free text in an annotation label or as an identifier pointing to a term in a classification scheme.
subclass of: Concept

Stream
type: Class
comment: A continuous stream of bits.
subclass of: Component

Subject
type: Class
comment: A term describing the topic covered by the BusinessObject or resource. This is provided as free text in an annotation label or as an identifier pointing to a term in a classification scheme.
subclass of: Concept

Subtitling
type: Class
comment: To signal the presence of subtitles for translation in alternative languages.
subclass of: Data track

Subtitling format
type: Class
comment: To define the format of subtitling. subtitling's main use isfor translation. This is provided as free text in an annotation label or as an identifier pointing to a term in a classification scheme.
subclass of: Data format

TV Programme
type: Class
comment: A programme for distribution on television channels.
subclass of: Programme

Tag
type: Class
comment: An annotation specific to a particular timestamp in audiovisual MediaResources.
subclass of: Annotation

Target audience
type: Class
comment: The target audience (target region, target audience category but also parental guidance recommendation) for which the media resource is intended.
comment: This is provided as free text in an annotation label or as an identifier pointing to a term in a classification scheme.
subclass of: Type

Thumbnail
type: Class
comment: A thumbnail is a low resolution picture that can be associated with EditorialObjects or e.g. MediaResources or Contacts.
subclass of: Picture

Topic
type: Class
comment: A type subject for use in some contexts. This is provided as free text in an annotation label or as an identifier pointing to a term in a classification scheme.
subclass of: Subject

Track
type: Class
comment: Audiovisual content can be composed of audio, video and data Tracks (including captioning and subtitling).
subclass of: Resource

Type
type: Class
comment: An expression of type in textual form or as a term from a classification scheme.
subclass of: Concept

UID
type: DatatypeProperty
comment: A unique identifier associated with an AudioTrackUID.
domain: Audio track UID
sub property of: Identifier

Usage rights
type: Class
comment: Usage rights associated with content.
subclass of: Rights

Video encoding format
type: Class
comment: The encoding format of the video.
subclass of: Encoding

Video format
type: Class
comment: To provide additional technical information about a video resource such as the frame rate. This is provided as free text in an annotation label or as an identifier pointing to a term in a classification scheme.
subclass of: Format

Video stream
type: Class
comment: A decodable video stream of bits.
subclass of: Stream

Video track
type: Class
comment: A specialisation of Track for Video to provide a link to specific data properties such as frameRate, etc. Signing is another possible example of video track. Specific VideoTracks such as Signing can be defined as sub VideoTracks.. In advanced systems, different VideoTracks can be used to provide e.g. different viewing angles.
subclass of: Track

Abridged title
type: DatatypeProperty
comment: A shorter version of the title.
sub property of: Alternative title

Absolute distance (in meters)
type: DatatypeProperty
comment: To express an absolute distance in meters.
domain: Audio pack
range: float

Abstract
type: DatatypeProperty
comment: To provide a brief summary.
sub property of: Description

Adult content
type: DatatypeProperty
comment: A flag to indicate that the BusinessObject contains adult content.
domain: http://lodlaundromat.org/.well-known/genid/9614c311e239f1c4db9e2cf33b4c94f6#226
range: boolean

Address
type: DatatypeProperty
comment: To provide the address of an Agent (Contact/person or organisation).
domain: Agent
range: string

Age
type: DatatypeProperty
comment: The age of a Contact/Person
domain: Contact
range: integer

Email
type: DatatypeProperty
comment: To provide the email address of an agent (Contact/person or organisation).
domain: Agent
range: string
equivalent property: mbox

Mobile
type: DatatypeProperty
comment: To provide the mobile telephone number of an Agent (Contact/person or organisation)
domain: Agent
range: string

Name
type: DatatypeProperty
comment: The name by which an Organisation is known.
comment: To provide the full name of Contact/person - family and given name.
domain: Agent
range: string

Telephone
type: DatatypeProperty
comment: To provide the telephone number of an Agent (Contact/person or Organisation).
domain: Agent
range: string

Homepage
type: DatatypeProperty
comment: To provide the address of the webpage of an Agent (Contact/person or Organisation).
domain: Agent
range: anyURI
equivalent property: homepage

Alternative title
type: DatatypeProperty
comment: To provide an alternative title.
sub property of: Alternative title
equivalent property: alternativeTitle

Exclusion area
type: ObjectProperty
comment: To define the Location (e.g. country, region) to which Rating and TargetAudience do NOT apply.
domain: http://lodlaundromat.org/.well-known/genid/9614c311e239f1c4db9e2cf33b4c94f6#54
range: Location

Coverage
type: ObjectProperty
comment: To define the location/region to which Rating and TargetAudience apply.
domain: http://lodlaundromat.org/.well-known/genid/9614c311e239f1c4db9e2cf33b4c94f6#65
range: Location

Aspect ratio
type: DatatypeProperty
comment: To provide the aspect ratio of a video frame or image. Several types of different aspect ration can apply to the same video image. If necessary, specialised aspect ratios can be defined as subproperties.
domain: http://lodlaundromat.org/.well-known/genid/9614c311e239f1c4db9e2cf33b4c94f6#204
range: string

Audio channel number
type: DatatypeProperty
comment: The total number of audio channels contained in the MediaResource.
domain: Media Resource
range: nonNegativeInteger

Audio MXFlookup
type: DatatypeProperty
comment: The parameters for MXF mapping.
domain: Audio track UID
range: Literal

Audio track configuration
type: DatatypeProperty
comment: To provide the configuration of an audio track (e.g. stereo pair) in a MediaResource.
domain: Media Resource
range: string

Bit depth
type: DatatypeProperty
comment: To provide the audio encoding bit depth. Also called sample size.
domain: Audio track UID
range: integer

Bitrate
type: DatatypeProperty
comment: To provide the bitrate at which the MediaResource can be played in bits/second. Current bitrate if constant, and average bitrate if variable.
domain: Media Resource
range: nonNegativeInteger

Maximum bitrate
type: DatatypeProperty
comment: The maximum bitrate when variable, in bits per second.
domain: Media Resource
range: integer
equivalent property: averageBitrate

Bitrate mode
type: DatatypeProperty
comment: A flag to indicate if the bit rate is fixed or variable.
domain: Media Resource
range: string

Bookmark
type: DatatypeProperty
comment: To provide a bookmark.
sub property of: Description

Name
type: DatatypeProperty
comment: A name attributed to a BusinessObject.
domain: Business Object
range: string

Captioning source
type: DatatypeProperty
comment: To provide information on the source of a captioning file.
domain: Media Resource
range: string

Channel lock indicator
type: DatatypeProperty
comment: A flag as a channel lock indicator.
range: boolean
sub property of: AudioBlock object parameters

Codec family
type: DatatypeProperty
comment: To provide information on the product family of the Codec.
domain: Codec
range: string

Codec name
type: DatatypeProperty
comment: To provide a name for the Codec, e.g. a product name.
domain: Codec
range: string

Codec vendor
type: DatatypeProperty
comment: To provide a name for the vendor of the Codec.
domain: Codec
range: string

Codec version
type: DatatypeProperty
comment: To provide information on the version of the Codec.
domain: Codec
range: string

Comments
type: DatatypeProperty
comment: To provide a comment.
sub property of: Description

Occupation
type: DatatypeProperty
comment: The job / occupation name of a Contact / person.
domain: Contact
range: string

Username
type: DatatypeProperty
comment: The username by which a Contact / person is known e.g. when attributing a rating value.
domain: Contact
range: string
equivalent property: nick

Creation date/time
type: DatatypeProperty
comment: The date of creation of the Resource.
domain: http://lodlaundromat.org/.well-known/genid/9614c311e239f1c4db9e2cf33b4c94f6#223
sub property of: date
equivalent property: creationDate

Digitisation date/time
type: DatatypeProperty
comment: To provide the date of digitisation of the Resource.
domain: http://lodlaundromat.org/.well-known/genid/9614c311e239f1c4db9e2cf33b4c94f6#220
sub property of: date

Publication date/time
type: DatatypeProperty
comment: To provide the date of release of the Resource.
sub property of: Issued
equivalent property: releaseDate

Modification date/time
type: DatatypeProperty
comment: To indicate the date at which the Resource has been modified.
domain: http://lodlaundromat.org/.well-known/genid/9614c311e239f1c4db9e2cf33b4c94f6#229
sub property of: Modified

Degree
type: DatatypeProperty
comment: Degree of the HOA component.
sub property of: HOA parameters

Description
type: DatatypeProperty
comment: This can be specialised by using sub-properties like defined in http://www.ebu.ch/metadata/cs/web/ebu_DescriptionTypeCodeCS_p.xml.htm implemented as examples as e.g. 'summary' or 'script'.
domain: Business Object
sub property of: Description
equivalent property: description

Dialog indicator
type: DatatypeProperty
comment: A flag to indicate the AudioContent or AudioObject contains a dialogue.
domain: http://lodlaundromat.org/.well-known/genid/9614c311e239f1c4db9e2cf33b4c94f6#235
range: boolean

Diffuse indicator
type: DatatypeProperty
comment: A flag as a 'diffuse' indicator for AudioBlocks of type objects.
domain: Audio block
range: boolean
sub property of: AudioBlock object parameters

Dopesheet
type: DatatypeProperty
comment: To provide a dopesheet with a title and brief description for news.
sub property of: Description

Duration
type: DatatypeProperty
comment: To provide information on the duration of a MediaResource. It corresponds to 'duration' in the Ontology for Media Resources.
domain: http://lodlaundromat.org/.well-known/genid/9614c311e239f1c4db9e2cf33b4c94f6#241
range: Literal
equivalent property: duration

Duration (time)
type: DatatypeProperty
comment: To provide a duration as normal time.
range: time
sub property of: Duration

Duration (edit units)
type: DatatypeProperty
comment: To provide a duration as a number of EditUnits which value is for instance the inverse of the audio sample rate or video frame rate.
range: double
sub property of: Duration

Published Duration
type: DatatypeProperty
comment: To provide information on the published / announced duration of an EditorialObject.
domain: Editorial Object
range: Literal

Published duration (time)
type: DatatypeProperty
comment: To provide a published duration as normal time.
range: dateTime
sub property of: Published Duration

Published duration (edit units)
type: DatatypeProperty
comment: To provide a published duration as a number of EditUnits which value is for instance the inverse of the audio sample rate or video frame rate.
range: double
sub property of: Published Duration

Published duration (timecode)
type: DatatypeProperty
comment: The published duration expressed as a timecode.
range: string
sub property of: Published Duration

Duration (timecode)
type: DatatypeProperty
comment: The duration expressed as a timecode.
range: string
sub property of: Duration

Edit unit
type: DatatypeProperty
comment: The edit unit is e.g. the inverse of the audio sample rate or video frame rate.
domain: Media Resource
range: float

End time
type: DatatypeProperty
comment: The start point of the media resource.
domain: Media Resource
range: Literal

End time (time)
type: DatatypeProperty
comment: The start time expressed using a time expression.
range: time
sub property of: End time

End time (edit units)
type: DatatypeProperty
comment: A start time expressed as a number of edit units.
range: double
sub property of: End time

End time (timecode)
type: DatatypeProperty
comment: A start time expressed as timecode.
range: string
sub property of: End time

Equation
type: DatatypeProperty
comment: To provide the equation of an HOA component
sub property of: HOA parameters

Description
type: DatatypeProperty
comment: To provide a deescription for an Event.
domain: Event
range: string

Event end date
type: DatatypeProperty
comment: The end date of an Event.
domain: Event
range: string

Event name
type: DatatypeProperty
comment: To provide a name for an Event.
domain: Event
range: string

Event start date
type: DatatypeProperty
comment: The start date of an Event.
domain: Event
range: string

Family name
type: DatatypeProperty
comment: To provide a family name / last name.
sub property of: Name
equivalent property: familyName

Fictitious agent indicator
type: DatatypeProperty
comment: A flag to indicate if an agent of fictitious (set to true).
domain: Agent
range: boolean

File size
type: DatatypeProperty
comment: to provide the size of a MediaResource in bytes.
domain: Resource
range: double

File name
type: DatatypeProperty
comment: The name of the file containing the Resource.
domain: Resource
range: string

Previous
type: ObjectProperty
comment: A link to a an BusinessObject or a Resource preceding the current BusinessObject or Resource in an ordered sequence
domain: http://lodlaundromat.org/.well-known/genid/9614c311e239f1c4db9e2cf33b4c94f6#74
range: http://lodlaundromat.org/.well-known/genid/9614c311e239f1c4db9e2cf33b4c94f6#71
sub property of: Relation

Frame rate
type: DatatypeProperty
comment: The frame rate of the video signal in frame per second.
domain: Video track
range: double
equivalent property: frameRate

Frame size unit
type: DatatypeProperty
comment: The unit used to express the frame width or height. The unit by default is 'pixel'.
domain: Video track
range: string
equivalent property: frameSizeUnit

Frequency
type: DatatypeProperty
comment: To provide the frequency of an AudioChannel filter
domain: Audio channel
range: integer

Matrix gain (constant)
type: DatatypeProperty
comment: Multiplication factor of another AudioChannel. Constant value.
sub property of: Matrix coefficients

Matrix gain (variable)
type: DatatypeProperty
comment: Multiplication factor of another AudioChannel. Variable value.
sub property of: Matrix coefficients

Given name
type: DatatypeProperty
comment: To provide one or more given names.
sub property of: Name
equivalent property: givenName

Group description
type: DatatypeProperty
comment: A textual description of a Group.
domain: Group
range: string

Group name
type: DatatypeProperty
comment: The name attributed to a Group.
domain: Group
range: string

Affiliation
type: ObjectProperty
comment: A property to establish the relation between a Contact/person and an Organisation.
domain: Contact
range: Organisation

Ancillary data
type: ObjectProperty
comment: A property to signal the presence of AncillaryData associated with the EditorialObject and / or MediaResource.
domain: http://lodlaundromat.org/.well-known/genid/9614c311e239f1c4db9e2cf33b4c94f6#68
range: Ancillary data

Ancillary data format
type: Property
sub property of: Data format

Annotation
type: ObjectProperty
comment: A property to signal the presence of Annotation information associated with an EditorialObject and / or a MediaResource.
domain: http://lodlaundromat.org/.well-known/genid/9614c311e239f1c4db9e2cf33b4c94f6#169
range: Annotation

Annotation Source
type: ObjectProperty
comment: To identify the Agent, Contact/person or Organisation who has provided the Annotation.
domain: Annotation
range: Agent

Audio encoding format
type: Property
sub property of: Encoding format

Audio format
type: Property
sub property of: Format

Captioning
type: ObjectProperty
comment: To signal the presence of Captioning.
domain: http://lodlaundromat.org/.well-known/genid/9614c311e239f1c4db9e2cf33b4c94f6#13
range: Captioning

Captioning format
type: Property
sub property of: Data format

Cast role
type: ObjectProperty
comment: To define the roles involved in the creation of or related to the BusinessObject. The Role acts as a link to the Agent fulfilling that function.
domain: Business Object
range: Role

Encoder
type: Property
comment: To identify the Codec with which the Resource has been encoded.
domain: Resource
equivalent property: hasCompression

Colour space
type: Property
sub property of: Format

Contact
type: ObjectProperty
comment: To provide information on a Contact for an Organisation or a physical person (e.g. the agent of an actor).
domain: Agent
range: Contact

Container format
type: Property
sub property of: Format

Mime type
type: Property
sub property of: Format

Contributor
type: ObjectProperty
comment: To provide information on Contacts/persons or Organisations who have contributed to the BusinessObject or Resource.
range: Agent
sub property of: Contributor
equivalent property: hasContributor

Coverage
type: ObjectProperty
comment: A property to identify the Events and or Locations, all real or fictional, covered by the BusinessObject.
range: http://lodlaundromat.org/.well-known/genid/9614c311e239f1c4db9e2cf33b4c94f6#130
sub property of: Coverage
equivalent property: hasRelatedLocation

Creation location
type: ObjectProperty
comment: The Location where content has been created.
range: Location
sub property of: Coverage

Creator
type: ObjectProperty
comment: To identify an Agent involved in the creation of the Resource or BusinessObject.
sub property of: Creator
equivalent property: hasCreator

Data format
type: Property
sub property of: Format

Department
type: ObjectProperty
comment: To identify Departments within an Organisation.
domain: Organisation
range: Department

has document format
type: Property
sub property of: Format

Dopesheet
type: ObjectProperty
comment: To associate a Dopesheet with a NewsItem.
domain: News Item
range: Dopesheet

Encoding format
type: Property
sub property of: Format

Episode
type: ObjectProperty
comment: To identify an episode of a Series or a Season.
domain: http://lodlaundromat.org/.well-known/genid/9614c311e239f1c4db9e2cf33b4c94f6#45
range: Programme
sub property of: Editorial object
inverse of: Parent season

Event
type: ObjectProperty
comment: To associate an Event with a Location.
domain: Location
range: Event
sub property of: Coverage

File format
type: Property
sub property of: Format

Format
type: Property
comment: A property to define the Format of a Resource.
sub property of: Format
equivalent property: hasFormat

Genre
type: ObjectProperty
comment: To define a Genre/category associated to the BusinesssObject.
domain: Business Object
range: Genre
sub property of: Type
equivalent property: hasGenre

Image format
type: Property
sub property of: Format

Keyword
type: Property
comment: To associate a concept, descriptive phrase or Keyword that specifies the topic of the BusinessObject or Annotation.
domain: http://lodlaundromat.org/.well-known/genid/9614c311e239f1c4db9e2cf33b4c94f6#177
equivalent property: hasKeyword

Language
type: Property
comment: To associate a Language to a Resource or BusinessObject. A controlled vocabulary based on BCP 47 is recommended. This property can also be used to identify the presence of sign language (RFC 5646). By inheritance, the hasLanguage property applies indifferently at the MediaResource / Fragment / Track levels at which the usage is being defined. Best practice recommends to use to best possible level of granularity fo describe the usage of language within a MediaResource including at Fragment and Track levels.
sub property of: Language
equivalent property: hasLanguage

Location
type: ObjectProperty
comment: To associate a Location with a BusinessObject.
domain: Event
range: Location
sub property of: Coverage

Logo
type: ObjectProperty
comment: Logos can be used in a variety of contexts. Logo can be associated with an Organisation or a Service or a PublicationChannel.
domain: http://lodlaundromat.org/.well-known/genid/9614c311e239f1c4db9e2cf33b4c94f6#114
range: Logo

Part
type: ObjectProperty
comment: To define Parts (segments, fragments, etc.) withiin a MediaResource.
domain: http://lodlaundromat.org/.well-known/genid/9614c311e239f1c4db9e2cf33b4c94f6#19
range: Media Fragment
sub property of: Resource
equivalent property: hasFragment
inverse of: Source

Medium
type: Property
sub property of: Format

Member.
type: ObjectProperty
comment: To establish group/collection relationship between EditorialObjects.
domain: Group
range: Editorial Object

Metadata attributor
type: ObjectProperty
comment: To identify the Agent (Contact/person or Organisation) who has created the metadata.
domain: Subject
range: Agent

Mime type
type: Property
sub property of: Format

Object type
type: ObjectProperty
comment: To define an ObjectType for the BusinessObject (e.g. book, report, programme, clip) if not defined as a subClass of BusinessObject.
domain: Business Object
range: Object type
sub property of: Type

Original language
type: Property
sub property of: Language

Part
type: ObjectProperty
comment: To define Parts (segments, fragments, etc.) within a BusinessObject.
domain: Editorial Object
range: Part, Fragment, Segment
sub property of: Editorial object

Pictogram
type: ObjectProperty
comment: To provide a visual representation of TargetAudience or Rating.
domain: http://lodlaundromat.org/.well-known/genid/9614c311e239f1c4db9e2cf33b4c94f6#39
range: Pictogram

Publication channel
type: ObjectProperty
comment: To associate a PublicationEvent with a PublicationChannel.
domain: Publication Event
range: Publication Channel

Publication event
type: ObjectProperty
comment: To associate PublicationEvents with PublicationChannels or as elements of a PublicationHistory or PublicationPlanning.
domain: http://lodlaundromat.org/.well-known/genid/9614c311e239f1c4db9e2cf33b4c94f6#118
range: Publication Event

Publisher
type: ObjectProperty
comment: To identify an Agent involved in the publication of the Resource or BusinessObject.
sub property of: Publisher
equivalent property: hasPublisher

Rating
type: ObjectProperty
comment: To identify the presence of Rating attributed to a Resource or BusinessObject.
domain: http://lodlaundromat.org/.well-known/genid/9614c311e239f1c4db9e2cf33b4c94f6#91
range: Rating
equivalent property: hasRating

Rating provider
type: ObjectProperty
comment: To identify an Agent (Contact/person or Organisation) who has proposed a Rating.
domain: Rating
range: Agent

Audio block
type: ObjectProperty
comment: To associate an AudioBlock with an AudioChannel.
domain: Audio channel
range: Audio block
sub property of: Resource

Audio channel
type: ObjectProperty
comment: To associate an AudioChannel with an AudioPack or an AudioStream.
domain: http://lodlaundromat.org/.well-known/genid/9614c311e239f1c4db9e2cf33b4c94f6#22
range: Audio channel
sub property of: Resource

Audio content
type: ObjectProperty
comment: To identify the AudioContent associated with an AudioProgramme.
domain: Audio programme
range: Audio content
sub property of: Editorial object

Audio object
type: ObjectProperty
comment: To identify AudioObjects associated with AudioContent or other AudioObjects.
domain: http://lodlaundromat.org/.well-known/genid/9614c311e239f1c4db9e2cf33b4c94f6#94
range: Audio object
sub property of: Editorial object

Audio pack
type: ObjectProperty
comment: To associate and AudioPack with an AudioObject or another AudioPack or an AudioStream or an AudioTrackUID.
domain: http://lodlaundromat.org/.well-known/genid/9614c311e239f1c4db9e2cf33b4c94f6#109
range: Audio pack
sub property of: Resource

Audio stream
type: ObjectProperty
comment: To associate an AudioStream with an AudioTrack.
domain: Audio track
range: Audio stream
sub property of: Resource

Audio track
type: ObjectProperty
comment: To associate an AudioTrack with an AudioStream or an AudioTrackUID.
domain: http://lodlaundromat.org/.well-known/genid/9614c311e239f1c4db9e2cf33b4c94f6#16
range: Audio track
sub property of: Resource

Audio track UID
type: ObjectProperty
comment: To associate an AudioTrackUID with an AudioObject.
domain: Audio object
range: Audio track UID
sub property of: Resource

Editorial object
type: ObjectProperty
comment: EditorialObjects can be related to other BusinessOjects, Assets (and associated rights), PublicationEvents(defined when commissioning the EditorialObject before it is instantiated as a Resource (manifestation), or Resources, or Ratings.
domain: http://lodlaundromat.org/.well-known/genid/9614c311e239f1c4db9e2cf33b4c94f6#133
range: Editorial Object
sub property of: Relation

has related event
type: Property
domain: http://lodlaundromat.org/.well-known/genid/9614c311e239f1c4db9e2cf33b4c94f6#192
range: Event
sub property of: Relation

Image
type: ObjectProperty
comment: To associate an Image with a BusinessObject.
domain: Business Object
range: Image
sub property of: Editorial object

has related event
type: Property
domain: http://lodlaundromat.org/.well-known/genid/9614c311e239f1c4db9e2cf33b4c94f6#195
range: Location
sub property of: Relation

Media fragment
type: ObjectProperty
comment: To associate a Part of an EditorialObject with a MediaFragment within the association MediaResource instantiating the EditorialObject.
domain: Part, Fragment, Segment
range: Media Fragment
sub property of: Part

Picture
type: ObjectProperty
comment: To associate a Picture with a BusinessObject or a Resource.
domain: http://lodlaundromat.org/.well-known/genid/9614c311e239f1c4db9e2cf33b4c94f6#77
range: Picture
sub property of: Resource
equivalent property: hasRelatedImage

Publication event
type: ObjectProperty
comment: To identify the PublicationEvent associated with a MediaResource (manifestation of an EditorialObject).
domain: Media Resource
range: Publication Event

Resource
type: ObjectProperty
comment: To identify a Resource associated with an Asset or a BusinessObject or a PublicationEvent or another Resource.
domain: http://lodlaundromat.org/.well-known/genid/9614c311e239f1c4db9e2cf33b4c94f6#139
range: Resource
sub property of: Relation
equivalent property: hasRelatedResource

Contact
type: ObjectProperty
comment: To identify a Contact/person who can provide assistance / guidance regarding the associated Rights.
domain: Rights
range: Contact

Rights holder
type: ObjectProperty
comment: To identify an Agent (Contact/person or Organisation) having/managing Rights.
domain: Rights
range: Agent

Role
type: Property
comment: To define the role of an Agent (Contact/person or Organisation). The association in a particular context is made by declaring the hasCastRole associated with the BusinessObject.
domain: Agent

Season
type: ObjectProperty
comment: The Season of a Series.
domain: Series
range: Season
sub property of: Editorial object
inverse of: Parent Series

Accessibility - signing
type: ObjectProperty
comment: To identify the presence of Signing associated to the BusinessObject/Resource.
domain: http://lodlaundromat.org/.well-known/genid/9614c311e239f1c4db9e2cf33b4c94f6#80
range: Signing
equivalent property: hasSigning

Signing format
type: Property
sub property of: Video format

Source
type: ObjectProperty
comment: To identify a Resource as the source of another Resource.
range: Resource
sub property of: Source
equivalent property: hasSource

Staff
type: ObjectProperty
comment: To identify staff working within an Organisation.
domain: Organisation
range: Contact

Storage type
type: Property
comment: To define a particular type of storage / repository associated with the Locator from where a Resource can be accessed.
domain: Resource

Subject
type: Property
comment: To associate a Subject addressed with a BusinessObject / Resource.
sub property of: Subject

Subtitling
type: ObjectProperty
comment: To signal the presence of Subtitling associated with the EditorialObject or MediaResource.
domain: http://lodlaundromat.org/.well-known/genid/9614c311e239f1c4db9e2cf33b4c94f6#25
range: Subtitling
equivalent property: hasSubtitling

Subtitling format
type: Property
sub property of: Data format

Target audience
type: ObjectProperty
comment: To associate a TargetAudience (e.g. for parental guiddance or targeting a particular social group) with a BusinessObject/Resource.
domain: Business Object
range: Target audience
sub property of: Type
equivalent property: hasTargetAudience

Theme
type: ObjectProperty
sub property of: Keyword

Topic
type: Property
sub property of: Subject

Track
type: ObjectProperty
comment: To associate audio/data/video tracks with a MediaResource.
domain: Media Resource
range: Track
sub property of: Resource
equivalent property: hasTrack

Type
type: Property
comment: To define a type of BusinessObject is not declared as a subClass of BusinessObject.
domain: Business Object
sub property of: type

Version
type: ObjectProperty
comment: To identify another version of an Asset, BusinessObject or Resource.
domain: http://lodlaundromat.org/.well-known/genid/9614c311e239f1c4db9e2cf33b4c94f6#149
range: http://lodlaundromat.org/.well-known/genid/9614c311e239f1c4db9e2cf33b4c94f6#145
sub property of: Relation
inverse of: Version of

Video encoding format
type: Property
sub property of: Encoding format

Video format
type: Property
sub property of: Format

Hash code
type: DatatypeProperty
comment: The hash value associated to a Resource. There are different methods / algorithms to calculate hash values, which can be defined as subproperties.
domain: Resource
range: string

Height
type: DatatypeProperty
comment: The height of e.g. a video frame typically expressed as a number of lines or the height of a picture/image expressed in millimeters or else.
domain: Resource
range: integer
equivalent property: frameHeight

Height unit
type: DatatypeProperty
comment: The unit used to measure a Height e.g. in pixels or number of lines or millimeters or else.
domain: Resource
range: string

High pass frequency
type: DatatypeProperty
comment: The high pass frequency of the AudioChannel filter.
sub property of: Frequency

Highlights
type: DatatypeProperty
comment: To provide highlights.
sub property of: Description

Asset, resource, object
type: ObjectProperty
comment: To identify a BusinessObject or Resource on which an Agent (Contact/person or Organisation) holds Rights.
domain: Agent
range: http://lodlaundromat.org/.well-known/genid/9614c311e239f1c4db9e2cf33b4c94f6#1

Identifier
type: DatatypeProperty
comment: Corresponds to 'identifier' in the W3C Ontology for Media Annotation. The URI may be used to express an alternative identifier of the resource, or to share an identifier used by other instances of the same resource (equivalent to the fucntionality owl:sameAs).
comment: This property is intended to provide an alternative identifier for the resource, which has no URI counterpart. In the case where the alternative identifier can be expressed as a URI, it is recommended to use owl:sameAs instead.
sub property of: identifier

Audio object importance
type: DatatypeProperty
comment: To indicate the importance of an AudioObject or AudioPack.
domain: http://lodlaundromat.org/.well-known/genid/9614c311e239f1c4db9e2cf33b4c94f6#238
range: string

Business object
type: ObjectProperty
comment: To link a particular manifestation of a BusinessObject to the corresponding Resource.
domain: Resource
range: Business Object
sub property of: Editorial object

Interaction flag
type: DatatypeProperty
comment: A flag to indicate if the user can interact woith the content.
domain: Audio object
range: boolean

Agent
type: ObjectProperty
comment: To identify a Contact/person or Organisation as part of a cast list.
domain: Cast member
range: http://lodlaundromat.org/.well-known/genid/9614c311e239f1c4db9e2cf33b4c94f6#42

Character
type: ObjectProperty
comment: To identify the character personified by a Cast individual.
domain: Cast member
range: Character

Copyright
type: ObjectProperty
comment: Copyright statement.
range: Rights
sub property of: Rights
equivalent property: isCopyrightedBy

Rights
type: ObjectProperty
comment: The Rights or policy applicable to the BusinessObject, Asset, Resource or PublicationEvent.
range: Rights
sub property of: Rights
equivalent property: hasPermission
equivalent property: hasPolicy

Parent season
type: ObjectProperty
comment: The Episode of a Series or a Season.
domain: Programme
range: http://lodlaundromat.org/.well-known/genid/9614c311e239f1c4db9e2cf33b4c94f6#36
sub property of: Editorial object
inverse of: Episode

Fictitious contact
type: ObjectProperty
comment: To identify Contact/persons being fictitious.
domain: Character
range: Contact

Source
type: ObjectProperty
comment: To identify the MediaResource to which the MediaFragment belongs to.
domain: Media Fragment
range: Media Resource
sub property of: Resource
equivalent property: isFragmentOf
inverse of: Part

Member of
type: ObjectProperty
comment: To identify a Group to which an EidtorialObject is a member of.
domain: Editorial Object
range: Group
sub property of: Relation
inverse of: Member.

Next
type: ObjectProperty
comment: A link to a an BusinessObject or a Resource following the current BusinessObject or Resource in an ordered sequence
domain: http://lodlaundromat.org/.well-known/genid/9614c311e239f1c4db9e2cf33b4c94f6#51
range: http://lodlaundromat.org/.well-known/genid/9614c311e239f1c4db9e2cf33b4c94f6#48
sub property of: Relation

Operator, owner
type: ObjectProperty
comment: To identify the Service that operates the PublicationChannel.
domain: Publication Channel
range: Service
sub property of: Relation

Owner
type: ObjectProperty
comment: To identify the Agent (Contact/person or Organisation) who owns a Service operating a PublicationChannel.
domain: Service
range: Agent
sub property of: Relation

Related object, resource
type: ObjectProperty
comment: To express references across Assets, BusinessObjects or Resources.
domain: http://lodlaundromat.org/.well-known/genid/9614c311e239f1c4db9e2cf33b4c94f6#87
range: http://lodlaundromat.org/.well-known/genid/9614c311e239f1c4db9e2cf33b4c94f6#83
sub property of: Relation

Related to
type: ObjectProperty
comment: To establish relationships between Assets, BusinessObjects, PublicationEvents, Ratings and Resources.
domain: http://lodlaundromat.org/.well-known/genid/9614c311e239f1c4db9e2cf33b4c94f6#103
range: http://lodlaundromat.org/.well-known/genid/9614c311e239f1c4db9e2cf33b4c94f6#97
sub property of: Relation
equivalent property: relation

Replacement
type: ObjectProperty
comment: To identify substitutions.
domain: http://lodlaundromat.org/.well-known/genid/9614c311e239f1c4db9e2cf33b4c94f6#28
range: http://lodlaundromat.org/.well-known/genid/9614c311e239f1c4db9e2cf33b4c94f6#32
sub property of: Relation

Required
type: ObjectProperty
comment: To express strong relations between Assets, BusinessObjects or Resources.
domain: http://lodlaundromat.org/.well-known/genid/9614c311e239f1c4db9e2cf33b4c94f6#153
range: http://lodlaundromat.org/.well-known/genid/9614c311e239f1c4db9e2cf33b4c94f6#157
sub property of: Relation

Parent Series
type: ObjectProperty
comment: The Season of a Series.
domain: Season
range: Series
sub property of: Editorial object
inverse of: Season

Version of
type: ObjectProperty
comment: To identify related versions.
domain: http://lodlaundromat.org/.well-known/genid/9614c311e239f1c4db9e2cf33b4c94f6#61
range: http://lodlaundromat.org/.well-known/genid/9614c311e239f1c4db9e2cf33b4c94f6#57
sub property of: Relation
inverse of: Version

Jump position indicator
type: DatatypeProperty
comment: A falg to indicate a jum position for an AudioBlock.
range: boolean
sub property of: AudioBlock object parameters

Keyword definition
type: DatatypeProperty
comment: To provide a definition for a Keyword.
domain: Keyword
range: string

Line number
type: DatatypeProperty
comment: To provide the number of the line on which ancillary data is being carried and the equivalent in the digital domain.
domain: Ancillary data
range: integer

Address
type: DatatypeProperty
comment: To provide the address of a Location.
domain: Location
range: string

Area
type: DatatypeProperty
comment: To provide the Area part of an Adrress.
sub property of: Address

Country
type: DatatypeProperty
comment: To provide the country name and or country code.
sub property of: Address

Address line
type: DatatypeProperty
comment: To write address line with e.g. the street name and number.
sub property of: Address

Locality
type: DatatypeProperty
comment: To provide the name of a city, viallge, etc.
sub property of: Address

Postal code
type: DatatypeProperty
comment: To provide an address postal code.
sub property of: Address

Altitude
type: DatatypeProperty
comment: To define the altitude of a Location in meters.
domain: Location
range: double
equivalent property: locationAltitude

Coordinate system
type: DatatypeProperty
comment: To specify the name of the gps coordinate system used for the Location.
domain: Location
range: string

Location description
type: DatatypeProperty
comment: To provide a description of a particular Location.
domain: Location
range: string

Latitude
type: DatatypeProperty
comment: The latitude of the Location.
domain: Location
range: double
equivalent property: locationLatitude

Longitude
type: DatatypeProperty
comment: To define the longitude of the Location.
domain: Location
range: double
equivalent property: locationLongitude

Location name
type: DatatypeProperty
comment: The name by which a Location is known.
domain: Location
range: string
equivalent property: locationName

Region
type: DatatypeProperty
comment: To provide a description of a particular region assocoated to the Location.
domain: Location
range: string

Locator
type: DatatypeProperty
comment: A locator from where the Resource can be accessed.
domain: Resource
range: string
equivalent property: locator

Target information
type: DatatypeProperty
comment: Information about storage accessed by the locator.
domain: Resource
range: string

Integrated loudness
type: DatatypeProperty
comment: The value for integrated loudness measured at AudioProgramme or AudioContent level.
domain: http://lodlaundromat.org/.well-known/genid/9614c311e239f1c4db9e2cf33b4c94f6#256
range: float
sub property of: loudness parameters

Max momentary loudness
type: DatatypeProperty
comment: The value for maximum momentary loudness measured at AudioProgramme or AudioContent level.
domain: http://lodlaundromat.org/.well-known/genid/9614c311e239f1c4db9e2cf33b4c94f6#198
range: float
sub property of: loudness parameters

Max true peak loudness
type: DatatypeProperty
comment: The value for maximum true peak loudness measured at AudioProgramme or AudioContent level.
domain: http://lodlaundromat.org/.well-known/genid/9614c311e239f1c4db9e2cf33b4c94f6#244
range: float
sub property of: loudness parameters

Loudness method
type: DatatypeProperty
comment: The method for loudness measurement at AudioProgramme or AudioContent level.
domain: http://lodlaundromat.org/.well-known/genid/9614c311e239f1c4db9e2cf33b4c94f6#253
range: float
sub property of: loudness parameters

loudness parameters
type: DatatypeProperty
comment: All the parameters for measurement of loudness at the AudioContent or AudioProgramme level.
domain: http://lodlaundromat.org/.well-known/genid/9614c311e239f1c4db9e2cf33b4c94f6#201
range: Literal

Loudness range
type: DatatypeProperty
comment: The loudness range measured at AudioProgramme or AudioContent level.
domain: http://lodlaundromat.org/.well-known/genid/9614c311e239f1c4db9e2cf33b4c94f6#214
range: float
sub property of: loudness parameters

Max short term loudness
type: DatatypeProperty
comment: The maximum short term loudness measured at AudioProgramme or AudioContent level.
domain: http://lodlaundromat.org/.well-known/genid/9614c311e239f1c4db9e2cf33b4c94f6#259
range: float
sub property of: loudness parameters

Low pass frequency
type: DatatypeProperty
comment: The low pass frequency of the AudioChannel filter.
sub property of: Frequency

Main title
type: DatatypeProperty
comment: To provide the main title by which the media resource is known.
sub property of: Title

Matrix coefficients
type: DatatypeProperty
comment: All parameters of AudioBlocks of type matrix.
domain: Matrix
range: Literal

MXF channel ID
type: DatatypeProperty
comment: To identify an MXF channel.
sub property of: Audio MXFlookup

MXF package UID
type: DatatypeProperty
comment: To identify a MXF package.
sub property of: Audio MXFlookup

MXF track ID
type: DatatypeProperty
comment: To identify a MXF track.
sub property of: Audio MXFlookup

Salutation title
type: DatatypeProperty
comment: To provide a salutation title e.g M. Ms, Dr, Pr.
sub property of: Name
equivalent property: title

Noise filter
type: DatatypeProperty
comment: A flag to signal that a noise filter has been used.
domain: Video format
range: boolean

Not rated
type: DatatypeProperty
comment: A flag to indicate that the BusinessObejct has not been rated.
domain: http://lodlaundromat.org/.well-known/genid/9614c311e239f1c4db9e2cf33b4c94f6#211
range: boolean

Number of tracks
type: DatatypeProperty
comment: The number of Tracks composing the MediaResource.
domain: Media Resource
range: integer
equivalent property: numberOfTracks

Object azimuth (in degrees)
type: DatatypeProperty
comment: The azimuth position of an object in degrees.
sub property of: Object coordinates

Object coordinates
type: DatatypeProperty
comment: The coordinates of an AudioBlock of type object.
sub property of: AudioBlock object parameters

Audio object depth
type: DatatypeProperty
comment: To provide the depth of an AudioObject.
domain: Audio block
range: float
sub property of: AudioBlock object parameters

Object distance (normalised to 1)
type: DatatypeProperty
comment: The distance to an object. The distance measure is normalised, as absolute distances from the origin are rarely used, but an absolute reference distance is available in audioPackFormat.
sub property of: Object coordinates

Object elevation (in degrees)
type: DatatypeProperty
comment: The elevation of a object in degrees.
sub property of: Object coordinates

Object gain
type: DatatypeProperty
comment: The gain of an AudioBlock of type objects.
sub property of: AudioBlock object parameters

Audio object height (in degrees)
type: DatatypeProperty
comment: To provide the height of an AudioObject in degrees.
domain: Audio block
range: float
sub property of: AudioBlock object parameters

AudioBlock object parameters
type: DatatypeProperty
comment: To provide the parameters of an AudioBlock of type objects.
domain: Objects
range: Literal

Audio object type definition
type: DatatypeProperty
comment: To provide a definition of an AudioObject type.
domain: Object type
range: string

Audio object width (in degrees)
type: DatatypeProperty
comment: To provide the width of an AudioObject in degrees.
domain: Audio block
range: float
sub property of: AudioBlock object parameters

Area code
type: DatatypeProperty
comment: To provide the Area part of an Address.
sub property of: Office mail address

Country
type: DatatypeProperty
comment: To provide the country name and or country code.
sub property of: Office mail address

Address line
type: DatatypeProperty
comment: To write address line with e.g. the street name and number.
sub property of: Office mail address

Locality
type: DatatypeProperty
comment: To provide the name of a city, village, etc.
sub property of: Office mail address

Postal code
type: DatatypeProperty
comment: To provide an address postal code.
sub property of: Office mail address

Office email
type: DatatypeProperty
comment: To provide the professional/office email address of an agent (Contact/person or organisation).
sub property of: Email

Homepage (office)
type: DatatypeProperty
comment: To provide an office/professional/company web homepage of an Agent (Contact/person or Organisation).
domain: Agent
range: anyURI
sub property of: Homepage
equivalent property: workplaceHomepage

Office mail address
type: DatatypeProperty
comment: To provide the professional / office address of an agent (Contact/person or organisation).
range: string
sub property of: Address

Mobile (office)
type: DatatypeProperty
comment: To provide the professional/office/company mobile telephone number of an agent (Contact/person or organisation).
sub property of: Mobile

Telephone (office)
type: DatatypeProperty
comment: To provide an office/professional/company telephone number of an Agent (Contact/person or Organisation).
range: string
sub property of: Telephone

Order
type: DatatypeProperty
comment: the order of an HOA component.
sub property of: HOA parameters

Orientation
type: DatatypeProperty
comment: The orientation of a Document or an Image i.e. landscape or portrait.
domain: http://lodlaundromat.org/.well-known/genid/9614c311e239f1c4db9e2cf33b4c94f6#247
range: string

Original title
type: DatatypeProperty
comment: To provide the original title attributed to the media resource e.g. in its original language.
sub property of: Title
equivalent property: mainOriginalTitle

Owns
type: ObjectProperty
comment: To identify the service (s) that an Agent (Contact/person or Organisation) owns.
domain: Agent
range: Service
sub property of: Relation
inverse of: Owner

Package size (in bytes)
type: DatatypeProperty
comment: The size of a media package in Bytes.
domain: Resource
range: long

Package name
type: DatatypeProperty
comment: The name attributed to a package.
domain: Resource
range: long

Part definition
type: DatatypeProperty
comment: A definition associated with the Part.
domain: Part, Fragment, Segment
range: string

Part name
type: DatatypeProperty
comment: A name by which the Part is identified.
domain: Part, Fragment, Segment
range: string

Part number
type: DatatypeProperty
comment: The number associated to a Part as one among many.
domain: Part, Fragment, Segment
range: integer

Total number of parts
type: DatatypeProperty
comment: The total number of Parts associated with a BusinessObject.
domain: Part, Fragment, Segment
range: integer

Matrix phase (constant)
type: DatatypeProperty
comment: To provide the constant phase of an AudioChannel in a matrix.
range: float
sub property of: Matrix coefficients

Matrix phase (variable)
type: DatatypeProperty
comment: To provide the variable phase of an AudioChannel in a matrix.
range: float
sub property of: Matrix coefficients

Playlist
type: DatatypeProperty
comment: To describe a playlist.
sub property of: Description

Area code
type: DatatypeProperty
comment: To provide the Area part of an Adrress.
sub property of: Private mail address

Country
type: DatatypeProperty
comment: To provide the country name and or country code.
sub property of: Private mail address

Address line
type: DatatypeProperty
comment: To write address line with e.g. the street name and number.
sub property of: Private mail address

Locality
type: DatatypeProperty
comment: To provide the name of a city, viallge, etc.
sub property of: Private mail address

Postal code
type: DatatypeProperty
comment: To provide an address postal code.
sub property of: Private mail address

Private email
type: DatatypeProperty
comment: To provide the private email address of an agent (Contact/person)
sub property of: Email

Homepage (private)
type: DatatypeProperty
comment: To provide an private web homepage of an Agent (Contact/person).
domain: Agent
range: anyURI
sub property of: Homepage
equivalent property: homepage

Private mail address
type: DatatypeProperty
comment: To provide the private / personal address of an agent (Contact/person).
range: string
sub property of: Address

Mobile (private)
type: DatatypeProperty
comment: To provide the private mobile telephone number of an agent (Contact/person).
sub property of: Mobile

Telephone (private)
type: DatatypeProperty
comment: To provide the private telephone number of an Agent (Contact/person).
range: string
sub property of: Telephone

Promotional information
type: DatatypeProperty
comment: To provide textual promotional information.
sub property of: Description

Publication status
type: DatatypeProperty
comment: To indicate a publication status.
sub property of: Description

Publication channel name
type: DatatypeProperty
comment: To provide a name to a PublicationChannel e.g. a TV channel or website.
domain: Publication Channel
range: string

Publication end date & time
type: DatatypeProperty
comment: The actual end date and time of a PublicationEvent.
domain: Publication Event
range: dateTime

Publication event name
type: DatatypeProperty
comment: To provide a name to a PublicationEvent.
domain: Publication Event
range: string

schedule date
type: DatatypeProperty
comment: To express specifically the schedule date to which a PublicationEvent is related in particular if the broacdast time is after midnight. For example, the schedule date would be May 29th and the programme is published at 1 am on May 30th, while still associated in the schedule with the night of May 29th.
domain: Publication Event
range: date

Publication start date & time
type: DatatypeProperty
comment: The actual start date and time of a PublicationEvent.
domain: Publication Event
range: dateTime

Publication end date & time
type: DatatypeProperty
comment: The end date and time of a PublicationEvent as scheduled.
domain: Publication Event
range: dateTime

Publication start date & time
type: DatatypeProperty
comment: The start date and time of a PublicationEvent as scheduled.
domain: Publication Event
range: dateTime

Published title.
type: DatatypeProperty
comment: The title used to identify the work at publication time.
range: string

Rating scale (top value)
type: DatatypeProperty
comment: The maximum value of the scale used for rating a media resource.
domain: Rating
range: string
equivalent property: ratingScaleMax

Rating scale (min. value)
type: DatatypeProperty
comment: The minimum value of the scale used for rating a Resource.
domain: Rating
range: string
equivalent property: ratingScaleMin

Rating system
type: DatatypeProperty
comment: To identify a rating system by its name.
domain: Rating
range: string
equivalent property: hasRatingSystem

Rating
type: DatatypeProperty
comment: To express a free text rating value defined in a rating classification scheme.
domain: Rating
range: string
equivalent property: ratingValue

Reason
type: DatatypeProperty
comment: To provide a reason for which Rating as been attributed as provided.
domain: Rating
range: string

References
type: ObjectProperty
comment: To express a reference between Assets, BusinessObjects or Resources.
domain: http://lodlaundromat.org/.well-known/genid/9614c311e239f1c4db9e2cf33b4c94f6#9
range: http://lodlaundromat.org/.well-known/genid/9614c311e239f1c4db9e2cf33b4c94f6#5
sub property of: Relation

Region delimiter (x-axis)
type: DatatypeProperty
comment: To define the bottom right corner of a zone on the x-axis. If present with regionDelimY, the zone definition is complemented by the associated values of the height and width.
domain: Resource
range: integer

Region delimiter (y-axis)
type: DatatypeProperty
comment: To define the bottom right corner of a zone on the y-axis. If present with regionDelimX, the zone definition is complemented by the associated values of the height and width.
domain: Resource
range: integer

Related resources
type: DatatypeProperty
comment: To provide a link to a web resource containing information related to an Agent (Contact/person or Organisation).
domain: Agent
range: anyURI

Replaces
type: ObjectProperty
comment: To identify substitution.
domain: http://lodlaundromat.org/.well-known/genid/9614c311e239f1c4db9e2cf33b4c94f6#122
range: http://lodlaundromat.org/.well-known/genid/9614c311e239f1c4db9e2cf33b4c94f6#126
sub property of: Relation

Requires
type: ObjectProperty
comment: To express dependency.
domain: http://lodlaundromat.org/.well-known/genid/9614c311e239f1c4db9e2cf33b4c94f6#165
range: http://lodlaundromat.org/.well-known/genid/9614c311e239f1c4db9e2cf33b4c94f6#161
sub property of: Relation

Resource description
type: DatatypeProperty
comment: This can be specialised by using sub-properties like defined in http://www.ebu.ch/metadata/cs/web/ebu_DescriptionTypeCodeCS_p.xml.htm implemented as examples as e.g. 'summary' or 'script'.
domain: Media Resource
sub property of: Description

Resource description
type: DatatypeProperty
comment: A name by which the resource can be identified.
domain: Resource
range: string

Review
type: DatatypeProperty
comment: To provide a text for a review.
sub property of: Description

Rights expression
type: DatatypeProperty
comment: The expression of Rights as free text.
domain: Rights
range: string

Rights web resource
type: DatatypeProperty
comment: A link to e.g. a webpage where an expression of the rights can be found and consulted.
domain: Rights
range: anyURI

Role definition
type: DatatypeProperty
comment: To provide a definition for a role
domain: Role
range: string

Start timecode
type: DatatypeProperty
comment: To provide the time when an AudioBlock is generated.
domain: Audio block
range: Literal
sub property of: Start time (timecode)

Sample Rate
type: DatatypeProperty
comment: The frequency at which audio is sampled per second. Also called sampling rate.
domain: Audio track UID
range: integer
equivalent property: samplingRate

Sample size
type: DatatypeProperty
comment: The size of an audio sample in bits. Also called bit depth.
domain: Audio Format
range: integer

Sample type
type: DatatypeProperty
comment: The type of audio sample.
domain: Audio Format
range: string

Sampling format
type: DatatypeProperty
comment: To define the scanning format for a MediaResource. For video, the two main values are "interlaced" or "progressive".
domain: Video format
range: string

Script
type: DatatypeProperty
comment: To provide a script.
sub property of: Description

Signing source
type: DatatypeProperty
comment: To identify the source of the signing resource.
domain: Signing
range: string

Speaker azimuth (in degrees)
type: DatatypeProperty
comment: The azimuth position of a speaker in degrees.
sub property of: Speaker coordinates

Speaker azimuth (max in degrees)
type: DatatypeProperty
comment: The maximum bound azimuth position of a speaker in degrees.
sub property of: Speaker coordinates

Speaker azimuth (min in degrees)
type: DatatypeProperty
comment: The minimum bound azimuth position of a speaker in degrees.
sub property of: Speaker coordinates

Speaker coordinates
type: DatatypeProperty
comment: To provide the spatial coordinates of speakers.
domain: Direct speakers
range: Literal
sub property of: Speaker parameters

Speaker distance (normalised to 1)
type: DatatypeProperty
comment: The distance measure is normalised, as absolute speaker distances from the origin are rarely used, but an absolute reference distance is available in audioPackFormat.
sub property of: Speaker coordinates

Speaker distance (max normalised to 1)
type: DatatypeProperty
comment: The maximum distance measure is normalised, as absolute speaker distances from the origin are rarely used, but an absolute reference distance is available in audioPackFormat.
sub property of: Speaker coordinates

Speaker distance (min normalised to 1)
type: DatatypeProperty
comment: The minimum distance measure is normalised, as absolute speaker distances from the origin are rarely used, but an absolute reference distance is available in audioPackFormat.
sub property of: Speaker coordinates

Speaker elevation (in degrees)
type: DatatypeProperty
comment: The elevation of a speaker in degrees.
sub property of: Speaker coordinates

Speaker elevation (max in degrees)
type: DatatypeProperty
comment: The maximum elevation of a speaker in degrees.
sub property of: Speaker coordinates

Speaker elevation (min in degrees)
type: DatatypeProperty
comment: The minimum elevation of a speaker in degrees.
sub property of: Speaker coordinates

Speaker label
type: DatatypeProperty
comment: A label to identify a particular speaker in a complex configuration.
domain: Direct speakers
range: string
sub property of: Speaker parameters

Speaker parameters
type: DatatypeProperty
comment: A set of speaker parameters.

Start time
type: DatatypeProperty
comment: The start point of the MediaResource.
domain: http://lodlaundromat.org/.well-known/genid/9614c311e239f1c4db9e2cf33b4c94f6#250
range: Literal

Start time (time)
type: DatatypeProperty
comment: The start time expressed using a time expression.
range: time
sub property of: Start time

Start time (edit units)
type: DatatypeProperty
comment: A start time expressed as a number of edit units.
range: double
sub property of: Start time

Start time (timecode)
type: DatatypeProperty
comment: A start time expressed as timecode.
range: string
sub property of: Start time

Storage definition
type: DatatypeProperty
comment: To provide a definition for storage.
domain: Storage type
range: string

Subtitle
type: DatatypeProperty
comment: A complementary subtitle.
sub property of: Alternative title

Subtitling source
type: DatatypeProperty
comment: To identify the source of the Subtitling resource.
domain: Subtitling
range: string

Summary
type: DatatypeProperty
comment: To provide a summary.
range: string
sub property of: Description

Synopsis
type: DatatypeProperty
comment: To provide a summary.
range: string
sub property of: Description

Table of Content
type: DatatypeProperty
comment: To provide a Table of Content.
sub property of: Description

Target audience system
type: DatatypeProperty
comment: To define the system used to provide a TargetAudience.
domain: Target audience
range: string

Note
type: DatatypeProperty
comment: The value of an Annotation as free text.
domain: Annotation
range: string

Title
type: DatatypeProperty
comment: All value of the EBU title status classification scheme (http://www.ebu.ch/metadata/cs/web/ebu_TitleStatusCodeCS_p.xml.htm) are candidates subproperties of the title property as implemented for an example with alternativeTitle.
comment: Specifies the title or name given to the resource. The type can be used as a sub-property to optionally refine the category of the title.
sub property of: Title
equivalent property: title

Definition
type: DatatypeProperty
comment: To provide a definition associated to a Track.
domain: Track
range: string

Track name
type: DatatypeProperty
comment: The name attributed to a Track.
domain: Track
range: string
equivalent property: trackName

Translation title
type: DatatypeProperty
comment: A translated version of the title.
sub property of: Alternative title

Version title
type: DatatypeProperty
comment: An alternative title specific to a verison of content.
sub property of: Alternative title

Width
type: DatatypeProperty
comment: The width of e.g. a video frame typically expressed as a number of pixels, or picture/image in millimeters.
domain: Resource
range: integer
equivalent property: frameWidth

Width unit
type: DatatypeProperty
comment: The unit used to measure a width e.g. in pixels or number of lines or millimeters or else.
domain: Resource
range: string

Word count
type: DatatypeProperty
comment: The number of words contained in a document.
domain: Document
range: integer

Working title
type: DatatypeProperty
comment: A title used while content is not complete.
sub property of: Alternative title

Wrapping type
type: DatatypeProperty
comment: To provide additional information on the wrapping type of ancillary data.
domain: Ancillary data
range: string

EBUCore - the Dublin Core for media
licence: http://creativecommons.org/licenses/by-sa/3.0/
Contributor: Christophe Debruyne, RIA @ie
Contributor: Hugo Manguinhas, Europeana @nl
Contributor: Knut-Olav Hoven, NRK @no
Contributor: Robert Engels, NRK @no
Contributor: Tormod Vaervagen, NRK @no
Contributor: Valentine Charles, Europeana @nl
creator: Jean Pierre Evain, EBU @ch
description: The EBUCore has been designed to make users benefit from the flexibility of RDF to adapt the names of Classes and properties to their respective needs. This means users are welcome to add their own subclasses (e.g. to define the most appropriate BusinessObjects or Resources or Agents) and subproperties.
description: The EBUCore ontology now includes the new EBUCore 3D object audio model (ADM).
Issued: 2013-01-01
Modified: 2015-01-26
publisher: European Broadcasting Union (EBU) @ch
Rights: Copyright 2015 EBU
preferred namespace uri: http://www.ebu.ch/metadata/ontologies/ebucore/ebucore#
type: Ontology
imports: core
incompatible with: ebucore 2015 01 22.rdf
prior version: ebucore 2015 01 22.rdf
version info: Change dc namespace from http://purl.org/dc/terms/ to http://purl.org/dc/elements/1.1/ {@en} and correct dc: classes and propertes' namespace accordingly.
version info: Change properties linking to subclasses of skos:Concept from owl:objectProperties to rdf:Properties to support resources or literals.
version info: EBUCore based on Dublin Core + SKOS + some BBC Core Concepts + basic FOAF properties + equivalences to W3C MA-ONT
version info: Version 1.3
term status: stable

Agent
type: Class
comment: A person or Organisation.
subclass of: Agent

Group
type: Class
comment: A group of Agents.
subclass of: Agent

Organization
type: Class
comment: An organisation (business, corporation, federation, etc.) or moral agent (gvernment body).
subclass of: Organisation

age
type: DatatypeProperty
sub property of: Age

Image
type: Class
comment: Animage to represent something.
subclass of: Picture

Group member
type: ObjectProperty
comment: To identify an Agent member of a Group.
domain: Group
range: Agent

Person
type: Class
comment: all types of people such as politicians, athletes, historic figures, contributors in programmes e.t.c.
subclass of: Contact