has habit
range: Thing
domain: Thing
inverse of: has agent
type: Property
type: ObjectProperty
comment: A link between an agent and a cognitive characteristic description
domain: Agent
range: Cognitive Characteristic
term status: unstable
domain: Resource
range: Item
range: Resource
range: http://lodlaundromat.org/.well-known/genid/9512460232c60703edd38bf24683f132#1
range: http://lodlaundromat.org/.well-known/genid/9512460232c60703edd38bf24683f132#6

has skill
range: Thing
domain: Thing
sub property of: has cognitive characteristic
type: Property
type: ObjectProperty
comment: The ability or skill to (be able to) do something, e.g. to walk, to play the piano or to work in a team.
sub property of: has competence
term status: testing
domain: Agent
domain: Resource
range: Resource

has belief
range: Thing
domain: Thing
sub property of: has cognitive characteristic
type: Property
type: ObjectProperty
comment: An uncertain relation for competence representation. That means beliefs, persuasions or opinions, which can also be misconceptions.
sub property of: has competence
term status: testing
domain: Agent
domain: Resource
range: Resource

has attention duration
range: Thing
domain: Thing
type: Property
sub property of: dimension
type: ObjectProperty
comment: An interval of attention for a cognitive pattern.
domain: Cognitive Characteristic
term status: testing
sub property of: time
range: Interval
domain: http://lodlaundromat.org/.well-known/genid/9512460232c60703edd38bf24683f132#1
domain: Resource
domain: http://lodlaundromat.org/.well-known/genid/9512460232c60703edd38bf24683f132#6
domain: Item
range: Resource

Characteristic Dynamics
subclass of: http://lodlaundromat.org/.well-known/genid/9512460232c60703edd38bf24683f132#1
subclass of: http://lodlaundromat.org/.well-known/genid/9512460232c60703edd38bf24683f132#6
subclass of: Resource
subclass of: Thing
type: Class
comment: An event concept for describing dynamics of characteristics, e.g. weight changes, periods of interest.
subclass of: Weight
term status: testing

has agent
range: Thing
domain: Thing
type: Property
type: ObjectProperty
comment: A link from a mined cognitive characteristic to the related person
domain: Cognitive Characteristic
range: Agent
inverse of: has habit
term status: testing
domain: http://lodlaundromat.org/.well-known/genid/9512460232c60703edd38bf24683f132#1
domain: Resource
domain: http://lodlaundromat.org/.well-known/genid/9512460232c60703edd38bf24683f132#6
domain: Item
range: Resource

has overall weight
range: Thing
domain: Thing
type: ObjectProperty
sub property of: dimension
type: FunctionalProperty
type: Property
sub property of: weight
term status: testing
domain: Cognitive Characteristic
comment: This weight reflects the overall interest in a topic and should be different from the actual weight of a cognitive characteristic.
domain: http://lodlaundromat.org/.well-known/genid/9512460232c60703edd38bf24683f132#1
domain: Resource
domain: http://lodlaundromat.org/.well-known/genid/9512460232c60703edd38bf24683f132#6
domain: Item
range: Resource

has expertise
sub property of: has cognitive characteristic
range: Thing
domain: Thing
type: Property
type: ObjectProperty
comment: The knowledge or expertise in a certain domain or specific topic, e.g. football, programming languages or music.
sub property of: has competence
term status: testing
domain: Agent
domain: Resource
range: Resource

has appear time
range: Thing
domain: Thing
type: Property
type: ObjectProperty
comment: The time when the cognitive pattern appears in a certain kind of scenario.
domain: http://lodlaundromat.org/.well-known/genid/9512460232c60703edd38bf24683f132#1
sub property of: time
term status: testing
domain: Resource
range: Resource

has setting
range: Thing
domain: Thing
type: Property
type: ObjectProperty
comment: A certain setting or preference. Often re. a specific environment, e.g. an application.
sub property of: has cognitive characteristic
term status: testing
domain: Agent
domain: Resource
range: Resource

has topic
domain: Thing
type: Property
type: ObjectProperty
comment: A topic of the cognitive characteristic.
domain: Cognitive Characteristic
range: Thing
sub property of: subject
term status: unstable
domain: http://lodlaundromat.org/.well-known/genid/9512460232c60703edd38bf24683f132#1
domain: Resource
domain: http://lodlaundromat.org/.well-known/genid/9512460232c60703edd38bf24683f132#6
domain: Item
range: Resource

has evidence
range: Thing
domain: Thing
type: Property
type: ObjectProperty
comment: A link between a context and evidence supporting the interpretation of habits in a context
domain: http://lodlaundromat.org/.well-known/genid/9512460232c60703edd38bf24683f132#6
sub property of: factor
term status: unstable
domain: Resource
range: Resource

has longest duration
sub property of: dimension
sub property of: time
range: Thing
domain: Thing
type: Property
type: ObjectProperty
comment: The longest continuous interval of attention for a cognitive pattern, e.g. for an interest, if it appears in the following years: 1990, 1991, 1995, 1996, 1997, 1998, 2001, then the longest duration is 4 years.
sub property of: has attention duration
term status: testing
domain: Cognitive Characteristic
domain: Resource
domain: http://lodlaundromat.org/.well-known/genid/9512460232c60703edd38bf24683f132#1
domain: http://lodlaundromat.org/.well-known/genid/9512460232c60703edd38bf24683f132#6
domain: Item
range: Interval
range: Resource

has ultimative duration
range: Thing
domain: Thing
sub property of: time
sub property of: dimension
type: Property
type: ObjectProperty
comment: The overall duration of attention for a cognitive pattern, e.g. for an interest, if it appears in the following years: 1990, 1991, 1995, 1996, 1997, 1998, 2001, then the longest duration is 7 years.
sub property of: has attention duration
term status: testing
domain: Cognitive Characteristic
domain: Resource
domain: http://lodlaundromat.org/.well-known/genid/9512460232c60703edd38bf24683f132#1
domain: http://lodlaundromat.org/.well-known/genid/9512460232c60703edd38bf24683f132#6
domain: Item
range: Interval
range: Resource

has statistical item
range: Thing
domain: Thing
type: Property
type: ObjectProperty
comment: A link from a cognitive characteristic to statistics about itself
domain: Cognitive Characteristic
range: Item
term status: testing
domain: http://lodlaundromat.org/.well-known/genid/9512460232c60703edd38bf24683f132#1
domain: Resource
domain: http://lodlaundromat.org/.well-known/genid/9512460232c60703edd38bf24683f132#6
domain: Item
range: Resource

has interest
range: Thing
domain: Thing
sub property of: topic interest
type: Property
type: ObjectProperty
comment: This property relates a certain area of interest or preference to an agent. That means this agent likes this topic somehow.
sub property of: has cognitive characteristic
equivalent property: topic interest
term status: testing
domain: Resource
domain: Agent
range: Resource

is not interested in
domain: Thing
type: Property
type: ObjectProperty
comment: A link between an agent and a topic of no interest to them
domain: Agent
range: Thing
term status: unstable
domain: Resource
range: Resource

has cognitive characteristic
domain: Thing
type: Property
type: ObjectProperty
comment: This is the super property to describe cognitive characteristics of the user of the cognitive pattern dimension, e.g. interests, skills, or expertise.
domain: Agent
range: Thing
property chain axiom: http://lodlaundromat.org/.well-known/genid/9512460232c60703edd38bf24683f132#4
term status: testing
domain: Resource
range: Resource

has activity
range: Thing
domain: Thing
type: Property
type: ObjectProperty
comment: An activity, which is related to a topic of a cognitive charateristic description, e.g. if the topic is football a related activity can be playing or watching.
domain: Cognitive Characteristic
sub property of: factor
sub property of: activity
term status: testing
domain: http://lodlaundromat.org/.well-known/genid/9512460232c60703edd38bf24683f132#1
domain: Resource
domain: http://lodlaundromat.org/.well-known/genid/9512460232c60703edd38bf24683f132#6
domain: Item
range: Resource

has characteristic dynamics
range: Thing
domain: Thing
type: Property
type: ObjectProperty
comment: To relate a cognitive characteristic to its temporal dynamics.
domain: Cognitive Characteristic
range: Characteristic Dynamics
sub property of: sub event
term status: testing
domain: http://lodlaundromat.org/.well-known/genid/9512460232c60703edd38bf24683f132#1
domain: Resource
domain: http://lodlaundromat.org/.well-known/genid/9512460232c60703edd38bf24683f132#6
domain: Item
range: Weight
range: Resource
range: http://lodlaundromat.org/.well-known/genid/9512460232c60703edd38bf24683f132#6
range: http://lodlaundromat.org/.well-known/genid/9512460232c60703edd38bf24683f132#1

has competence
range: Thing
domain: Thing
type: Property
type: ObjectProperty
comment: The competence to (be able to) do or know something. That means abilities, skills, knowledge, expertise, beliefs etc.
sub property of: has cognitive characteristic
term status: testing
domain: Agent
domain: Resource
range: Resource

Cognitive Characteristic
subclass of: http://lodlaundromat.org/.well-known/genid/9512460232c60703edd38bf24683f132#1
subclass of: http://lodlaundromat.org/.well-known/genid/9512460232c60703edd38bf24683f132#6
subclass of: Resource
subclass of: Thing
type: Class
comment: A cognitive characteristic object, which also can have weightings and characteristic dynamics etc. for describing a cognitive pattern.
subclass of: Item
term status: unstable

Cognitive Characteristics Ontology
type: Ontology
creator: http://tobyinkster.co.uk/#i
imports: scovo
creator: Yan Wang
creator: me
imports: core
imports: terms
description: A vocabulary for describing cognitive pattern within contexts, their temporal dynamics and their origins
imports: http://purl.org/dc/elements/1.1/
imports: vann
imports: time
version info: 0.2
date: 2010-09-26T11:16:52Z
imports: event.owl
imports: ns
creator: Yi Zeng
creator: Danica Damljanovic
creator: danbri
creator: Zhisheng Huang
imports: http://xmlns.com/foaf/0.1/
preferred namespace prefix: cco

Explicit Mining
description: An explicitly mined cognitive pattern
type: Dimension
term status: testing

Implicit Mining
description: An implicitly mined cognitive pattern
type: Dimension
term status: testing

has characteristic
type: Property
type: FunctionalProperty
comment: Relates to the applied cognitive characteristic (property), e.g. competence, belief, expertise, skill, interest or setting.
domain: Cognitive Characteristic
range: Property
term status: testing
domain: Thing
domain: http://lodlaundromat.org/.well-known/genid/9512460232c60703edd38bf24683f132#1
domain: Resource
domain: http://lodlaundromat.org/.well-known/genid/9512460232c60703edd38bf24683f132#6
domain: Item
range: Resource