valid from (0..1)
property disjoint with: gated (0..1)
type: DatatypeProperty
sub property of: datatypeProductOrServiceProperty
property disjoint with: quantity (1..1)
property disjoint with: unit code (0..1)
sub property of: topDataProperty
property disjoint with: bottomDataProperty
property disjoint with: pets allowed (0..1)
comment: Indicates the beginning of a time interval during which a certain feature is valid or available. For example, a sauna or swimming pool may only be available during certain periods.
domain: Accommodation Feature
range: dateTime

Dwelling Type
subclass of: QualitativeValue
subclass of: http://lodlaundromat.org/.well-known/genid/93221992e8d417d22c8f33847b046dc4#4
subclass of: http://lodlaundromat.org/.well-known/genid/93221992e8d417d22c8f33847b046dc4#42
subclass of: http://lodlaundromat.org/.well-known/genid/93221992e8d417d22c8f33847b046dc4#33
subclass of: http://lodlaundromat.org/.well-known/genid/93221992e8d417d22c8f33847b046dc4#51
subclass of: http://lodlaundromat.org/.well-known/genid/93221992e8d417d22c8f33847b046dc4#68
subclass of: Thing
type: Class
subclass of: http://lodlaundromat.org/.well-known/genid/93221992e8d417d22c8f33847b046dc4#13
disjoint with: Nothing
comment: A type of dwelling, e.g. tent, mobile home, etc. for indicating the permitted usage on a campsite. Use DBpedia URIs whenever possible.

Camping Pitch (gr:ProductOrService, gr:Location)
subclass of: Product
subclass of: http://lodlaundromat.org/.well-known/genid/93221992e8d417d22c8f33847b046dc4#42
subclass of: http://lodlaundromat.org/.well-known/genid/93221992e8d417d22c8f33847b046dc4#13
subclass of: http://lodlaundromat.org/.well-known/genid/93221992e8d417d22c8f33847b046dc4#51
type: Class
subclass of: http://lodlaundromat.org/.well-known/genid/93221992e8d417d22c8f33847b046dc4#4
disjoint with: Nothing
subclass of: Accommodation (gr:ProductOrService, gr:Location)
subclass of: http://lodlaundromat.org/.well-known/genid/93221992e8d417d22c8f33847b046dc4#33
subclass of: http://lodlaundromat.org/.well-known/genid/93221992e8d417d22c8f33847b046dc4#68
subclass of: Thing
subclass of: Location
subclass of: ProductOrService
subclass of: Place
subclass of: http://lodlaundromat.org/.well-known/genid/93221992e8d417d22c8f33847b046dc4#60
comment: A camping pitch is an individual place for overnight stay in the outdoors, typically being part of a larger acco:CampSite.

Bed Details
subclass of: http://lodlaundromat.org/.well-known/genid/93221992e8d417d22c8f33847b046dc4#13
subclass of: http://lodlaundromat.org/.well-known/genid/93221992e8d417d22c8f33847b046dc4#68
disjoint with: Nothing
subclass of: http://lodlaundromat.org/.well-known/genid/93221992e8d417d22c8f33847b046dc4#42
subclass of: http://lodlaundromat.org/.well-known/genid/93221992e8d417d22c8f33847b046dc4#4
type: Class
subclass of: Thing
subclass of: http://lodlaundromat.org/.well-known/genid/93221992e8d417d22c8f33847b046dc4#33
subclass of: http://lodlaundromat.org/.well-known/genid/93221992e8d417d22c8f33847b046dc4#51
subclass of: http://lodlaundromat.org/.well-known/genid/93221992e8d417d22c8f33847b046dc4#27
comment: A node holding detailed information about the available bed types, e.g. the quantity of twin beds for a hotel room. For the single case of just one bed of a certain type, you can use acco:bed directly with acco:BedType instances.

Single or twin bed (acco:BedType)
type: http://lodlaundromat.org/.well-known/genid/93221992e8d417d22c8f33847b046dc4#13
type: http://lodlaundromat.org/.well-known/genid/93221992e8d417d22c8f33847b046dc4#68
type: Thing
type: http://lodlaundromat.org/.well-known/genid/93221992e8d417d22c8f33847b046dc4#27
type: http://lodlaundromat.org/.well-known/genid/93221992e8d417d22c8f33847b046dc4#33
type: http://lodlaundromat.org/.well-known/genid/93221992e8d417d22c8f33847b046dc4#51
type: QualitativeValue
type: Bed Type
type: http://lodlaundromat.org/.well-known/genid/93221992e8d417d22c8f33847b046dc4#42
type: http://lodlaundromat.org/.well-known/genid/93221992e8d417d22c8f33847b046dc4#4
comment: A single bed. The actual dimension may vary by country, see http://en.wikipedia.org/wiki/Bed_size.

quantity (1..1)
property disjoint with: valid from (0..1)
type: DatatypeProperty
property disjoint with: unit code (0..1)
sub property of: topDataProperty
property disjoint with: gated (0..1)
property disjoint with: pets allowed (0..1)
property disjoint with: bottomDataProperty
comment: The quantity of the given bed type available in the acco:HotelRoom, acco:Suite, acco:House, or acco:Apartment.
domain: Bed Details
range: integer

included feature (0..*)
sub property of: topObjectProperty
sub property of: feature (0..*)
property disjoint with: bottomObjectProperty
type: ObjectProperty
comment: A feature (e.g. a characteristic or service) of the acco:Accommodation that is included in the offer for the main accommodation, i.e. at no extra costs.
domain: Accommodation (gr:ProductOrService, gr:Location)
range: Accommodation Feature

price component (0..*)
sub property of: topObjectProperty
property disjoint with: bottomObjectProperty
type: ObjectProperty
comment: This property links to all gr:UnitPriceSpecification nodes that apply in parallel for the acco:CompoundPrice node.
domain: Compound Price
range: UnitPriceSpecification

optional feature (0..*)
sub property of: topObjectProperty
sub property of: feature (0..*)
property disjoint with: bottomObjectProperty
type: ObjectProperty
comment: A feature (e.g. a characteristic or service) of the acco:Accommodation that is generally available but not included in the offer for the main accommodation, i.e. at extra costs.
domain: Accommodation (gr:ProductOrService, gr:Location)
range: Accommodation Feature

Meal (gr:ProductOrService)
subclass of: ProductOrService
subclass of: Product
subclass of: http://lodlaundromat.org/.well-known/genid/93221992e8d417d22c8f33847b046dc4#4
subclass of: http://lodlaundromat.org/.well-known/genid/93221992e8d417d22c8f33847b046dc4#13
subclass of: Thing
subclass of: http://lodlaundromat.org/.well-known/genid/93221992e8d417d22c8f33847b046dc4#51
type: Class
subclass of: http://lodlaundromat.org/.well-known/genid/93221992e8d417d22c8f33847b046dc4#33
disjoint with: Nothing
subclass of: http://lodlaundromat.org/.well-known/genid/93221992e8d417d22c8f33847b046dc4#42
subclass of: http://lodlaundromat.org/.well-known/genid/93221992e8d417d22c8f33847b046dc4#68
comment: A meal in the sense of this vocabulary is some combination of food or beverages.

permitted usage (0..*)
sub property of: qualitativeProductOrServiceProperty
sub property of: topObjectProperty
property disjoint with: bottomObjectProperty
type: ObjectProperty
comment: The type of objects that you are allowed to put on the camping pitch, e.g. a tent, car, boat, or mobile homre. Use DBpedia URIs whenever possible.
domain: http://lodlaundromat.org/.well-known/genid/93221992e8d417d22c8f33847b046dc4#60
range: Dwelling Type

King or Super King bed (acco:BedType)
type: QualitativeValue
type: http://lodlaundromat.org/.well-known/genid/93221992e8d417d22c8f33847b046dc4#13
type: http://lodlaundromat.org/.well-known/genid/93221992e8d417d22c8f33847b046dc4#68
type: http://lodlaundromat.org/.well-known/genid/93221992e8d417d22c8f33847b046dc4#27
type: Thing
type: http://lodlaundromat.org/.well-known/genid/93221992e8d417d22c8f33847b046dc4#4
type: http://lodlaundromat.org/.well-known/genid/93221992e8d417d22c8f33847b046dc4#42
type: http://lodlaundromat.org/.well-known/genid/93221992e8d417d22c8f33847b046dc4#33
type: Bed Type
type: http://lodlaundromat.org/.well-known/genid/93221992e8d417d22c8f33847b046dc4#51
comment: An King or Super King bed. The actual dimension may vary by country, see http://en.wikipedia.org/wiki/Bed_size.

size (0..1)
sub property of: topObjectProperty
sub property of: quantitativeProductOrServiceProperty
property disjoint with: bottomObjectProperty
type: ObjectProperty
comment: The size of the accommodation, e.g. in square meter or squarefoot. Typical unit code(s): MTK for square meter, FTK for square foot, or YDK for square yard
domain: Accommodation (gr:ProductOrService, gr:Location)
range: QuantitativeValue

Accommodation (gr:ProductOrService, gr:Location)
disjoint with: Nothing
subclass of: Place
subclass of: http://lodlaundromat.org/.well-known/genid/93221992e8d417d22c8f33847b046dc4#13
subclass of: http://lodlaundromat.org/.well-known/genid/93221992e8d417d22c8f33847b046dc4#4
subclass of: Location
subclass of: Thing
subclass of: http://lodlaundromat.org/.well-known/genid/93221992e8d417d22c8f33847b046dc4#42
type: Class
subclass of: ProductOrService
subclass of: Product
subclass of: http://lodlaundromat.org/.well-known/genid/93221992e8d417d22c8f33847b046dc4#33
subclass of: http://lodlaundromat.org/.well-known/genid/93221992e8d417d22c8f33847b046dc4#68
subclass of: http://lodlaundromat.org/.well-known/genid/93221992e8d417d22c8f33847b046dc4#51
comment: An accommodation is a place that can accommodate human beings, e.g. a hotel room, a camping pitch, or a meeting room. Many accommodations are for overnight stays, but this is not a mandatory requirement. Note: For more specific types of accommodations not defined in this ontology, you can easily use any Wikipedia entry from http://en.wikipedia.org/wiki/List_of_human_habitation_forms and replace the base URI http://en.wikipedia.org/wiki/ by http://www.productontology.org/id/ For instance, if you want want to describe an igloo (http://en.wikipedia.org/wiki/Igloo) for rent, you can use the local part 'Igloo' as a class identifier as follows: http://www.productontology.org/id/Igloo

All-inclusive (gr:ProductOrService)
subclass of: http://lodlaundromat.org/.well-known/genid/93221992e8d417d22c8f33847b046dc4#51
subclass of: Thing
disjoint with: Nothing
subclass of: http://lodlaundromat.org/.well-known/genid/93221992e8d417d22c8f33847b046dc4#13
subclass of: http://lodlaundromat.org/.well-known/genid/93221992e8d417d22c8f33847b046dc4#42
subclass of: Product
subclass of: http://lodlaundromat.org/.well-known/genid/93221992e8d417d22c8f33847b046dc4#4
subclass of: ProductOrService
subclass of: http://lodlaundromat.org/.well-known/genid/93221992e8d417d22c8f33847b046dc4#33
subclass of: http://lodlaundromat.org/.well-known/genid/93221992e8d417d22c8f33847b046dc4#68
type: Class
comment: All-inclusive in the sense of this vocabulary is a comprehesive set of foods and beverages, and sometimes complementing services, provided throughout the entire day.

reference quantity (0..*)
sub property of: topObjectProperty
property disjoint with: bottomObjectProperty
type: ObjectProperty
comment: The reference quantity for which a certain price applies, e.g. 1 EUR per 4 kWh of electricity. This property is a replacement for gr:hasUnitOfMeasurement for the advanced cases where the price does not relate to a standard unit.
domain: UnitPriceSpecification
range: QuantitativeValue

value (0..1)
sub property of: topDataProperty
sub property of: datatypeProductOrServiceProperty
property disjoint with: bottomDataProperty
type: DatatypeProperty
comment: The point value for the feature unless it is an interval. If possible, use numerical datatypes, e.g. xsd:decimal, xsd:int, or xsd:float. Textual content is also acceptable, though.
domain: Accommodation Feature
range: Literal

type of bed (1..1)
sub property of: topObjectProperty
property disjoint with: bottomObjectProperty
type: ObjectProperty
comment: The type of bed to which the acco:BedDetail node refers, i.e. the type of bed available in the quantity indicated by acco:quantity.
domain: Bed Details
range: Bed Type

Queen King or Wide Double bed (acco:BedType)
type: http://lodlaundromat.org/.well-known/genid/93221992e8d417d22c8f33847b046dc4#27
type: Thing
type: http://lodlaundromat.org/.well-known/genid/93221992e8d417d22c8f33847b046dc4#33
type: QualitativeValue
type: Bed Type
type: http://lodlaundromat.org/.well-known/genid/93221992e8d417d22c8f33847b046dc4#51
type: http://lodlaundromat.org/.well-known/genid/93221992e8d417d22c8f33847b046dc4#68
type: http://lodlaundromat.org/.well-known/genid/93221992e8d417d22c8f33847b046dc4#42
type: http://lodlaundromat.org/.well-known/genid/93221992e8d417d22c8f33847b046dc4#13
type: http://lodlaundromat.org/.well-known/genid/93221992e8d417d22c8f33847b046dc4#4
comment: A Queen King (UK/Ire.) or Wide Double (Japan) bed. The actual dimension may vary by country, see http://en.wikipedia.org/wiki/Bed_size.

Breakfast (gr:ProductOrService)
subclass of: Meal (gr:ProductOrService)
subclass of: http://lodlaundromat.org/.well-known/genid/93221992e8d417d22c8f33847b046dc4#68
subclass of: http://lodlaundromat.org/.well-known/genid/93221992e8d417d22c8f33847b046dc4#42
subclass of: http://lodlaundromat.org/.well-known/genid/93221992e8d417d22c8f33847b046dc4#4
disjoint with: Nothing
subclass of: http://lodlaundromat.org/.well-known/genid/93221992e8d417d22c8f33847b046dc4#51
subclass of: http://lodlaundromat.org/.well-known/genid/93221992e8d417d22c8f33847b046dc4#13
subclass of: Thing
type: Class
subclass of: ProductOrService
subclass of: http://lodlaundromat.org/.well-known/genid/93221992e8d417d22c8f33847b046dc4#33
subclass of: Product
comment: A breakfast is the first meal taken after rising from a night's sleep, most often eaten in the early morning before undertaking the day's work. (Source: Wikipedia, the free encyclopedia, see http://en.wikipedia.org/wiki/Breakfast)

occupancy adults (0..1)
sub property of: topObjectProperty
sub property of: quantitativeProductOrServiceProperty
property disjoint with: bottomObjectProperty
type: ObjectProperty
comment: The allowed total occupancy of adults (in the sense of fully paying guests) for the accommodation in persons. The exact definition of what constitutes an adult varies across regions and will typically not match the legal definition of being an adult. Typical unit code(s): C62 for person
domain: Accommodation (gr:ProductOrService, gr:Location)
range: QuantitativeValue

occupancy (0..1)
sub property of: topObjectProperty
sub property of: quantitativeProductOrServiceProperty
property disjoint with: bottomObjectProperty
type: ObjectProperty
comment: The allowed total occupancy for the accommodation in persons (including infants etc. Typical unit code(s): C62 for person
domain: Accommodation (gr:ProductOrService, gr:Location)
range: QuantitativeValue

partOf (0..*)
sub property of: topObjectProperty
property disjoint with: bottomObjectProperty
type: ObjectProperty
comment: A naive parthood relation between two acco:Accommodation instances. Examples: A certain hotel room is part of a certain hotel, a certain house is part of a holiday resort, etc.
domain: Accommodation (gr:ProductOrService, gr:Location)
range: Accommodation (gr:ProductOrService, gr:Location)

number of rooms (0..1)
sub property of: topObjectProperty
sub property of: quantitativeProductOrServiceProperty
property disjoint with: bottomObjectProperty
type: ObjectProperty
comment: The number of rooms (excluding bathrooms and closets of the acco:Suite, acco:House, or acco:Apartment. Typical unit code(s): C62 for person
domain: http://lodlaundromat.org/.well-known/genid/93221992e8d417d22c8f33847b046dc4#63
range: QuantitativeValue

House (gr:ProductOrService, gr:Location)
disjoint with: Nothing
subclass of: Place
subclass of: http://lodlaundromat.org/.well-known/genid/93221992e8d417d22c8f33847b046dc4#68
subclass of: Product
subclass of: http://lodlaundromat.org/.well-known/genid/93221992e8d417d22c8f33847b046dc4#22
subclass of: ProductOrService
subclass of: http://lodlaundromat.org/.well-known/genid/93221992e8d417d22c8f33847b046dc4#42
type: Class
subclass of: Location
subclass of: http://lodlaundromat.org/.well-known/genid/93221992e8d417d22c8f33847b046dc4#63
subclass of: Accommodation (gr:ProductOrService, gr:Location)
subclass of: Thing
subclass of: http://lodlaundromat.org/.well-known/genid/93221992e8d417d22c8f33847b046dc4#33
subclass of: http://lodlaundromat.org/.well-known/genid/93221992e8d417d22c8f33847b046dc4#13
subclass of: http://lodlaundromat.org/.well-known/genid/93221992e8d417d22c8f33847b046dc4#4
subclass of: http://lodlaundromat.org/.well-known/genid/93221992e8d417d22c8f33847b046dc4#51
comment: A house is a building or structure that has the ability to be occupied for habitation by humans or other creatures. (Source: Wikipedia, the free encyclopedia, see http://en.wikipedia.org/wiki/House)

gated (0..1)
property disjoint with: unit code (0..1)
property disjoint with: valid from (0..1)
property disjoint with: quantity (1..1)
sub property of: datatypeProductOrServiceProperty
property disjoint with: bottomDataProperty
sub property of: topDataProperty
type: DatatypeProperty
comment: Indicates whether the accommodation is gated, i.e. access is controlled via a fence and some form of gate.
domain: http://lodlaundromat.org/.well-known/genid/93221992e8d417d22c8f33847b046dc4#30
range: boolean

Apartment (gr:ProductOrService, gr:Location)
subclass of: http://lodlaundromat.org/.well-known/genid/93221992e8d417d22c8f33847b046dc4#13
subclass of: Location
subclass of: Accommodation (gr:ProductOrService, gr:Location)
subclass of: Thing
subclass of: http://lodlaundromat.org/.well-known/genid/93221992e8d417d22c8f33847b046dc4#42
disjoint with: Nothing
subclass of: ProductOrService
subclass of: Product
subclass of: http://lodlaundromat.org/.well-known/genid/93221992e8d417d22c8f33847b046dc4#4
subclass of: http://lodlaundromat.org/.well-known/genid/93221992e8d417d22c8f33847b046dc4#33
subclass of: Place
subclass of: http://lodlaundromat.org/.well-known/genid/93221992e8d417d22c8f33847b046dc4#63
subclass of: http://lodlaundromat.org/.well-known/genid/93221992e8d417d22c8f33847b046dc4#22
type: Class
subclass of: http://lodlaundromat.org/.well-known/genid/93221992e8d417d22c8f33847b046dc4#51
subclass of: http://lodlaundromat.org/.well-known/genid/93221992e8d417d22c8f33847b046dc4#68
comment: An apartment (in American English) or flat (in British English) is a self-contained housing unit (a type of residential real estate) that occupies only part of a building. (Source: Wikipedia, the free encyclopedia, see http://en.wikipedia.org/wiki/Apartment)

Camping Site (gr:ProductOrService, gr:Location)
subclass of: Product
subclass of: http://lodlaundromat.org/.well-known/genid/93221992e8d417d22c8f33847b046dc4#68
subclass of: http://lodlaundromat.org/.well-known/genid/93221992e8d417d22c8f33847b046dc4#33
subclass of: Place
subclass of: Thing
subclass of: ProductOrService
subclass of: http://lodlaundromat.org/.well-known/genid/93221992e8d417d22c8f33847b046dc4#4
subclass of: Accommodation (gr:ProductOrService, gr:Location)
type: Class
subclass of: http://lodlaundromat.org/.well-known/genid/93221992e8d417d22c8f33847b046dc4#30
subclass of: http://lodlaundromat.org/.well-known/genid/93221992e8d417d22c8f33847b046dc4#60
subclass of: http://lodlaundromat.org/.well-known/genid/93221992e8d417d22c8f33847b046dc4#42
subclass of: http://lodlaundromat.org/.well-known/genid/93221992e8d417d22c8f33847b046dc4#13
disjoint with: Nothing
subclass of: Location
subclass of: http://lodlaundromat.org/.well-known/genid/93221992e8d417d22c8f33847b046dc4#51
comment: A camping site, campsite, or campground is a place used for overnight stay in the outdoors. In British English a campsite is an area, usually divided into a number of pitches, where people can camp overnight using tents or camper vans or caravans; this British English use of the word is synonymous with the American English expression campground. In American English the term campsite generally means an area where an individual, family, group, or military unit can pitch a tent or parks a camper; a campground may contain many campsites. (Source: Wikipedia, the free encyclopedia, see http://en.wikipedia.org/wiki/Campsite)

unit code (0..1)
property disjoint with: valid from (0..1)
sub property of: topDataProperty
property disjoint with: pets allowed (0..1)
property disjoint with: quantity (1..1)
sub property of: datatypeProductOrServiceProperty
type: DatatypeProperty
property disjoint with: gated (0..1)
property disjoint with: bottomDataProperty
comment: The UN/CEFACT Common Code for the unit of measurement, e.g. "MTR" for meter, "HUR" for hours, etc. If you only have a textual representation of the unit of measurement, use acco:unit instead.
domain: Accommodation Feature
range: string

Dinner (gr:ProductOrService)
subclass of: http://lodlaundromat.org/.well-known/genid/93221992e8d417d22c8f33847b046dc4#51
subclass of: Thing
subclass of: http://lodlaundromat.org/.well-known/genid/93221992e8d417d22c8f33847b046dc4#42
subclass of: Product
subclass of: ProductOrService
subclass of: http://lodlaundromat.org/.well-known/genid/93221992e8d417d22c8f33847b046dc4#68
subclass of: Meal (gr:ProductOrService)
subclass of: http://lodlaundromat.org/.well-known/genid/93221992e8d417d22c8f33847b046dc4#4
subclass of: http://lodlaundromat.org/.well-known/genid/93221992e8d417d22c8f33847b046dc4#13
subclass of: http://lodlaundromat.org/.well-known/genid/93221992e8d417d22c8f33847b046dc4#33
type: Class
disjoint with: Nothing
comment: A dinner is the main meal of the day, often consumed in the evening of the day.

Double or full bed (acco:BedType)
type: http://lodlaundromat.org/.well-known/genid/93221992e8d417d22c8f33847b046dc4#27
type: QualitativeValue
type: http://lodlaundromat.org/.well-known/genid/93221992e8d417d22c8f33847b046dc4#4
type: Thing
type: http://lodlaundromat.org/.well-known/genid/93221992e8d417d22c8f33847b046dc4#42
type: Bed Type
type: http://lodlaundromat.org/.well-known/genid/93221992e8d417d22c8f33847b046dc4#51
type: http://lodlaundromat.org/.well-known/genid/93221992e8d417d22c8f33847b046dc4#33
type: http://lodlaundromat.org/.well-known/genid/93221992e8d417d22c8f33847b046dc4#68
type: http://lodlaundromat.org/.well-known/genid/93221992e8d417d22c8f33847b046dc4#13
comment: A double bed. The actual dimension may vary by country, see http://en.wikipedia.org/wiki/Bed_size.

Hotel (gr:ProductOrService, gr:Location)
subclass of: Product
subclass of: http://lodlaundromat.org/.well-known/genid/93221992e8d417d22c8f33847b046dc4#13
subclass of: http://lodlaundromat.org/.well-known/genid/93221992e8d417d22c8f33847b046dc4#4
subclass of: http://lodlaundromat.org/.well-known/genid/93221992e8d417d22c8f33847b046dc4#51
subclass of: http://lodlaundromat.org/.well-known/genid/93221992e8d417d22c8f33847b046dc4#68
subclass of: Accommodation (gr:ProductOrService, gr:Location)
subclass of: http://lodlaundromat.org/.well-known/genid/93221992e8d417d22c8f33847b046dc4#33
subclass of: ProductOrService
subclass of: Thing
subclass of: http://lodlaundromat.org/.well-known/genid/93221992e8d417d22c8f33847b046dc4#42
disjoint with: Nothing
subclass of: Place
type: Class
subclass of: Location
comment: A hotel is an establishment that provides lodging paid on a short-term basis. (Source: Wikipedia, the free encyclopedia, see http://en.wikipedia.org/wiki/Hotel)

valid from (0..1)
property disjoint with: pets allowed (0..1)
type: DatatypeProperty
property disjoint with: gated (0..1)
sub property of: datatypeProductOrServiceProperty
property disjoint with: quantity (1..1)
property disjoint with: unit code (0..1)
sub property of: topDataProperty
property disjoint with: bottomDataProperty
comment: Indicates the beginning of a time interval during which a certain feature is valid or available. For example, a sauna or swimming pool may only be available during certain periods.
domain: Accommodation Feature
range: dateTime

Bed Type
subclass of: Thing
subclass of: http://lodlaundromat.org/.well-known/genid/93221992e8d417d22c8f33847b046dc4#68
subclass of: http://lodlaundromat.org/.well-known/genid/93221992e8d417d22c8f33847b046dc4#51
disjoint with: Nothing
subclass of: http://lodlaundromat.org/.well-known/genid/93221992e8d417d22c8f33847b046dc4#27
subclass of: http://lodlaundromat.org/.well-known/genid/93221992e8d417d22c8f33847b046dc4#42
subclass of: QualitativeValue
type: Class
subclass of: http://lodlaundromat.org/.well-known/genid/93221992e8d417d22c8f33847b046dc4#33
subclass of: http://lodlaundromat.org/.well-known/genid/93221992e8d417d22c8f33847b046dc4#13
subclass of: http://lodlaundromat.org/.well-known/genid/93221992e8d417d22c8f33847b046dc4#4
comment: A type of bed. This is used for indicating the bed or beds available in an accommodation. Use DBpedia URIs whenever possible.

Olympic Queen bed (acco:BedType)
type: http://lodlaundromat.org/.well-known/genid/93221992e8d417d22c8f33847b046dc4#33
type: http://lodlaundromat.org/.well-known/genid/93221992e8d417d22c8f33847b046dc4#13
type: http://lodlaundromat.org/.well-known/genid/93221992e8d417d22c8f33847b046dc4#42
type: http://lodlaundromat.org/.well-known/genid/93221992e8d417d22c8f33847b046dc4#4
type: Bed Type
type: Thing
type: http://lodlaundromat.org/.well-known/genid/93221992e8d417d22c8f33847b046dc4#27
type: QualitativeValue
type: http://lodlaundromat.org/.well-known/genid/93221992e8d417d22c8f33847b046dc4#51
type: http://lodlaundromat.org/.well-known/genid/93221992e8d417d22c8f33847b046dc4#68
comment: An Olympic Queen bed. The actual dimension may vary by country, see http://en.wikipedia.org/wiki/Bed_size.

Meeting Room (gr:ProductOrService, gr:Location)
subclass of: Accommodation (gr:ProductOrService, gr:Location)
subclass of: http://lodlaundromat.org/.well-known/genid/93221992e8d417d22c8f33847b046dc4#13
subclass of: Product
subclass of: Place
subclass of: Location
subclass of: http://lodlaundromat.org/.well-known/genid/93221992e8d417d22c8f33847b046dc4#51
subclass of: http://lodlaundromat.org/.well-known/genid/93221992e8d417d22c8f33847b046dc4#4
subclass of: http://lodlaundromat.org/.well-known/genid/93221992e8d417d22c8f33847b046dc4#33
subclass of: http://lodlaundromat.org/.well-known/genid/93221992e8d417d22c8f33847b046dc4#68
subclass of: Thing
subclass of: http://lodlaundromat.org/.well-known/genid/93221992e8d417d22c8f33847b046dc4#42
type: Class
disjoint with: Nothing
subclass of: ProductOrService
comment: A meeting room, conference room, or conference hall is a room provided for singular events such as business conferences and meetings. (Source: Wikipedia, the free encyclopedia, see http://en.wikipedia.org/wiki/Conference_hall)

max (0..1)
sub property of: topDataProperty
sub property of: datatypeProductOrServiceProperty
property disjoint with: bottomDataProperty
type: DatatypeProperty
comment: The upper bound of the value for the feature. It is best to use this property with numerical datatypes, e.g. xsd:decimal, xsd:int, or xsd:float.
domain: Accommodation Feature
range: Literal

Compound Price
subclass of: Thing
subclass of: PriceSpecification
subclass of: http://lodlaundromat.org/.well-known/genid/93221992e8d417d22c8f33847b046dc4#33
type: Class
disjoint with: Nothing
subclass of: http://lodlaundromat.org/.well-known/genid/93221992e8d417d22c8f33847b046dc4#13
subclass of: http://lodlaundromat.org/.well-known/genid/93221992e8d417d22c8f33847b046dc4#42
subclass of: http://lodlaundromat.org/.well-known/genid/93221992e8d417d22c8f33847b046dc4#51
subclass of: http://lodlaundromat.org/.well-known/genid/93221992e8d417d22c8f33847b046dc4#68
subclass of: http://lodlaundromat.org/.well-known/genid/93221992e8d417d22c8f33847b046dc4#4
comment: A compound price specification is one that bundles multiple prices that all apply in combination for different dimensions of consumption. Use gr:name for indicating the dimension (e.g. "electricity" or "final cleaning").

California King or King Long bed (acco:BedType)
type: QualitativeValue
type: http://lodlaundromat.org/.well-known/genid/93221992e8d417d22c8f33847b046dc4#33
type: http://lodlaundromat.org/.well-known/genid/93221992e8d417d22c8f33847b046dc4#4
type: http://lodlaundromat.org/.well-known/genid/93221992e8d417d22c8f33847b046dc4#42
type: http://lodlaundromat.org/.well-known/genid/93221992e8d417d22c8f33847b046dc4#68
type: Thing
type: http://lodlaundromat.org/.well-known/genid/93221992e8d417d22c8f33847b046dc4#13
type: http://lodlaundromat.org/.well-known/genid/93221992e8d417d22c8f33847b046dc4#27
type: http://lodlaundromat.org/.well-known/genid/93221992e8d417d22c8f33847b046dc4#51
type: Bed Type
comment: A California King or King Long bed. The actual dimension may vary by country, see http://en.wikipedia.org/wiki/Bed_size.

Hotel Room (gr:ProductOrService, gr:Location)
subclass of: http://lodlaundromat.org/.well-known/genid/93221992e8d417d22c8f33847b046dc4#33
subclass of: Product
disjoint with: Nothing
subclass of: ProductOrService
subclass of: http://lodlaundromat.org/.well-known/genid/93221992e8d417d22c8f33847b046dc4#13
subclass of: http://lodlaundromat.org/.well-known/genid/93221992e8d417d22c8f33847b046dc4#4
subclass of: Accommodation (gr:ProductOrService, gr:Location)
subclass of: Location
subclass of: http://lodlaundromat.org/.well-known/genid/93221992e8d417d22c8f33847b046dc4#63
subclass of: Thing
subclass of: http://lodlaundromat.org/.well-known/genid/93221992e8d417d22c8f33847b046dc4#42
subclass of: Place
subclass of: http://lodlaundromat.org/.well-known/genid/93221992e8d417d22c8f33847b046dc4#22
type: Class
subclass of: http://lodlaundromat.org/.well-known/genid/93221992e8d417d22c8f33847b046dc4#68
subclass of: http://lodlaundromat.org/.well-known/genid/93221992e8d417d22c8f33847b046dc4#51
comment: A hotel room is a single room in a hotel.

occupancy minors (0..1)
sub property of: topObjectProperty
sub property of: quantitativeProductOrServiceProperty
property disjoint with: bottomObjectProperty
type: ObjectProperty
comment: The allowed total occupancy of minors (in the sense of not fully paying guests) for the accommodation in persons. The exact definition of what constitutes a minor varies across regions and will typically not match the legal definition of being a minor. Typical unit code(s): C62 for person
domain: Accommodation (gr:ProductOrService, gr:Location)
range: QuantitativeValue

property ID (0..1)
sub property of: topDataProperty
sub property of: datatypeProductOrServiceProperty
property disjoint with: bottomDataProperty
type: DatatypeProperty
comment: A global identifier, e.g. a URI, a prefixed string, or any other identifier that can be used to refer to a standardized property type. The following prefixes and values are reserved: starRating:HOTREC starRating:DEHOGA starRating:WHR starRating:Hotelstars
domain: Accommodation Feature
range: Literal

Resort (gr:ProductOrService, gr:Location)
subclass of: Product
subclass of: http://lodlaundromat.org/.well-known/genid/93221992e8d417d22c8f33847b046dc4#68
disjoint with: Nothing
subclass of: http://lodlaundromat.org/.well-known/genid/93221992e8d417d22c8f33847b046dc4#33
subclass of: ProductOrService
subclass of: Thing
subclass of: http://lodlaundromat.org/.well-known/genid/93221992e8d417d22c8f33847b046dc4#13
type: Class
subclass of: Accommodation (gr:ProductOrService, gr:Location)
subclass of: http://lodlaundromat.org/.well-known/genid/93221992e8d417d22c8f33847b046dc4#30
subclass of: Place
subclass of: http://lodlaundromat.org/.well-known/genid/93221992e8d417d22c8f33847b046dc4#4
subclass of: http://lodlaundromat.org/.well-known/genid/93221992e8d417d22c8f33847b046dc4#42
subclass of: http://lodlaundromat.org/.well-known/genid/93221992e8d417d22c8f33847b046dc4#51
subclass of: Location
comment: A resort is a place used for relaxation or recreation, attracting visitors for holidays or vacations. Resorts are places, towns or sometimes commercial establishment operated by a single company. (Source: Wikipedia, the free encyclopedia, see http://en.wikipedia.org/wiki/Resort)

bed (0..*)
sub property of: qualitativeProductOrServiceProperty
sub property of: topObjectProperty
property disjoint with: bottomObjectProperty
type: ObjectProperty
comment: The type of bed or beds included in the accommodation. For the single case of just one bed of a certain type, you use acco:bed directly with acco:BedType instances. If you want to indicate the quantity of a certain acco:BedType, use an instance of acco:BedDetails. For more detailed information, use acco:feature.
domain: http://lodlaundromat.org/.well-known/genid/93221992e8d417d22c8f33847b046dc4#22
range: http://lodlaundromat.org/.well-known/genid/93221992e8d417d22c8f33847b046dc4#27

Lunch (gr:ProductOrService)
subclass of: http://lodlaundromat.org/.well-known/genid/93221992e8d417d22c8f33847b046dc4#42
subclass of: http://lodlaundromat.org/.well-known/genid/93221992e8d417d22c8f33847b046dc4#68
subclass of: http://lodlaundromat.org/.well-known/genid/93221992e8d417d22c8f33847b046dc4#51
type: Class
subclass of: http://lodlaundromat.org/.well-known/genid/93221992e8d417d22c8f33847b046dc4#13
disjoint with: Nothing
subclass of: http://lodlaundromat.org/.well-known/genid/93221992e8d417d22c8f33847b046dc4#33
subclass of: Thing
subclass of: http://lodlaundromat.org/.well-known/genid/93221992e8d417d22c8f33847b046dc4#4
subclass of: ProductOrService
subclass of: Meal (gr:ProductOrService)
subclass of: Product
comment: A luncheon, commonly abbreviated to lunch, is a middle of the day meal. (Source: Wikipedia, the free encyclopedia, see http://en.wikipedia.org/wiki/Lunch)

feature (0..*)
sub property of: topObjectProperty
property disjoint with: bottomObjectProperty
type: ObjectProperty
comment: A feature (e.g. a characteristic or service) of the acco:Accommodation. This generic property does not make a statement about whether the feature is included in the offer for the main accommodation or available at extra costs.
domain: Accommodation (gr:ProductOrService, gr:Location)
range: Accommodation Feature

pets allowed (0..1)
property disjoint with: valid from (0..1)
property disjoint with: unit code (0..1)
type: DatatypeProperty
sub property of: datatypeProductOrServiceProperty
property disjoint with: quantity (1..1)
sub property of: topDataProperty
property disjoint with: bottomDataProperty
comment: Indicates whether pets are allowed to enter the accommodation.
domain: Accommodation (gr:ProductOrService, gr:Location)
range: boolean

min (0..1)
sub property of: topDataProperty
sub property of: datatypeProductOrServiceProperty
property disjoint with: bottomDataProperty
type: DatatypeProperty
comment: The lower bound of the value for the feature. It is best to use this property with numerical datatypes, e.g. xsd:decimal, xsd:int, or xsd:float.
domain: Accommodation Feature
range: Literal

unit (0..1)
sub property of: topDataProperty
sub property of: datatypeProductOrServiceProperty
property disjoint with: bottomDataProperty
type: DatatypeProperty
comment: A textual representation of the unit of measurement, e.g. global identifier, e.g. "m" or "meter". When you have the UN/CEFACT Common Code for the unit available, it is better to use acco:unitCode. This property is for the cases where a standardized unit code is not available from the data source.
domain: http://lodlaundromat.org/.well-known/genid/93221992e8d417d22c8f33847b046dc4#1
range: Literal

Accommodation Feature
subclass of: http://lodlaundromat.org/.well-known/genid/93221992e8d417d22c8f33847b046dc4#13
subclass of: http://lodlaundromat.org/.well-known/genid/93221992e8d417d22c8f33847b046dc4#42
disjoint with: Nothing
subclass of: http://lodlaundromat.org/.well-known/genid/93221992e8d417d22c8f33847b046dc4#68
subclass of: http://lodlaundromat.org/.well-known/genid/93221992e8d417d22c8f33847b046dc4#33
subclass of: http://lodlaundromat.org/.well-known/genid/93221992e8d417d22c8f33847b046dc4#51
subclass of: http://lodlaundromat.org/.well-known/genid/93221992e8d417d22c8f33847b046dc4#1
type: Class
subclass of: Thing
subclass of: http://lodlaundromat.org/.well-known/genid/93221992e8d417d22c8f33847b046dc4#4
comment: An accommodation feature is a structured value representing the feature of an accommodation as a property-value pair of varying degrees of formality.

Suite (gr:ProductOrService, gr:Location)
disjoint with: Nothing
subclass of: Accommodation (gr:ProductOrService, gr:Location)
subclass of: http://lodlaundromat.org/.well-known/genid/93221992e8d417d22c8f33847b046dc4#68
subclass of: http://lodlaundromat.org/.well-known/genid/93221992e8d417d22c8f33847b046dc4#51
subclass of: http://lodlaundromat.org/.well-known/genid/93221992e8d417d22c8f33847b046dc4#4
subclass of: ProductOrService
subclass of: Place
subclass of: http://lodlaundromat.org/.well-known/genid/93221992e8d417d22c8f33847b046dc4#42
subclass of: http://lodlaundromat.org/.well-known/genid/93221992e8d417d22c8f33847b046dc4#22
subclass of: http://lodlaundromat.org/.well-known/genid/93221992e8d417d22c8f33847b046dc4#33
type: Class
subclass of: Product
subclass of: Thing
subclass of: Location
subclass of: http://lodlaundromat.org/.well-known/genid/93221992e8d417d22c8f33847b046dc4#63
subclass of: http://lodlaundromat.org/.well-known/genid/93221992e8d417d22c8f33847b046dc4#13
comment: A suite in a hotel or other public accommodation, denotes a class of luxury accommodations, the key feature of which is multiple rooms. (Source: Wikipedia, the free encyclopedia, see http://en.wikipedia.org/wiki/Suite_(hotel))

availability times (0..1)
sub property of: topObjectProperty
property disjoint with: bottomObjectProperty
type: ObjectProperty
comment: Indicates the times of availability of a particular accommodation feature. Example: The sauna is available from 8:00 - 10:00 a.m. on weekdays.
domain: Accommodation Feature
range: OpeningHoursSpecification

Accommodation Ontology
type: Ontology
version info: V 1.0, Release 2013-03-25
license: http://creativecommons.org/licenses/by/3.0/
imports: v1
contributor: Michael Fried, Birgit Leiter, and Dieter Fensel. Some class and property definitions are inspired by or based on abstracts from Wikipedia, the free encyclopedia.
subject: E-Commerce, E-Business, GoodRelations, Ontology, Tourism, Hotels, Camping, Vacation homes
title: ACCO: The Accommodation Ontology for Semantic Web-based E-Commerce
creator: Martin Hepp (Hepp Research GmbH)
rights: The Accommodation Ontology ontology is available under the Creative Commons Attribution 3.0 Unported license; see http://creativecommons.org/licenses/by/3.0/. In a nutshell, you are free to copy, distribute and transmit the work; to remix/adapt the work (e.g. to import the ontology and create specializations of its elements), as long as you attribute the work in the manner specified by the author or licensor (but not in any way that suggests that they endorse you or your use of the work).
comment: ACCO: The Accommodation Ontology A Web vocabulary for hotels, vacation homes, camping sites, and other accommodation offers for e-commerce. Vocabulary: http://purl.org/acco/ns# Namespace: http://purl.org/acco/ns# The Accommodation Ontology is designed to be used in combination with GoodRelations, a standard vocabulary for the commercial aspects of offers for sale or rental. See http://purl.org/goodrelations/ for more information.