URI Template
subclass of: Resource
type: Class
description: URI template for use as a service address, possibly with parameters

Output Format Parameter
subclass of: Resource
type: Class
description: an input parameter that dictates the output format that the service should return (this class is intended for use in sawsdl:modelReference on msm:MessagePart)

Media Type
subclass of: Resource
type: Class
type: Datatype
description: a data type for literals that specify media types

Authentication Credential
subclass of: Resource
type: Class
description: an input parameter that carries an authentication credential (this class is intended for use in sawsdl:modelReference on msm:MessagePart)

produces Content Type
type: Property
description: the content type produced by the operation
domain: Operation
range: Media Type
domain: Resource
range: Resource

has Address
type: Property
description: the address of the operation or service (expected to be used on msm:Service or msm:Operation)
range: URI Template
range: Resource

has Method
type: Property
description: the method of an operation
domain: Operation
range: Method
domain: Resource
range: Resource

has Comment
type: Property
sub property of: comment

accepts Content Type
type: Property
description: the content type accepted by the operation
domain: Operation
range: Media Type
domain: Resource
range: Resource

automatically Extracted Description
type: Property
range: Literal
range: Resource

is Grounded In
type: Property
description: the URI template parameter in which a message part is grounded (may be accompanied by sawsdl lowering schema mapping)
domain: MessagePart
domain: Resource

Web API Grounding Model
version info: 1.2
creator: me
description: This is a description of the Web API Grounding Model, a simple model for capturing Web API details relevant for invocation support
type: Ontology
creator: kmi.open.ac.uk
created: 2010-03-10
modified: 2012-03-14
issued: 2010-03-10
modified: 2011-12-03
prior version: v2#
modified: 2013-05-08
imports: http
creator: carlos-pedrinaci
creator: vitvar.com
imports: msm
modified: 2013-10-03
imports: http-methods