detailed description
property disjoint with: course duration
type: DatatypeProperty
property disjoint with: has-rights-copyright
property disjoint with: hours of labs
property disjoint with: bottomDataProperty
property disjoint with: number of credits
property disjoint with: hours of lectures
sub property of: topDataProperty
property disjoint with: total hours of engagement
property disjoint with: has-rights-cost
property disjoint with: hours of personal study
property disjoint with: is-taught-present
comment: A detailed description of the content conveyed within the course
domain: Course
range: string

has instructor
sub property of: topObjectProperty
property disjoint with: bottomObjectProperty
type: ObjectProperty
comment: A person delivering tuition as part of the course
domain: Course
range: Person

total hours of engagement
property disjoint with: has-rights-cost
property disjoint with: has language
property disjoint with: detailed description
property disjoint with: title
property disjoint with: course duration
sub property of: topDataProperty
type: DatatypeProperty
property disjoint with: has-rights-copyright
property disjoint with: is-taught-present
property disjoint with: has-rights-description
property disjoint with: course objectives
property disjoint with: bottomDataProperty
comment: The total number of hours of engagement while undertaking this course
domain: Course
range: float

has language
property disjoint with: bottomDataProperty
property disjoint with: course duration
property disjoint with: total hours of engagement
type: DatatypeProperty
property disjoint with: has-rights-cost
property disjoint with: has-rights-copyright
property disjoint with: is-taught-present
property disjoint with: number of credits
sub property of: topDataProperty
property disjoint with: hours of lectures
property disjoint with: hours of personal study
property disjoint with: hours of labs
comment: The language in which an item of abstract information is written, expressed or delivered.
domain: Abstract-Information
range: language

course duration
property disjoint with: has language
property disjoint with: detailed description
property disjoint with: has-rights-description
property disjoint with: course objectives
type: DatatypeProperty
property disjoint with: has-rights-cost
property disjoint with: number of credits
property disjoint with: is-taught-present
property disjoint with: bottomDataProperty
property disjoint with: hours of lectures
property disjoint with: total hours of engagement
property disjoint with: hours of personal study
sub property of: topDataProperty
property disjoint with: hours of labs
property disjoint with: title
property disjoint with: has-rights-copyright
comment: The total duration of the course (in hours)
domain: Course
range: integer

ReSIST Courseware Ontology
creator: Ian Millard
creator: Bene Rodriguez
created: 2006-05-03
description: The ReSIST Courseware Ontology represents the various eduacational courses and resources within the ReSIST project
type: Thing
type: Ontology
imports: portal
version info: 0.1

Assessment Method
disjoint with: Nothing
subclass of: Thing
type: Class
comment: A method by which a student is assessed; instances of this class may include examination, coursework, etc.

has infrastructure requirement
sub property of: topObjectProperty
property disjoint with: bottomObjectProperty
type: ObjectProperty
comment: An infrastructure requirement that is needed to carry out the course
domain: Course
range: Technology

has-rights-description
type: DatatypeProperty
property disjoint with: has-rights-cost
property disjoint with: number of credits
property disjoint with: bottomDataProperty
property disjoint with: is-taught-present
sub property of: topDataProperty
property disjoint with: hours of personal study
property disjoint with: course duration
property disjoint with: hours of lectures
property disjoint with: has-rights-copyright
property disjoint with: total hours of engagement
property disjoint with: hours of labs
comment: Comments on the conditions of use of this learning resource.
domain: Abstract-Information
range: string

has pre-requisite
sub property of: topObjectProperty
property disjoint with: bottomObjectProperty
type: ObjectProperty
domain: Course
range: Pre-requisite

involves organisation
sub property of: topObjectProperty
property disjoint with: bottomObjectProperty
type: ObjectProperty
comment: The association of an organisation which is involved in delivering a course
domain: Course
range: Organization

course objectives
sub property of: topDataProperty
property disjoint with: has-rights-cost
property disjoint with: hours of lectures
property disjoint with: hours of labs
property disjoint with: bottomDataProperty
property disjoint with: has-rights-copyright
property disjoint with: number of credits
property disjoint with: hours of personal study
property disjoint with: course duration
property disjoint with: total hours of engagement
property disjoint with: is-taught-present
type: DatatypeProperty
comment: The objectives of this course
domain: Course
range: string

Student Interaction Type
disjoint with: Nothing
subclass of: Thing
type: Class
comment: A type of interaction in which a student engages whilst undertaking a course; instances of this class may include lectures, laboratory sessions, and group or individual projects.

title
property disjoint with: number of credits
property disjoint with: total hours of engagement
property disjoint with: course duration
property disjoint with: hours of labs
property disjoint with: is-taught-present
property disjoint with: has-rights-cost
type: DatatypeProperty
sub property of: topDataProperty
property disjoint with: hours of lectures
property disjoint with: hours of personal study
property disjoint with: has-rights-copyright
property disjoint with: bottomDataProperty
comment: The title of this course
domain: Course
range: string
sub property of: label

has author
sub property of: topObjectProperty
property disjoint with: bottomObjectProperty
type: ObjectProperty
comment: A person which is involved with the creation of the course
domain: Course
range: Generic-Agent

has-rights
sub property of: topObjectProperty
property disjoint with: bottomObjectProperty
type: ObjectProperty
comment: This property describes the intellectual property rights and conditions of use for this learning object.
domain: Abstract-Information

has student interaction type
sub property of: topObjectProperty
property disjoint with: bottomObjectProperty
type: ObjectProperty
comment: Identifies a course as having the prescribed interaction type
domain: Course
range: Student Interaction Type

hours of personal study
property disjoint with: bottomDataProperty
sub property of: topDataProperty
property disjoint with: has language
property disjoint with: course duration
property disjoint with: detailed description
property disjoint with: has-rights-cost
property disjoint with: title
property disjoint with: is-taught-present
property disjoint with: has-rights-copyright
type: DatatypeProperty
property disjoint with: has-rights-description
property disjoint with: course objectives
comment: The total number of hours of personal study in this course
domain: Course
range: float

has-rights-copyright
sub property of: topDataProperty
property disjoint with: bottomDataProperty
property disjoint with: hours of labs
property disjoint with: hours of lectures
property disjoint with: course duration
property disjoint with: total hours of engagement
type: DatatypeProperty
property disjoint with: has-rights-cost
property disjoint with: has language
property disjoint with: number of credits
property disjoint with: title
property disjoint with: hours of personal study
property disjoint with: has-rights-description
property disjoint with: course objectives
property disjoint with: detailed description
property disjoint with: is-taught-present
comment: Whether copyright or other restrictions apply to the use of this learning resource.
domain: Abstract-Information
range: http://lodlaundromat.org/.well-known/genid/8b5db2fc411646582e971757d8e5c77c#4

number of credits
property disjoint with: has-rights-description
property disjoint with: detailed description
property disjoint with: course duration
sub property of: topDataProperty
property disjoint with: has-rights-cost
property disjoint with: bottomDataProperty
property disjoint with: course objectives
property disjoint with: has language
property disjoint with: is-taught-present
property disjoint with: has-rights-copyright
property disjoint with: title
type: DatatypeProperty
comment: The number of EU BS/MS program credits
domain: Course
range: float

Pre-requisite
disjoint with: Nothing
subclass of: Thing
type: Class
comment: This class encapsulates a body of previous knowledge required to undertake a course.

has assessment method
sub property of: topObjectProperty
property disjoint with: bottomObjectProperty
type: ObjectProperty
domain: Course
range: Assessment Method

hours of labs
sub property of: topDataProperty
property disjoint with: course objectives
property disjoint with: has language
property disjoint with: detailed description
property disjoint with: is-taught-present
property disjoint with: has-rights-copyright
property disjoint with: title
property disjoint with: bottomDataProperty
type: DatatypeProperty
property disjoint with: has-rights-description
property disjoint with: has-rights-cost
property disjoint with: course duration
comment: The total number of hours of laboratory sessions in this course
domain: Course
range: float

Course
disjoint with: Nothing
subclass of: Thing
subclass of: Abstract-Information
type: Class
comment: This class encapsulates a course that is taught to students

hours of lectures
property disjoint with: has-rights-cost
property disjoint with: detailed description
property disjoint with: is-taught-present
property disjoint with: title
property disjoint with: bottomDataProperty
property disjoint with: course duration
type: DatatypeProperty
property disjoint with: has-rights-copyright
property disjoint with: has-rights-description
sub property of: topDataProperty
property disjoint with: course objectives
property disjoint with: has language
comment: The total number of hours of lectures delivered in this course
domain: Course
range: float

has courseware
sub property of: topObjectProperty
property disjoint with: bottomObjectProperty
type: ObjectProperty
comment: Courseware used by the Resist-Course (reference texts, personal hand-outs, slides, etc).
domain: Course
range: Publication-Reference

submitted by
sub property of: topObjectProperty
property disjoint with: bottomObjectProperty
type: ObjectProperty
comment: The ReSIST Project member who has submitted and is the point of contact for this course
domain: Course
range: Generic-Agent

taught at
sub property of: topObjectProperty
property disjoint with: bottomObjectProperty
type: ObjectProperty
comment: The organization at which this course is taught
domain: Course
range: Organization

has-rights-cost
property disjoint with: detailed description
property disjoint with: has language
property disjoint with: hours of personal study
sub property of: topDataProperty
type: DatatypeProperty
property disjoint with: has-rights-copyright
property disjoint with: total hours of engagement
property disjoint with: is-taught-present
property disjoint with: hours of lectures
property disjoint with: number of credits
property disjoint with: bottomDataProperty
property disjoint with: title
property disjoint with: course objectives
property disjoint with: has-rights-description
property disjoint with: course duration
property disjoint with: hours of labs
comment: Whether use of this learning resource requires payment
domain: Abstract-Information
range: http://lodlaundromat.org/.well-known/genid/8b5db2fc411646582e971757d8e5c77c#1

http://lodlaundromat.org/.well-known/genid/8b5db2fc411646582e971757d8e5c77c#9
first: false
rest: http://lodlaundromat.org/.well-known/genid/8b5db2fc411646582e971757d8e5c77c#8

http://lodlaundromat.org/.well-known/genid/8b5db2fc411646582e971757d8e5c77c#3
first: true
rest: nil

http://lodlaundromat.org/.well-known/genid/8b5db2fc411646582e971757d8e5c77c#8
first: true
rest: nil

http://lodlaundromat.org/.well-known/genid/8b5db2fc411646582e971757d8e5c77c#2
first: false
rest: http://lodlaundromat.org/.well-known/genid/8b5db2fc411646582e971757d8e5c77c#3

http://lodlaundromat.org/.well-known/genid/8b5db2fc411646582e971757d8e5c77c#6
first: false
rest: http://lodlaundromat.org/.well-known/genid/8b5db2fc411646582e971757d8e5c77c#5

http://lodlaundromat.org/.well-known/genid/8b5db2fc411646582e971757d8e5c77c#5
first: true
rest: nil