has instructor
range: Thing
domain: Thing
type: ObjectProperty
comment: A person delivering tuition as part of the course
domain: Course
range: Person
type: Property
domain: Resource
domain: Abstract-Information
range: Resource

Assessment Method
subclass of: Thing
subclass of: Resource
type: Class
comment: A method by which a student is assessed; instances of this class may include examination, coursework, etc.

has infrastructure requirement
range: Thing
domain: Thing
type: ObjectProperty
comment: An infrastructure requirement that is needed to carry out the course
domain: Course
range: Technology
type: Property
domain: Resource
domain: Abstract-Information
range: Resource

has pre-requisite
range: Thing
domain: Thing
type: ObjectProperty
domain: Course
range: Pre-requisite
type: Property
domain: Resource
domain: Abstract-Information
range: Resource

involves organisation
range: Thing
domain: Thing
type: ObjectProperty
comment: The association of an organisation which is involved in delivering a course
domain: Course
range: Organization
type: Property
domain: Resource
domain: Abstract-Information
range: Resource

Student Interaction Type
subclass of: Thing
subclass of: Resource
type: Class
comment: A type of interaction in which a student engages whilst undertaking a course; instances of this class may include lectures, laboratory sessions, and group or individual projects.

has author
range: Thing
domain: Thing
type: ObjectProperty
comment: A person which is involved with the creation of the course
domain: Course
range: Generic-Agent
type: Property
domain: Resource
domain: Abstract-Information
range: Resource

has-rights
range: Thing
domain: Thing
type: ObjectProperty
comment: This property describes the intellectual property rights and conditions of use for this learning object.
domain: Abstract-Information
type: Property
domain: Resource
range: Resource

has student interaction type
range: Thing
domain: Thing
type: ObjectProperty
comment: Identifies a course as having the prescribed interaction type
domain: Course
range: Student Interaction Type
type: Property
domain: Resource
domain: Abstract-Information
range: Resource

Pre-requisite
subclass of: Resource
subclass of: Thing
type: Class
comment: This class encapsulates a body of previous knowledge required to undertake a course.

has assessment method
range: Thing
domain: Thing
type: ObjectProperty
domain: Course
range: Assessment Method
type: Property
domain: Resource
domain: Abstract-Information
range: Resource

Course
subclass of: Thing
subclass of: Resource
type: Class
comment: This class encapsulates a course that is taught to students
subclass of: Abstract-Information

has courseware
range: Thing
domain: Thing
type: ObjectProperty
comment: Courseware used by the Resist-Course (reference texts, personal hand-outs, slides, etc).
domain: Course
range: Publication-Reference
type: Property
domain: Resource
domain: Abstract-Information
range: Resource

submitted by
range: Thing
domain: Thing
type: ObjectProperty
comment: The ReSIST Project member who has submitted and is the point of contact for this course
domain: Course
range: Generic-Agent
type: Property
domain: Resource
domain: Abstract-Information
range: Resource

taught at
range: Thing
domain: Thing
type: ObjectProperty
comment: The organization at which this course is taught
domain: Course
range: Organization
type: Property
domain: Resource
domain: Abstract-Information
range: Resource

detailed description
type: DatatypeProperty
comment: A detailed description of the content conveyed within the course
domain: Course
range: string
type: Property
domain: Thing
domain: Resource
domain: Abstract-Information
range: Resource

http://lodlaundromat.org/.well-known/genid/8b5db2fc411646582e971757d8e5c77c#9
first: false
rest: http://lodlaundromat.org/.well-known/genid/8b5db2fc411646582e971757d8e5c77c#8

total hours of engagement
type: DatatypeProperty
comment: The total number of hours of engagement while undertaking this course
domain: Course
range: float
type: Property
domain: Thing
domain: Resource
domain: Abstract-Information
range: Resource

has language
type: DatatypeProperty
comment: The language in which an item of abstract information is written, expressed or delivered.
domain: Abstract-Information
range: language
type: Property
domain: Resource
range: Resource

course duration
type: DatatypeProperty
comment: The total duration of the course (in hours)
domain: Course
range: integer
type: Property
domain: Thing
domain: Resource
domain: Abstract-Information
range: Resource
range: decimal

http://lodlaundromat.org/.well-known/genid/8b5db2fc411646582e971757d8e5c77c#3
first: true
rest: nil

ReSIST Courseware Ontology
created: 2006-05-03
creator: Bene Rodriguez
creator: Ian Millard
description: The ReSIST Courseware Ontology represents the various eduacational courses and resources within the ReSIST project
type: Ontology
imports: portal
version info: 0.1

http://lodlaundromat.org/.well-known/genid/8b5db2fc411646582e971757d8e5c77c#8
first: true
rest: nil

has-rights-description
type: DatatypeProperty
comment: Comments on the conditions of use of this learning resource.
domain: Abstract-Information
range: string
type: Property
domain: Resource
range: Resource

http://lodlaundromat.org/.well-known/genid/8b5db2fc411646582e971757d8e5c77c#2
first: false
rest: http://lodlaundromat.org/.well-known/genid/8b5db2fc411646582e971757d8e5c77c#3

course objectives
type: DatatypeProperty
comment: The objectives of this course
domain: Course
range: string
type: Property
domain: Thing
domain: Resource
domain: Abstract-Information
range: Resource

title
type: DatatypeProperty
comment: The title of this course
domain: Course
range: string
sub property of: label
type: Property
domain: Thing
domain: Resource
domain: Abstract-Information
range: Resource

http://lodlaundromat.org/.well-known/genid/8b5db2fc411646582e971757d8e5c77c#6
first: false
rest: http://lodlaundromat.org/.well-known/genid/8b5db2fc411646582e971757d8e5c77c#5

hours of personal study
type: DatatypeProperty
comment: The total number of hours of personal study in this course
domain: Course
range: float
type: Property
domain: Thing
domain: Resource
domain: Abstract-Information
range: Resource

has-rights-copyright
type: DatatypeProperty
comment: Whether copyright or other restrictions apply to the use of this learning resource.
domain: Abstract-Information
range: http://lodlaundromat.org/.well-known/genid/8b5db2fc411646582e971757d8e5c77c#4
type: Property
domain: Resource
range: http://lodlaundromat.org/.well-known/genid/8b5db2fc411646582e971757d8e5c77c#1
range: Resource
range: http://lodlaundromat.org/.well-known/genid/8b5db2fc411646582e971757d8e5c77c#7

number of credits
type: DatatypeProperty
comment: The number of EU BS/MS program credits
domain: Course
range: float
type: Property
domain: Thing
domain: Resource
domain: Abstract-Information
range: Resource

http://lodlaundromat.org/.well-known/genid/8b5db2fc411646582e971757d8e5c77c#5
first: true
rest: nil

hours of labs
type: DatatypeProperty
comment: The total number of hours of laboratory sessions in this course
domain: Course
range: float
type: Property
domain: Thing
domain: Resource
domain: Abstract-Information
range: Resource

hours of lectures
type: DatatypeProperty
comment: The total number of hours of lectures delivered in this course
domain: Course
range: float
type: Property
domain: Thing
domain: Resource
domain: Abstract-Information
range: Resource

has-rights-cost
type: DatatypeProperty
comment: Whether use of this learning resource requires payment
domain: Abstract-Information
range: http://lodlaundromat.org/.well-known/genid/8b5db2fc411646582e971757d8e5c77c#1
type: Property
domain: Resource
range: http://lodlaundromat.org/.well-known/genid/8b5db2fc411646582e971757d8e5c77c#4
range: Resource
range: http://lodlaundromat.org/.well-known/genid/8b5db2fc411646582e971757d8e5c77c#7