cause
range: Thing
domain: Thing
type: ObjectProperty
type: Property
range: http://lodlaundromat.org/.well-known/genid/87b3155a45f739091dc1b4f71dafba5d#6
range: http://lodlaundromat.org/.well-known/genid/87b3155a45f739091dc1b4f71dafba5d#2
range: http://lodlaundromat.org/.well-known/genid/87b3155a45f739091dc1b4f71dafba5d#1
range: http://lodlaundromat.org/.well-known/genid/b1d777ae0029e5815eb2dfe2bfc6b521#2
range: Resource
range: http://lodlaundromat.org/.well-known/genid/b1d777ae0029e5815eb2dfe2bfc6b521#7
range: http://lodlaundromat.org/.well-known/genid/87b3155a45f739091dc1b4f71dafba5d#14
domain: http://lodlaundromat.org/.well-known/genid/87b3155a45f739091dc1b4f71dafba5d#1
domain: http://lodlaundromat.org/.well-known/genid/87b3155a45f739091dc1b4f71dafba5d#2
domain: http://lodlaundromat.org/.well-known/genid/b1d777ae0029e5815eb2dfe2bfc6b521#7
domain: Resource
domain: http://lodlaundromat.org/.well-known/genid/b1d777ae0029e5815eb2dfe2bfc6b521#2
domain: http://lodlaundromat.org/.well-known/genid/87b3155a45f739091dc1b4f71dafba5d#14
domain: http://lodlaundromat.org/.well-known/genid/87b3155a45f739091dc1b4f71dafba5d#6

result
range: Thing
domain: Thing
type: ObjectProperty
type: Property
range: http://lodlaundromat.org/.well-known/genid/87b3155a45f739091dc1b4f71dafba5d#6
range: http://lodlaundromat.org/.well-known/genid/87b3155a45f739091dc1b4f71dafba5d#2
range: http://lodlaundromat.org/.well-known/genid/87b3155a45f739091dc1b4f71dafba5d#1
range: http://lodlaundromat.org/.well-known/genid/b1d777ae0029e5815eb2dfe2bfc6b521#2
range: Resource
range: http://lodlaundromat.org/.well-known/genid/b1d777ae0029e5815eb2dfe2bfc6b521#7
range: http://lodlaundromat.org/.well-known/genid/87b3155a45f739091dc1b4f71dafba5d#14
domain: http://lodlaundromat.org/.well-known/genid/87b3155a45f739091dc1b4f71dafba5d#1
domain: http://lodlaundromat.org/.well-known/genid/87b3155a45f739091dc1b4f71dafba5d#2
domain: http://lodlaundromat.org/.well-known/genid/b1d777ae0029e5815eb2dfe2bfc6b521#7
domain: Resource
domain: http://lodlaundromat.org/.well-known/genid/b1d777ae0029e5815eb2dfe2bfc6b521#2
domain: http://lodlaundromat.org/.well-known/genid/87b3155a45f739091dc1b4f71dafba5d#14
domain: http://lodlaundromat.org/.well-known/genid/87b3155a45f739091dc1b4f71dafba5d#6

has license
sub property of: has license
equivalent property: has license
range: Thing
domain: Thing
equivalent property: license
sub property of: license
type: Property
range: License
domain: Work
type: ObjectProperty
type: Thing
domain: http://lodlaundromat.org/.well-known/genid/87b3155a45f739091dc1b4f71dafba5d#6
domain: http://lodlaundromat.org/.well-known/genid/87b3155a45f739091dc1b4f71dafba5d#1
domain: http://lodlaundromat.org/.well-known/genid/b1d777ae0029e5815eb2dfe2bfc6b521#7
domain: http://lodlaundromat.org/.well-known/genid/87b3155a45f739091dc1b4f71dafba5d#2
domain: http://lodlaundromat.org/.well-known/genid/87b3155a45f739091dc1b4f71dafba5d#14
domain: http://lodlaundromat.org/.well-known/genid/b1d777ae0029e5815eb2dfe2bfc6b521#2
domain: Resource
range: http://lodlaundromat.org/.well-known/genid/87b3155a45f739091dc1b4f71dafba5d#6
range: http://lodlaundromat.org/.well-known/genid/87b3155a45f739091dc1b4f71dafba5d#1
range: http://lodlaundromat.org/.well-known/genid/b1d777ae0029e5815eb2dfe2bfc6b521#7
range: http://lodlaundromat.org/.well-known/genid/87b3155a45f739091dc1b4f71dafba5d#2
range: http://lodlaundromat.org/.well-known/genid/87b3155a45f739091dc1b4f71dafba5d#14
range: http://lodlaundromat.org/.well-known/genid/b1d777ae0029e5815eb2dfe2bfc6b521#2
range: Resource
range: http://lodlaundromat.org/.well-known/genid/b1d777ae0029e5815eb2dfe2bfc6b521#1
range: LicenseDocument
range: http://lodlaundromat.org/.well-known/genid/87b3155a45f739091dc1b4f71dafba5d#11
type: http://lodlaundromat.org/.well-known/genid/b1d777ae0029e5815eb2dfe2bfc6b521#7
type: http://lodlaundromat.org/.well-known/genid/87b3155a45f739091dc1b4f71dafba5d#2
type: http://lodlaundromat.org/.well-known/genid/87b3155a45f739091dc1b4f71dafba5d#1
type: http://lodlaundromat.org/.well-known/genid/87b3155a45f739091dc1b4f71dafba5d#6
type: http://lodlaundromat.org/.well-known/genid/87b3155a45f739091dc1b4f71dafba5d#14
type: http://lodlaundromat.org/.well-known/genid/b1d777ae0029e5815eb2dfe2bfc6b521#2

License
subclass of: License
subclass of: Thing
subclass of: Resource
subclass of: http://lodlaundromat.org/.well-known/genid/b1d777ae0029e5815eb2dfe2bfc6b521#1
type: Class
comment: a set of requests/permissions to users of a Work, e.g. a copyright license, the public domain, information for distributors
subclass of: LicenseDocument
subclass of: http://lodlaundromat.org/.well-known/genid/87b3155a45f739091dc1b4f71dafba5d#11
subclass of: http://lodlaundromat.org/.well-known/genid/87b3155a45f739091dc1b4f71dafba5d#2
subclass of: http://lodlaundromat.org/.well-known/genid/b1d777ae0029e5815eb2dfe2bfc6b521#2
subclass of: http://lodlaundromat.org/.well-known/genid/b1d777ae0029e5815eb2dfe2bfc6b521#7
subclass of: http://lodlaundromat.org/.well-known/genid/87b3155a45f739091dc1b4f71dafba5d#14
subclass of: http://lodlaundromat.org/.well-known/genid/87b3155a45f739091dc1b4f71dafba5d#6
subclass of: http://lodlaundromat.org/.well-known/genid/87b3155a45f739091dc1b4f71dafba5d#1
equivalent class: License

Constraint violation
type: Class
subclass of: Resource
comment: An object that can be created by spin:constraints to provide information about a constraint violation.

Attribution
subclass of: Attribution
type: Requirement
comment: credit be given to copyright holder and/or author
type: Thing
type: Class
type: http://lodlaundromat.org/.well-known/genid/87b3155a45f739091dc1b4f71dafba5d#14
type: http://lodlaundromat.org/.well-known/genid/87b3155a45f739091dc1b4f71dafba5d#6
type: http://lodlaundromat.org/.well-known/genid/87b3155a45f739091dc1b4f71dafba5d#2
type: http://lodlaundromat.org/.well-known/genid/87b3155a45f739091dc1b4f71dafba5d#1
type: http://lodlaundromat.org/.well-known/genid/b1d777ae0029e5815eb2dfe2bfc6b521#2
type: http://lodlaundromat.org/.well-known/genid/b1d777ae0029e5815eb2dfe2bfc6b521#7
equivalent class: Attribution

Q1
type: Quarter
type: Thing
type: Period
type: http://lodlaundromat.org/.well-known/genid/87b3155a45f739091dc1b4f71dafba5d#14
type: http://lodlaundromat.org/.well-known/genid/87b3155a45f739091dc1b4f71dafba5d#6
type: http://lodlaundromat.org/.well-known/genid/87b3155a45f739091dc1b4f71dafba5d#2
type: http://lodlaundromat.org/.well-known/genid/87b3155a45f739091dc1b4f71dafba5d#1
type: http://lodlaundromat.org/.well-known/genid/b1d777ae0029e5815eb2dfe2bfc6b521#2
type: http://lodlaundromat.org/.well-known/genid/b1d777ae0029e5815eb2dfe2bfc6b521#7

Table data provider
subclass of: Resource
type: Class
subclass of: Class
comment: An abstraction of objects that can produce tabular data. This serves as a base class of spin:SelectTemplate, because SELECT queries can produce tables with columns for each result variable. However, other types of TableDataProviders are conceivable by other frameworks, and this class may prove as a useful shared foundation. TableDataProviders can link to definitions of columns via spin:column, and these definitions can inform rendering engines.

Rule property
subclass of: Resource
type: Class
subclass of: Property
comment: The metaclass of spin:rule and its subproperties. spin:RuleProperties can have additional metadata attached to them.

status
range: Thing
domain: Thing
type: ObjectProperty
type: Property
range: http://lodlaundromat.org/.well-known/genid/87b3155a45f739091dc1b4f71dafba5d#6
range: http://lodlaundromat.org/.well-known/genid/87b3155a45f739091dc1b4f71dafba5d#2
range: http://lodlaundromat.org/.well-known/genid/87b3155a45f739091dc1b4f71dafba5d#1
range: http://lodlaundromat.org/.well-known/genid/b1d777ae0029e5815eb2dfe2bfc6b521#2
range: Resource
range: http://lodlaundromat.org/.well-known/genid/b1d777ae0029e5815eb2dfe2bfc6b521#7
range: http://lodlaundromat.org/.well-known/genid/87b3155a45f739091dc1b4f71dafba5d#14
domain: http://lodlaundromat.org/.well-known/genid/87b3155a45f739091dc1b4f71dafba5d#1
domain: http://lodlaundromat.org/.well-known/genid/87b3155a45f739091dc1b4f71dafba5d#2
domain: http://lodlaundromat.org/.well-known/genid/b1d777ae0029e5815eb2dfe2bfc6b521#7
domain: Resource
domain: http://lodlaundromat.org/.well-known/genid/b1d777ae0029e5815eb2dfe2bfc6b521#2
domain: http://lodlaundromat.org/.well-known/genid/87b3155a45f739091dc1b4f71dafba5d#14
domain: http://lodlaundromat.org/.well-known/genid/87b3155a45f739091dc1b4f71dafba5d#6

Prohibition
subclass of: Resource
subclass of: Prohibition
type: Class
comment: something you may be asked not to do
equivalent class: Prohibition

Source Code
subclass of: SourceCode
type: Requirement
comment: source code (the preferred form for making modifications) must be provided when exercising some rights granted by the license.
type: Class
equivalent class: SourceCode

Work
subclass of: Resource
subclass of: Work
type: Class
comment: a potentially copyrightable work
equivalent class: Work

attributed source
type: Property
range: Thing
domain: Thing
type: ObjectProperty
range: http://lodlaundromat.org/.well-known/genid/87b3155a45f739091dc1b4f71dafba5d#6
range: http://lodlaundromat.org/.well-known/genid/87b3155a45f739091dc1b4f71dafba5d#2
range: http://lodlaundromat.org/.well-known/genid/87b3155a45f739091dc1b4f71dafba5d#1
range: http://lodlaundromat.org/.well-known/genid/b1d777ae0029e5815eb2dfe2bfc6b521#2
range: Resource
range: http://lodlaundromat.org/.well-known/genid/b1d777ae0029e5815eb2dfe2bfc6b521#7
range: http://lodlaundromat.org/.well-known/genid/87b3155a45f739091dc1b4f71dafba5d#14
domain: http://lodlaundromat.org/.well-known/genid/87b3155a45f739091dc1b4f71dafba5d#1
domain: http://lodlaundromat.org/.well-known/genid/87b3155a45f739091dc1b4f71dafba5d#2
domain: http://lodlaundromat.org/.well-known/genid/b1d777ae0029e5815eb2dfe2bfc6b521#7
domain: Resource
domain: http://lodlaundromat.org/.well-known/genid/b1d777ae0029e5815eb2dfe2bfc6b521#2
domain: http://lodlaundromat.org/.well-known/genid/87b3155a45f739091dc1b4f71dafba5d#14
domain: http://lodlaundromat.org/.well-known/genid/87b3155a45f739091dc1b4f71dafba5d#6

category
range: Thing
domain: Thing
type: ObjectProperty
type: Property
range: http://lodlaundromat.org/.well-known/genid/87b3155a45f739091dc1b4f71dafba5d#6
range: http://lodlaundromat.org/.well-known/genid/87b3155a45f739091dc1b4f71dafba5d#2
range: http://lodlaundromat.org/.well-known/genid/87b3155a45f739091dc1b4f71dafba5d#1
range: http://lodlaundromat.org/.well-known/genid/b1d777ae0029e5815eb2dfe2bfc6b521#2
range: Resource
range: http://lodlaundromat.org/.well-known/genid/b1d777ae0029e5815eb2dfe2bfc6b521#7
range: http://lodlaundromat.org/.well-known/genid/87b3155a45f739091dc1b4f71dafba5d#14
domain: http://lodlaundromat.org/.well-known/genid/87b3155a45f739091dc1b4f71dafba5d#1
domain: http://lodlaundromat.org/.well-known/genid/87b3155a45f739091dc1b4f71dafba5d#2
domain: http://lodlaundromat.org/.well-known/genid/b1d777ae0029e5815eb2dfe2bfc6b521#7
domain: Resource
domain: http://lodlaundromat.org/.well-known/genid/b1d777ae0029e5815eb2dfe2bfc6b521#2
domain: http://lodlaundromat.org/.well-known/genid/87b3155a45f739091dc1b4f71dafba5d#14
domain: http://lodlaundromat.org/.well-known/genid/87b3155a45f739091dc1b4f71dafba5d#6

requires
range: Thing
domain: Thing
equivalent property: requires
sub property of: requires
type: Property
domain: License
range: Requirement
type: ObjectProperty
range: http://lodlaundromat.org/.well-known/genid/87b3155a45f739091dc1b4f71dafba5d#6
range: http://lodlaundromat.org/.well-known/genid/87b3155a45f739091dc1b4f71dafba5d#1
range: http://lodlaundromat.org/.well-known/genid/b1d777ae0029e5815eb2dfe2bfc6b521#7
range: http://lodlaundromat.org/.well-known/genid/87b3155a45f739091dc1b4f71dafba5d#2
range: http://lodlaundromat.org/.well-known/genid/87b3155a45f739091dc1b4f71dafba5d#14
range: http://lodlaundromat.org/.well-known/genid/b1d777ae0029e5815eb2dfe2bfc6b521#2
range: Resource
domain: http://lodlaundromat.org/.well-known/genid/87b3155a45f739091dc1b4f71dafba5d#6
domain: http://lodlaundromat.org/.well-known/genid/87b3155a45f739091dc1b4f71dafba5d#1
domain: http://lodlaundromat.org/.well-known/genid/b1d777ae0029e5815eb2dfe2bfc6b521#7
domain: http://lodlaundromat.org/.well-known/genid/87b3155a45f739091dc1b4f71dafba5d#2
domain: http://lodlaundromat.org/.well-known/genid/87b3155a45f739091dc1b4f71dafba5d#14
domain: http://lodlaundromat.org/.well-known/genid/b1d777ae0029e5815eb2dfe2bfc6b521#2
domain: Resource
domain: http://lodlaundromat.org/.well-known/genid/b1d777ae0029e5815eb2dfe2bfc6b521#1
domain: LicenseDocument
domain: http://lodlaundromat.org/.well-known/genid/87b3155a45f739091dc1b4f71dafba5d#11

Period
subclass of: Resource
type: Class
subclass of: Thing
subclass of: http://lodlaundromat.org/.well-known/genid/87b3155a45f739091dc1b4f71dafba5d#6
subclass of: http://lodlaundromat.org/.well-known/genid/87b3155a45f739091dc1b4f71dafba5d#1
subclass of: http://lodlaundromat.org/.well-known/genid/87b3155a45f739091dc1b4f71dafba5d#2
subclass of: http://lodlaundromat.org/.well-known/genid/b1d777ae0029e5815eb2dfe2bfc6b521#2
subclass of: http://lodlaundromat.org/.well-known/genid/87b3155a45f739091dc1b4f71dafba5d#14
subclass of: http://lodlaundromat.org/.well-known/genid/b1d777ae0029e5815eb2dfe2bfc6b521#7

Ask template
subclass of: Resource
type: Class
subclass of: Template
comment: A SPIN template that wraps an ASK query.
constraint: http://lodlaundromat.org/.well-known/genid/9fb05f53ba0c66117a615cb1cd805aaa#3
query: http://lodlaundromat.org/.well-known/genid/9fb05f53ba0c66117a615cb1cd805aaa#3
command: http://lodlaundromat.org/.well-known/genid/9fb05f53ba0c66117a615cb1cd805aaa#3

Update template
subclass of: Resource
type: Class
subclass of: Template
comment: A SPIN template that has an UPDATE command as its body.
constraint: http://lodlaundromat.org/.well-known/genid/9fb05f53ba0c66117a615cb1cd805aaa#4
query: http://lodlaundromat.org/.well-known/genid/9fb05f53ba0c66117a615cb1cd805aaa#4
command: http://lodlaundromat.org/.well-known/genid/9fb05f53ba0c66117a615cb1cd805aaa#4

Template
subclass of: Resource
type: Class
subclass of: Module
comment: The metaclass of SPIN templates. Templates are classes that are instances of this class. A template represents a reusable SPARQL query or update request that can be parameterized with arguments. Templates can be instantiated in places where normally a SPARQL query or update request is used, in particular as spin:rules and spin:constraints.
constraint: http://lodlaundromat.org/.well-known/genid/9fb05f53ba0c66117a615cb1cd805aaa#7
query: http://lodlaundromat.org/.well-known/genid/9fb05f53ba0c66117a615cb1cd805aaa#7
command: http://lodlaundromat.org/.well-known/genid/9fb05f53ba0c66117a615cb1cd805aaa#7

Q4
type: Quarter
type: Thing
type: Period
type: http://lodlaundromat.org/.well-known/genid/87b3155a45f739091dc1b4f71dafba5d#14
type: http://lodlaundromat.org/.well-known/genid/87b3155a45f739091dc1b4f71dafba5d#6
type: http://lodlaundromat.org/.well-known/genid/87b3155a45f739091dc1b4f71dafba5d#2
type: http://lodlaundromat.org/.well-known/genid/87b3155a45f739091dc1b4f71dafba5d#1
type: http://lodlaundromat.org/.well-known/genid/b1d777ae0029e5815eb2dfe2bfc6b521#2
type: http://lodlaundromat.org/.well-known/genid/b1d777ae0029e5815eb2dfe2bfc6b521#7

member
range: Thing
domain: Thing
type: ObjectProperty
type: Property
range: http://lodlaundromat.org/.well-known/genid/87b3155a45f739091dc1b4f71dafba5d#6
range: http://lodlaundromat.org/.well-known/genid/87b3155a45f739091dc1b4f71dafba5d#2
range: http://lodlaundromat.org/.well-known/genid/87b3155a45f739091dc1b4f71dafba5d#1
range: http://lodlaundromat.org/.well-known/genid/b1d777ae0029e5815eb2dfe2bfc6b521#2
range: Resource
range: http://lodlaundromat.org/.well-known/genid/b1d777ae0029e5815eb2dfe2bfc6b521#7
range: http://lodlaundromat.org/.well-known/genid/87b3155a45f739091dc1b4f71dafba5d#14
domain: http://lodlaundromat.org/.well-known/genid/87b3155a45f739091dc1b4f71dafba5d#1
domain: http://lodlaundromat.org/.well-known/genid/87b3155a45f739091dc1b4f71dafba5d#2
domain: http://lodlaundromat.org/.well-known/genid/b1d777ae0029e5815eb2dfe2bfc6b521#7
domain: Resource
domain: http://lodlaundromat.org/.well-known/genid/b1d777ae0029e5815eb2dfe2bfc6b521#2
domain: http://lodlaundromat.org/.well-known/genid/87b3155a45f739091dc1b4f71dafba5d#14
domain: http://lodlaundromat.org/.well-known/genid/87b3155a45f739091dc1b4f71dafba5d#6

constraint
sub property of: command
type: Property
sub property of: query
domain: Class
comment: Links a class with constraints on its instances. The values of this property are "axioms" expressed as CONSTRUCT or ASK queries where the variable ?this refers to the instances of the surrounding class. ASK queries must evaluate to false for each member of this class - returning true means that the instance ?this violates the constraint. CONSTRUCT queries must create instances of spin:ConstraintViolation to provide details on the reason for the violation.
range: Command
range: Resource
range: Query
domain: Resource

clause
range: Thing
domain: Thing
type: ObjectProperty
type: Property
range: http://lodlaundromat.org/.well-known/genid/87b3155a45f739091dc1b4f71dafba5d#6
range: http://lodlaundromat.org/.well-known/genid/87b3155a45f739091dc1b4f71dafba5d#2
range: http://lodlaundromat.org/.well-known/genid/87b3155a45f739091dc1b4f71dafba5d#1
range: http://lodlaundromat.org/.well-known/genid/b1d777ae0029e5815eb2dfe2bfc6b521#2
range: Resource
range: http://lodlaundromat.org/.well-known/genid/b1d777ae0029e5815eb2dfe2bfc6b521#7
range: http://lodlaundromat.org/.well-known/genid/87b3155a45f739091dc1b4f71dafba5d#14
domain: http://lodlaundromat.org/.well-known/genid/87b3155a45f739091dc1b4f71dafba5d#1
domain: http://lodlaundromat.org/.well-known/genid/87b3155a45f739091dc1b4f71dafba5d#2
domain: http://lodlaundromat.org/.well-known/genid/b1d777ae0029e5815eb2dfe2bfc6b521#7
domain: Resource
domain: http://lodlaundromat.org/.well-known/genid/b1d777ae0029e5815eb2dfe2bfc6b521#2
domain: http://lodlaundromat.org/.well-known/genid/87b3155a45f739091dc1b4f71dafba5d#14
domain: http://lodlaundromat.org/.well-known/genid/87b3155a45f739091dc1b4f71dafba5d#6

attributed source
range: Thing
domain: Thing
type: Property
type: ObjectProperty
range: http://lodlaundromat.org/.well-known/genid/87b3155a45f739091dc1b4f71dafba5d#6
range: http://lodlaundromat.org/.well-known/genid/87b3155a45f739091dc1b4f71dafba5d#2
range: http://lodlaundromat.org/.well-known/genid/87b3155a45f739091dc1b4f71dafba5d#1
range: http://lodlaundromat.org/.well-known/genid/b1d777ae0029e5815eb2dfe2bfc6b521#2
range: Resource
range: http://lodlaundromat.org/.well-known/genid/b1d777ae0029e5815eb2dfe2bfc6b521#7
range: http://lodlaundromat.org/.well-known/genid/87b3155a45f739091dc1b4f71dafba5d#14
domain: http://lodlaundromat.org/.well-known/genid/87b3155a45f739091dc1b4f71dafba5d#1
domain: http://lodlaundromat.org/.well-known/genid/87b3155a45f739091dc1b4f71dafba5d#2
domain: http://lodlaundromat.org/.well-known/genid/b1d777ae0029e5815eb2dfe2bfc6b521#7
domain: Resource
domain: http://lodlaundromat.org/.well-known/genid/b1d777ae0029e5815eb2dfe2bfc6b521#2
domain: http://lodlaundromat.org/.well-known/genid/87b3155a45f739091dc1b4f71dafba5d#14
domain: http://lodlaundromat.org/.well-known/genid/87b3155a45f739091dc1b4f71dafba5d#6

Rule
subclass of: Resource
type: Class
subclass of: Command
comment: Groups together the kinds of SPARQL commands that can appear as SPIN rules and constructors: CONSTRUCT, DELETE WHERE and DELETE/INSERT. This class is never to be instantiated directly.

has license
equivalent property: license
equivalent property: has license
sub property of: license
sub property of: has license
type: Thing
range: Thing
domain: Thing
type: Property
range: License
domain: Work
type: ObjectProperty
domain: http://lodlaundromat.org/.well-known/genid/87b3155a45f739091dc1b4f71dafba5d#6
domain: http://lodlaundromat.org/.well-known/genid/87b3155a45f739091dc1b4f71dafba5d#1
domain: http://lodlaundromat.org/.well-known/genid/b1d777ae0029e5815eb2dfe2bfc6b521#7
domain: http://lodlaundromat.org/.well-known/genid/87b3155a45f739091dc1b4f71dafba5d#2
domain: http://lodlaundromat.org/.well-known/genid/87b3155a45f739091dc1b4f71dafba5d#14
domain: http://lodlaundromat.org/.well-known/genid/b1d777ae0029e5815eb2dfe2bfc6b521#2
domain: Resource
range: http://lodlaundromat.org/.well-known/genid/87b3155a45f739091dc1b4f71dafba5d#6
range: http://lodlaundromat.org/.well-known/genid/87b3155a45f739091dc1b4f71dafba5d#1
range: http://lodlaundromat.org/.well-known/genid/b1d777ae0029e5815eb2dfe2bfc6b521#7
range: http://lodlaundromat.org/.well-known/genid/87b3155a45f739091dc1b4f71dafba5d#2
range: http://lodlaundromat.org/.well-known/genid/87b3155a45f739091dc1b4f71dafba5d#14
range: http://lodlaundromat.org/.well-known/genid/b1d777ae0029e5815eb2dfe2bfc6b521#2
range: Resource
range: http://lodlaundromat.org/.well-known/genid/b1d777ae0029e5815eb2dfe2bfc6b521#1
range: LicenseDocument
range: http://lodlaundromat.org/.well-known/genid/87b3155a45f739091dc1b4f71dafba5d#11
type: http://lodlaundromat.org/.well-known/genid/b1d777ae0029e5815eb2dfe2bfc6b521#7
type: http://lodlaundromat.org/.well-known/genid/87b3155a45f739091dc1b4f71dafba5d#2
type: http://lodlaundromat.org/.well-known/genid/87b3155a45f739091dc1b4f71dafba5d#1
type: http://lodlaundromat.org/.well-known/genid/87b3155a45f739091dc1b4f71dafba5d#6
type: http://lodlaundromat.org/.well-known/genid/87b3155a45f739091dc1b4f71dafba5d#14
type: http://lodlaundromat.org/.well-known/genid/b1d777ae0029e5815eb2dfe2bfc6b521#2

http://lodlaundromat.org/.well-known/genid/87b3155a45f739091dc1b4f71dafba5d#12
type: Class
subclass of: Thing
subclass of: Resource
type: Restriction
max cardinality: 1
on property: has license
subclass of: http://lodlaundromat.org/.well-known/genid/87b3155a45f739091dc1b4f71dafba5d#1
subclass of: http://lodlaundromat.org/.well-known/genid/b1d777ae0029e5815eb2dfe2bfc6b521#7
subclass of: http://lodlaundromat.org/.well-known/genid/87b3155a45f739091dc1b4f71dafba5d#6
subclass of: http://lodlaundromat.org/.well-known/genid/87b3155a45f739091dc1b4f71dafba5d#14
subclass of: http://lodlaundromat.org/.well-known/genid/b1d777ae0029e5815eb2dfe2bfc6b521#2
subclass of: http://lodlaundromat.org/.well-known/genid/87b3155a45f739091dc1b4f71dafba5d#2
subclass of: http://lodlaundromat.org/.well-known/genid/b1d777ae0029e5815eb2dfe2bfc6b521#6
equivalent class: http://lodlaundromat.org/.well-known/genid/b1d777ae0029e5815eb2dfe2bfc6b521#6

Library ontology
subclass of: Resource
type: Class
subclass of: Ontology
comment: A marker class that can be attached to base URIs (ontologies) to instruct SPIN engines that this ontology only contains a library of SPIN declarations. Library Ontologies should be ignored by SPIN inference engines even if they have been imported by a domain model. For example, a SPIN version of OWL RL may contain all the OWL RL axioms, attached to owl:Thing, but nothing else. However, when executed, these axioms should not be executed over themselves, because we don't want the system to reason about the SPIN triples to speed up things.

Constraint violation level
type: Class
subclass of: Resource
comment: The type of the supported levels of constraint violations, including spin:Error and spin:Warning.

Political system
subclass of: Resource
type: Class
subclass of: Thing
subclass of: http://lodlaundromat.org/.well-known/genid/87b3155a45f739091dc1b4f71dafba5d#2
subclass of: http://lodlaundromat.org/.well-known/genid/87b3155a45f739091dc1b4f71dafba5d#6
subclass of: http://lodlaundromat.org/.well-known/genid/87b3155a45f739091dc1b4f71dafba5d#14
subclass of: http://lodlaundromat.org/.well-known/genid/b1d777ae0029e5815eb2dfe2bfc6b521#7
subclass of: http://lodlaundromat.org/.well-known/genid/b1d777ae0029e5815eb2dfe2bfc6b521#2
subclass of: http://lodlaundromat.org/.well-known/genid/87b3155a45f739091dc1b4f71dafba5d#1

point of contact
range: Thing
domain: Thing
type: ObjectProperty
type: Property
type: DatatypeProperty
range: string
range: Resource
range: http://lodlaundromat.org/.well-known/genid/87b3155a45f739091dc1b4f71dafba5d#6
range: http://lodlaundromat.org/.well-known/genid/87b3155a45f739091dc1b4f71dafba5d#2
range: http://lodlaundromat.org/.well-known/genid/87b3155a45f739091dc1b4f71dafba5d#1
range: http://lodlaundromat.org/.well-known/genid/b1d777ae0029e5815eb2dfe2bfc6b521#2
range: http://lodlaundromat.org/.well-known/genid/b1d777ae0029e5815eb2dfe2bfc6b521#7
range: http://lodlaundromat.org/.well-known/genid/87b3155a45f739091dc1b4f71dafba5d#14
domain: http://lodlaundromat.org/.well-known/genid/87b3155a45f739091dc1b4f71dafba5d#1
domain: http://lodlaundromat.org/.well-known/genid/87b3155a45f739091dc1b4f71dafba5d#2
domain: http://lodlaundromat.org/.well-known/genid/b1d777ae0029e5815eb2dfe2bfc6b521#7
domain: Resource
domain: http://lodlaundromat.org/.well-known/genid/b1d777ae0029e5815eb2dfe2bfc6b521#2
domain: http://lodlaundromat.org/.well-known/genid/87b3155a45f739091dc1b4f71dafba5d#14
domain: http://lodlaundromat.org/.well-known/genid/87b3155a45f739091dc1b4f71dafba5d#6

format
range: Thing
domain: Thing
type: ObjectProperty
type: Property
range: http://lodlaundromat.org/.well-known/genid/87b3155a45f739091dc1b4f71dafba5d#6
range: http://lodlaundromat.org/.well-known/genid/87b3155a45f739091dc1b4f71dafba5d#2
range: http://lodlaundromat.org/.well-known/genid/87b3155a45f739091dc1b4f71dafba5d#1
range: http://lodlaundromat.org/.well-known/genid/b1d777ae0029e5815eb2dfe2bfc6b521#2
range: Resource
range: http://lodlaundromat.org/.well-known/genid/b1d777ae0029e5815eb2dfe2bfc6b521#7
range: http://lodlaundromat.org/.well-known/genid/87b3155a45f739091dc1b4f71dafba5d#14
domain: http://lodlaundromat.org/.well-known/genid/87b3155a45f739091dc1b4f71dafba5d#1
domain: http://lodlaundromat.org/.well-known/genid/87b3155a45f739091dc1b4f71dafba5d#2
domain: http://lodlaundromat.org/.well-known/genid/b1d777ae0029e5815eb2dfe2bfc6b521#7
domain: Resource
domain: http://lodlaundromat.org/.well-known/genid/b1d777ae0029e5815eb2dfe2bfc6b521#2
domain: http://lodlaundromat.org/.well-known/genid/87b3155a45f739091dc1b4f71dafba5d#14
domain: http://lodlaundromat.org/.well-known/genid/87b3155a45f739091dc1b4f71dafba5d#6

jurisdiction
range: Thing
domain: Thing
type: Property
domain: License
range: Jurisdiction
type: ObjectProperty
range: http://lodlaundromat.org/.well-known/genid/87b3155a45f739091dc1b4f71dafba5d#6
range: http://lodlaundromat.org/.well-known/genid/87b3155a45f739091dc1b4f71dafba5d#2
range: http://lodlaundromat.org/.well-known/genid/87b3155a45f739091dc1b4f71dafba5d#1
range: http://lodlaundromat.org/.well-known/genid/b1d777ae0029e5815eb2dfe2bfc6b521#2
range: Resource
range: http://lodlaundromat.org/.well-known/genid/b1d777ae0029e5815eb2dfe2bfc6b521#7
range: http://lodlaundromat.org/.well-known/genid/87b3155a45f739091dc1b4f71dafba5d#14
domain: http://lodlaundromat.org/.well-known/genid/87b3155a45f739091dc1b4f71dafba5d#1
domain: http://lodlaundromat.org/.well-known/genid/87b3155a45f739091dc1b4f71dafba5d#2
domain: http://lodlaundromat.org/.well-known/genid/b1d777ae0029e5815eb2dfe2bfc6b521#7
domain: Resource
domain: http://lodlaundromat.org/.well-known/genid/b1d777ae0029e5815eb2dfe2bfc6b521#2
domain: http://lodlaundromat.org/.well-known/genid/87b3155a45f739091dc1b4f71dafba5d#14
domain: http://lodlaundromat.org/.well-known/genid/87b3155a45f739091dc1b4f71dafba5d#6
domain: http://lodlaundromat.org/.well-known/genid/87b3155a45f739091dc1b4f71dafba5d#11
domain: http://lodlaundromat.org/.well-known/genid/b1d777ae0029e5815eb2dfe2bfc6b521#1
domain: LicenseDocument

http://lodlaundromat.org/.well-known/genid/b1d777ae0029e5815eb2dfe2bfc6b521#3
type: Class
subclass of: Thing
subclass of: Resource
type: Restriction
on property: attributionURL
max cardinality: 1
subclass of: http://lodlaundromat.org/.well-known/genid/b1d777ae0029e5815eb2dfe2bfc6b521#2
subclass of: http://lodlaundromat.org/.well-known/genid/87b3155a45f739091dc1b4f71dafba5d#2
subclass of: http://lodlaundromat.org/.well-known/genid/87b3155a45f739091dc1b4f71dafba5d#6
subclass of: http://lodlaundromat.org/.well-known/genid/87b3155a45f739091dc1b4f71dafba5d#1
subclass of: http://lodlaundromat.org/.well-known/genid/87b3155a45f739091dc1b4f71dafba5d#14
subclass of: http://lodlaundromat.org/.well-known/genid/b1d777ae0029e5815eb2dfe2bfc6b521#7
subclass of: http://lodlaundromat.org/.well-known/genid/87b3155a45f739091dc1b4f71dafba5d#5
equivalent class: http://lodlaundromat.org/.well-known/genid/87b3155a45f739091dc1b4f71dafba5d#5

Category
subclass of: Resource
type: Class
subclass of: http://lodlaundromat.org/.well-known/genid/87b3155a45f739091dc1b4f71dafba5d#3
subclass of: Thing
subclass of: http://lodlaundromat.org/.well-known/genid/b1d777ae0029e5815eb2dfe2bfc6b521#7
subclass of: http://lodlaundromat.org/.well-known/genid/87b3155a45f739091dc1b4f71dafba5d#1
subclass of: http://lodlaundromat.org/.well-known/genid/87b3155a45f739091dc1b4f71dafba5d#2
subclass of: http://lodlaundromat.org/.well-known/genid/87b3155a45f739091dc1b4f71dafba5d#6
subclass of: http://lodlaundromat.org/.well-known/genid/87b3155a45f739091dc1b4f71dafba5d#14
subclass of: http://lodlaundromat.org/.well-known/genid/b1d777ae0029e5815eb2dfe2bfc6b521#2

Q2
type: Quarter
type: Thing
type: Period
type: http://lodlaundromat.org/.well-known/genid/87b3155a45f739091dc1b4f71dafba5d#14
type: http://lodlaundromat.org/.well-known/genid/87b3155a45f739091dc1b4f71dafba5d#6
type: http://lodlaundromat.org/.well-known/genid/87b3155a45f739091dc1b4f71dafba5d#2
type: http://lodlaundromat.org/.well-known/genid/87b3155a45f739091dc1b4f71dafba5d#1
type: http://lodlaundromat.org/.well-known/genid/b1d777ae0029e5815eb2dfe2bfc6b521#2
type: http://lodlaundromat.org/.well-known/genid/b1d777ae0029e5815eb2dfe2bfc6b521#7

Derivative Works
subclass of: DerivativeWorks
type: Permission
comment: distribution of derivative works
type: Thing
type: Class
type: http://lodlaundromat.org/.well-known/genid/87b3155a45f739091dc1b4f71dafba5d#14
type: http://lodlaundromat.org/.well-known/genid/87b3155a45f739091dc1b4f71dafba5d#6
type: http://lodlaundromat.org/.well-known/genid/87b3155a45f739091dc1b4f71dafba5d#2
type: http://lodlaundromat.org/.well-known/genid/87b3155a45f739091dc1b4f71dafba5d#1
type: http://lodlaundromat.org/.well-known/genid/b1d777ae0029e5815eb2dfe2bfc6b521#2
type: http://lodlaundromat.org/.well-known/genid/b1d777ae0029e5815eb2dfe2bfc6b521#7
equivalent class: DerivativeWorks

Requirement
subclass of: Resource
subclass of: Requirement
type: Class
comment: an action that may or may not be requested of you
equivalent class: Requirement

hashtag
range: Thing
domain: Thing
type: ObjectProperty
type: DatatypeProperty
range: string
type: Property
range: Resource
range: http://lodlaundromat.org/.well-known/genid/87b3155a45f739091dc1b4f71dafba5d#6
range: http://lodlaundromat.org/.well-known/genid/87b3155a45f739091dc1b4f71dafba5d#2
range: http://lodlaundromat.org/.well-known/genid/87b3155a45f739091dc1b4f71dafba5d#1
range: http://lodlaundromat.org/.well-known/genid/b1d777ae0029e5815eb2dfe2bfc6b521#2
range: http://lodlaundromat.org/.well-known/genid/b1d777ae0029e5815eb2dfe2bfc6b521#7
range: http://lodlaundromat.org/.well-known/genid/87b3155a45f739091dc1b4f71dafba5d#14
domain: http://lodlaundromat.org/.well-known/genid/87b3155a45f739091dc1b4f71dafba5d#1
domain: http://lodlaundromat.org/.well-known/genid/87b3155a45f739091dc1b4f71dafba5d#2
domain: http://lodlaundromat.org/.well-known/genid/b1d777ae0029e5815eb2dfe2bfc6b521#7
domain: Resource
domain: http://lodlaundromat.org/.well-known/genid/b1d777ae0029e5815eb2dfe2bfc6b521#2
domain: http://lodlaundromat.org/.well-known/genid/87b3155a45f739091dc1b4f71dafba5d#14
domain: http://lodlaundromat.org/.well-known/genid/87b3155a45f739091dc1b4f71dafba5d#6

Commercial Use
subclass of: CommercialUse
type: Prohibition
comment: exercising rights for commercial purposes
type: Class
equivalent class: CommercialUse

Module
subclass of: Resource
type: Class
subclass of: Class
comment: An abstract building block of a SPARQL system. A Module can take Arguments as input and applies them on an input RDF Graph. The Arguments should be declared as spin:constraints.

currency
range: Thing
domain: Thing
type: ObjectProperty
type: Property
range: http://lodlaundromat.org/.well-known/genid/87b3155a45f739091dc1b4f71dafba5d#6
range: http://lodlaundromat.org/.well-known/genid/87b3155a45f739091dc1b4f71dafba5d#2
range: http://lodlaundromat.org/.well-known/genid/87b3155a45f739091dc1b4f71dafba5d#1
range: http://lodlaundromat.org/.well-known/genid/b1d777ae0029e5815eb2dfe2bfc6b521#2
range: Resource
range: http://lodlaundromat.org/.well-known/genid/b1d777ae0029e5815eb2dfe2bfc6b521#7
range: http://lodlaundromat.org/.well-known/genid/87b3155a45f739091dc1b4f71dafba5d#14
domain: http://lodlaundromat.org/.well-known/genid/87b3155a45f739091dc1b4f71dafba5d#1
domain: http://lodlaundromat.org/.well-known/genid/87b3155a45f739091dc1b4f71dafba5d#2
domain: http://lodlaundromat.org/.well-known/genid/b1d777ae0029e5815eb2dfe2bfc6b521#7
domain: Resource
domain: http://lodlaundromat.org/.well-known/genid/b1d777ae0029e5815eb2dfe2bfc6b521#2
domain: http://lodlaundromat.org/.well-known/genid/87b3155a45f739091dc1b4f71dafba5d#14
domain: http://lodlaundromat.org/.well-known/genid/87b3155a45f739091dc1b4f71dafba5d#6

http://lodlaundromat.org/.well-known/genid/b1d777ae0029e5815eb2dfe2bfc6b521#6
subclass of: Resource
subclass of: Thing
type: Class
type: Restriction
on property: has license
max cardinality: 1
subclass of: http://lodlaundromat.org/.well-known/genid/b1d777ae0029e5815eb2dfe2bfc6b521#2
subclass of: http://lodlaundromat.org/.well-known/genid/87b3155a45f739091dc1b4f71dafba5d#1
subclass of: http://lodlaundromat.org/.well-known/genid/87b3155a45f739091dc1b4f71dafba5d#14
subclass of: http://lodlaundromat.org/.well-known/genid/87b3155a45f739091dc1b4f71dafba5d#6
subclass of: http://lodlaundromat.org/.well-known/genid/87b3155a45f739091dc1b4f71dafba5d#2
subclass of: http://lodlaundromat.org/.well-known/genid/b1d777ae0029e5815eb2dfe2bfc6b521#7
subclass of: http://lodlaundromat.org/.well-known/genid/87b3155a45f739091dc1b4f71dafba5d#12
equivalent class: http://lodlaundromat.org/.well-known/genid/87b3155a45f739091dc1b4f71dafba5d#12

http://lodlaundromat.org/.well-known/genid/87b3155a45f739091dc1b4f71dafba5d#4
subclass of: Resource
type: Class
subclass of: Thing
type: Restriction
cardinality: 1
on property: attributionName
subclass of: http://lodlaundromat.org/.well-known/genid/87b3155a45f739091dc1b4f71dafba5d#1
subclass of: http://lodlaundromat.org/.well-known/genid/87b3155a45f739091dc1b4f71dafba5d#14
subclass of: http://lodlaundromat.org/.well-known/genid/b1d777ae0029e5815eb2dfe2bfc6b521#7
subclass of: http://lodlaundromat.org/.well-known/genid/b1d777ae0029e5815eb2dfe2bfc6b521#2
subclass of: http://lodlaundromat.org/.well-known/genid/b1d777ae0029e5815eb2dfe2bfc6b521#4
subclass of: http://lodlaundromat.org/.well-known/genid/87b3155a45f739091dc1b4f71dafba5d#6
subclass of: http://lodlaundromat.org/.well-known/genid/87b3155a45f739091dc1b4f71dafba5d#2
equivalent class: http://lodlaundromat.org/.well-known/genid/b1d777ae0029e5815eb2dfe2bfc6b521#4

Reproduction
subclass of: Reproduction
type: Permission
comment: making multiple copies
type: Class
equivalent class: Reproduction

Distribution
subclass of: Distribution
type: Permission
comment: distribution, public display, and publicly performance
type: Thing
type: Class
type: http://lodlaundromat.org/.well-known/genid/87b3155a45f739091dc1b4f71dafba5d#14
type: http://lodlaundromat.org/.well-known/genid/87b3155a45f739091dc1b4f71dafba5d#6
type: http://lodlaundromat.org/.well-known/genid/87b3155a45f739091dc1b4f71dafba5d#2
type: http://lodlaundromat.org/.well-known/genid/87b3155a45f739091dc1b4f71dafba5d#1
type: http://lodlaundromat.org/.well-known/genid/b1d777ae0029e5815eb2dfe2bfc6b521#2
type: http://lodlaundromat.org/.well-known/genid/b1d777ae0029e5815eb2dfe2bfc6b521#7
equivalent class: Distribution

url
range: Thing
domain: Thing
type: ObjectProperty
type: DatatypeProperty
range: anyURI
type: Property
range: Resource
range: http://lodlaundromat.org/.well-known/genid/87b3155a45f739091dc1b4f71dafba5d#6
range: http://lodlaundromat.org/.well-known/genid/87b3155a45f739091dc1b4f71dafba5d#2
range: http://lodlaundromat.org/.well-known/genid/87b3155a45f739091dc1b4f71dafba5d#1
range: http://lodlaundromat.org/.well-known/genid/b1d777ae0029e5815eb2dfe2bfc6b521#2
range: http://lodlaundromat.org/.well-known/genid/b1d777ae0029e5815eb2dfe2bfc6b521#7
range: http://lodlaundromat.org/.well-known/genid/87b3155a45f739091dc1b4f71dafba5d#14
domain: http://lodlaundromat.org/.well-known/genid/87b3155a45f739091dc1b4f71dafba5d#1
domain: http://lodlaundromat.org/.well-known/genid/87b3155a45f739091dc1b4f71dafba5d#2
domain: http://lodlaundromat.org/.well-known/genid/b1d777ae0029e5815eb2dfe2bfc6b521#7
domain: Resource
domain: http://lodlaundromat.org/.well-known/genid/b1d777ae0029e5815eb2dfe2bfc6b521#2
domain: http://lodlaundromat.org/.well-known/genid/87b3155a45f739091dc1b4f71dafba5d#14
domain: http://lodlaundromat.org/.well-known/genid/87b3155a45f739091dc1b4f71dafba5d#6

prohibits
equivalent property: prohibits
sub property of: prohibits
range: Thing
domain: Thing
type: Property
domain: License
range: Prohibition
type: ObjectProperty
range: http://lodlaundromat.org/.well-known/genid/87b3155a45f739091dc1b4f71dafba5d#6
range: http://lodlaundromat.org/.well-known/genid/87b3155a45f739091dc1b4f71dafba5d#1
range: http://lodlaundromat.org/.well-known/genid/b1d777ae0029e5815eb2dfe2bfc6b521#7
range: http://lodlaundromat.org/.well-known/genid/87b3155a45f739091dc1b4f71dafba5d#2
range: http://lodlaundromat.org/.well-known/genid/87b3155a45f739091dc1b4f71dafba5d#14
range: http://lodlaundromat.org/.well-known/genid/b1d777ae0029e5815eb2dfe2bfc6b521#2
range: Resource
domain: http://lodlaundromat.org/.well-known/genid/87b3155a45f739091dc1b4f71dafba5d#6
domain: http://lodlaundromat.org/.well-known/genid/87b3155a45f739091dc1b4f71dafba5d#1
domain: http://lodlaundromat.org/.well-known/genid/b1d777ae0029e5815eb2dfe2bfc6b521#7
domain: http://lodlaundromat.org/.well-known/genid/87b3155a45f739091dc1b4f71dafba5d#2
domain: http://lodlaundromat.org/.well-known/genid/87b3155a45f739091dc1b4f71dafba5d#14
domain: http://lodlaundromat.org/.well-known/genid/b1d777ae0029e5815eb2dfe2bfc6b521#2
domain: Resource
domain: http://lodlaundromat.org/.well-known/genid/b1d777ae0029e5815eb2dfe2bfc6b521#1
domain: LicenseDocument
domain: http://lodlaundromat.org/.well-known/genid/87b3155a45f739091dc1b4f71dafba5d#11

section
range: Thing
domain: Thing
type: ObjectProperty
type: Property
range: http://lodlaundromat.org/.well-known/genid/87b3155a45f739091dc1b4f71dafba5d#6
range: http://lodlaundromat.org/.well-known/genid/87b3155a45f739091dc1b4f71dafba5d#2
range: http://lodlaundromat.org/.well-known/genid/87b3155a45f739091dc1b4f71dafba5d#1
range: http://lodlaundromat.org/.well-known/genid/b1d777ae0029e5815eb2dfe2bfc6b521#2
range: Resource
range: http://lodlaundromat.org/.well-known/genid/b1d777ae0029e5815eb2dfe2bfc6b521#7
range: http://lodlaundromat.org/.well-known/genid/87b3155a45f739091dc1b4f71dafba5d#14
domain: http://lodlaundromat.org/.well-known/genid/87b3155a45f739091dc1b4f71dafba5d#1
domain: http://lodlaundromat.org/.well-known/genid/87b3155a45f739091dc1b4f71dafba5d#2
domain: http://lodlaundromat.org/.well-known/genid/b1d777ae0029e5815eb2dfe2bfc6b521#7
domain: Resource
domain: http://lodlaundromat.org/.well-known/genid/b1d777ae0029e5815eb2dfe2bfc6b521#2
domain: http://lodlaundromat.org/.well-known/genid/87b3155a45f739091dc1b4f71dafba5d#14
domain: http://lodlaundromat.org/.well-known/genid/87b3155a45f739091dc1b4f71dafba5d#6

Attributed Source
subclass of: Resource
type: Class
comment: The name, url and other details of an attribution.
subclass of: http://lodlaundromat.org/.well-known/genid/87b3155a45f739091dc1b4f71dafba5d#4
subclass of: http://lodlaundromat.org/.well-known/genid/87b3155a45f739091dc1b4f71dafba5d#5
subclass of: http://lodlaundromat.org/.well-known/genid/87b3155a45f739091dc1b4f71dafba5d#6
subclass of: Thing
subclass of: http://lodlaundromat.org/.well-known/genid/b1d777ae0029e5815eb2dfe2bfc6b521#7
subclass of: http://lodlaundromat.org/.well-known/genid/87b3155a45f739091dc1b4f71dafba5d#14
subclass of: http://lodlaundromat.org/.well-known/genid/87b3155a45f739091dc1b4f71dafba5d#1
subclass of: http://lodlaundromat.org/.well-known/genid/87b3155a45f739091dc1b4f71dafba5d#2
subclass of: http://lodlaundromat.org/.well-known/genid/b1d777ae0029e5815eb2dfe2bfc6b521#2
subclass of: http://lodlaundromat.org/.well-known/genid/b1d777ae0029e5815eb2dfe2bfc6b521#4
subclass of: http://lodlaundromat.org/.well-known/genid/b1d777ae0029e5815eb2dfe2bfc6b521#3

sub category
type: Property
range: Thing
domain: Thing
type: ObjectProperty
range: http://lodlaundromat.org/.well-known/genid/87b3155a45f739091dc1b4f71dafba5d#6
range: http://lodlaundromat.org/.well-known/genid/87b3155a45f739091dc1b4f71dafba5d#2
range: http://lodlaundromat.org/.well-known/genid/87b3155a45f739091dc1b4f71dafba5d#1
range: http://lodlaundromat.org/.well-known/genid/b1d777ae0029e5815eb2dfe2bfc6b521#2
range: Resource
range: http://lodlaundromat.org/.well-known/genid/b1d777ae0029e5815eb2dfe2bfc6b521#7
range: http://lodlaundromat.org/.well-known/genid/87b3155a45f739091dc1b4f71dafba5d#14
domain: http://lodlaundromat.org/.well-known/genid/87b3155a45f739091dc1b4f71dafba5d#1
domain: http://lodlaundromat.org/.well-known/genid/87b3155a45f739091dc1b4f71dafba5d#2
domain: http://lodlaundromat.org/.well-known/genid/b1d777ae0029e5815eb2dfe2bfc6b521#7
domain: Resource
domain: http://lodlaundromat.org/.well-known/genid/b1d777ae0029e5815eb2dfe2bfc6b521#2
domain: http://lodlaundromat.org/.well-known/genid/87b3155a45f739091dc1b4f71dafba5d#14
domain: http://lodlaundromat.org/.well-known/genid/87b3155a45f739091dc1b4f71dafba5d#6

permits
equivalent property: permits
sub property of: permits
range: Thing
domain: Thing
type: Property
domain: License
range: Permission
type: ObjectProperty
range: http://lodlaundromat.org/.well-known/genid/87b3155a45f739091dc1b4f71dafba5d#6
range: http://lodlaundromat.org/.well-known/genid/87b3155a45f739091dc1b4f71dafba5d#1
range: http://lodlaundromat.org/.well-known/genid/b1d777ae0029e5815eb2dfe2bfc6b521#7
range: http://lodlaundromat.org/.well-known/genid/87b3155a45f739091dc1b4f71dafba5d#2
range: http://lodlaundromat.org/.well-known/genid/87b3155a45f739091dc1b4f71dafba5d#14
range: http://lodlaundromat.org/.well-known/genid/b1d777ae0029e5815eb2dfe2bfc6b521#2
range: Resource
domain: http://lodlaundromat.org/.well-known/genid/87b3155a45f739091dc1b4f71dafba5d#6
domain: http://lodlaundromat.org/.well-known/genid/87b3155a45f739091dc1b4f71dafba5d#1
domain: http://lodlaundromat.org/.well-known/genid/b1d777ae0029e5815eb2dfe2bfc6b521#7
domain: http://lodlaundromat.org/.well-known/genid/87b3155a45f739091dc1b4f71dafba5d#2
domain: http://lodlaundromat.org/.well-known/genid/87b3155a45f739091dc1b4f71dafba5d#14
domain: http://lodlaundromat.org/.well-known/genid/b1d777ae0029e5815eb2dfe2bfc6b521#2
domain: Resource
domain: http://lodlaundromat.org/.well-known/genid/b1d777ae0029e5815eb2dfe2bfc6b521#1
domain: LicenseDocument
domain: http://lodlaundromat.org/.well-known/genid/87b3155a45f739091dc1b4f71dafba5d#11

Share Alike
subclass of: ShareAlike
type: Requirement
comment: derivative works be licensed under the same terms or compatible terms as the original work
type: Thing
type: Class
type: http://lodlaundromat.org/.well-known/genid/87b3155a45f739091dc1b4f71dafba5d#14
type: http://lodlaundromat.org/.well-known/genid/87b3155a45f739091dc1b4f71dafba5d#6
type: http://lodlaundromat.org/.well-known/genid/87b3155a45f739091dc1b4f71dafba5d#2
type: http://lodlaundromat.org/.well-known/genid/87b3155a45f739091dc1b4f71dafba5d#1
type: http://lodlaundromat.org/.well-known/genid/b1d777ae0029e5815eb2dfe2bfc6b521#2
type: http://lodlaundromat.org/.well-known/genid/b1d777ae0029e5815eb2dfe2bfc6b521#7
equivalent class: ShareAlike

http://lodlaundromat.org/.well-known/genid/b1d777ae0029e5815eb2dfe2bfc6b521#1
type: Class
subclass of: Thing
subclass of: Resource
type: Restriction
on property: image
max cardinality: 1
subclass of: http://lodlaundromat.org/.well-known/genid/87b3155a45f739091dc1b4f71dafba5d#6
subclass of: http://lodlaundromat.org/.well-known/genid/b1d777ae0029e5815eb2dfe2bfc6b521#7
subclass of: http://lodlaundromat.org/.well-known/genid/87b3155a45f739091dc1b4f71dafba5d#14
subclass of: http://lodlaundromat.org/.well-known/genid/87b3155a45f739091dc1b4f71dafba5d#2
subclass of: http://lodlaundromat.org/.well-known/genid/b1d777ae0029e5815eb2dfe2bfc6b521#2
subclass of: http://lodlaundromat.org/.well-known/genid/87b3155a45f739091dc1b4f71dafba5d#11
subclass of: http://lodlaundromat.org/.well-known/genid/87b3155a45f739091dc1b4f71dafba5d#1
equivalent class: http://lodlaundromat.org/.well-known/genid/87b3155a45f739091dc1b4f71dafba5d#11

Permission
subclass of: Permission
subclass of: Resource
type: Class
comment: an action that may or may not be allowed or desired
equivalent class: Permission

Data Format
type: Class
subclass of: Thing
subclass of: Resource
subclass of: Category
subclass of: http://lodlaundromat.org/.well-known/genid/b1d777ae0029e5815eb2dfe2bfc6b521#7
subclass of: http://lodlaundromat.org/.well-known/genid/87b3155a45f739091dc1b4f71dafba5d#14
subclass of: http://lodlaundromat.org/.well-known/genid/87b3155a45f739091dc1b4f71dafba5d#2
subclass of: http://lodlaundromat.org/.well-known/genid/87b3155a45f739091dc1b4f71dafba5d#1
subclass of: http://lodlaundromat.org/.well-known/genid/b1d777ae0029e5815eb2dfe2bfc6b521#2
subclass of: http://lodlaundromat.org/.well-known/genid/87b3155a45f739091dc1b4f71dafba5d#6
subclass of: http://lodlaundromat.org/.well-known/genid/87b3155a45f739091dc1b4f71dafba5d#3

Notice
subclass of: Notice
type: Requirement
comment: copyright and license notices be kept intact
type: Class
equivalent class: Notice

Construct template
subclass of: Resource
type: Class
subclass of: Template
constraint: http://lodlaundromat.org/.well-known/genid/9fb05f53ba0c66117a615cb1cd805aaa#2
query: http://lodlaundromat.org/.well-known/genid/9fb05f53ba0c66117a615cb1cd805aaa#2
command: http://lodlaundromat.org/.well-known/genid/9fb05f53ba0c66117a615cb1cd805aaa#2

Attributed Source
type: Class
subclass of: Resource
subclass of: http://lodlaundromat.org/.well-known/genid/b1d777ae0029e5815eb2dfe2bfc6b521#2
subclass of: http://lodlaundromat.org/.well-known/genid/b1d777ae0029e5815eb2dfe2bfc6b521#3
subclass of: http://lodlaundromat.org/.well-known/genid/b1d777ae0029e5815eb2dfe2bfc6b521#4
subclass of: Thing
comment: The name, url and other details of an attribution.
subclass of: http://lodlaundromat.org/.well-known/genid/87b3155a45f739091dc1b4f71dafba5d#14
subclass of: http://lodlaundromat.org/.well-known/genid/87b3155a45f739091dc1b4f71dafba5d#1
subclass of: http://lodlaundromat.org/.well-known/genid/87b3155a45f739091dc1b4f71dafba5d#2
subclass of: http://lodlaundromat.org/.well-known/genid/b1d777ae0029e5815eb2dfe2bfc6b521#7
subclass of: http://lodlaundromat.org/.well-known/genid/87b3155a45f739091dc1b4f71dafba5d#6
subclass of: http://lodlaundromat.org/.well-known/genid/87b3155a45f739091dc1b4f71dafba5d#5
subclass of: http://lodlaundromat.org/.well-known/genid/87b3155a45f739091dc1b4f71dafba5d#4

Select template
subclass of: Resource
type: Class
subclass of: Template
subclass of: Table data provider
comment: A SPIN template that wraps a SELECT query.
constraint: http://lodlaundromat.org/.well-known/genid/9fb05f53ba0c66117a615cb1cd805aaa#6
query: http://lodlaundromat.org/.well-known/genid/9fb05f53ba0c66117a615cb1cd805aaa#6
command: http://lodlaundromat.org/.well-known/genid/9fb05f53ba0c66117a615cb1cd805aaa#6

Quarter
type: Class
subclass of: Resource
subclass of: Thing
subclass of: Period
one of: http://lodlaundromat.org/.well-known/genid/87b3155a45f739091dc1b4f71dafba5d#7
subclass of: http://lodlaundromat.org/.well-known/genid/87b3155a45f739091dc1b4f71dafba5d#2
subclass of: http://lodlaundromat.org/.well-known/genid/87b3155a45f739091dc1b4f71dafba5d#14
subclass of: http://lodlaundromat.org/.well-known/genid/b1d777ae0029e5815eb2dfe2bfc6b521#2
subclass of: http://lodlaundromat.org/.well-known/genid/87b3155a45f739091dc1b4f71dafba5d#6
subclass of: http://lodlaundromat.org/.well-known/genid/b1d777ae0029e5815eb2dfe2bfc6b521#7
subclass of: http://lodlaundromat.org/.well-known/genid/87b3155a45f739091dc1b4f71dafba5d#1

point of contact
range: Thing
domain: Thing
type: ObjectProperty
type: Property
type: DatatypeProperty
range: string
range: Resource
range: http://lodlaundromat.org/.well-known/genid/87b3155a45f739091dc1b4f71dafba5d#6
range: http://lodlaundromat.org/.well-known/genid/87b3155a45f739091dc1b4f71dafba5d#2
range: http://lodlaundromat.org/.well-known/genid/87b3155a45f739091dc1b4f71dafba5d#1
range: http://lodlaundromat.org/.well-known/genid/b1d777ae0029e5815eb2dfe2bfc6b521#2
range: http://lodlaundromat.org/.well-known/genid/b1d777ae0029e5815eb2dfe2bfc6b521#7
range: http://lodlaundromat.org/.well-known/genid/87b3155a45f739091dc1b4f71dafba5d#14
domain: http://lodlaundromat.org/.well-known/genid/87b3155a45f739091dc1b4f71dafba5d#1
domain: http://lodlaundromat.org/.well-known/genid/87b3155a45f739091dc1b4f71dafba5d#2
domain: http://lodlaundromat.org/.well-known/genid/b1d777ae0029e5815eb2dfe2bfc6b521#7
domain: Resource
domain: http://lodlaundromat.org/.well-known/genid/b1d777ae0029e5815eb2dfe2bfc6b521#2
domain: http://lodlaundromat.org/.well-known/genid/87b3155a45f739091dc1b4f71dafba5d#14
domain: http://lodlaundromat.org/.well-known/genid/87b3155a45f739091dc1b4f71dafba5d#6

http://lodlaundromat.org/.well-known/genid/b1d777ae0029e5815eb2dfe2bfc6b521#4
subclass of: Thing
type: Class
subclass of: Resource
type: Restriction
on property: attributionName
cardinality: 1
subclass of: http://lodlaundromat.org/.well-known/genid/87b3155a45f739091dc1b4f71dafba5d#14
subclass of: http://lodlaundromat.org/.well-known/genid/b1d777ae0029e5815eb2dfe2bfc6b521#7
subclass of: http://lodlaundromat.org/.well-known/genid/87b3155a45f739091dc1b4f71dafba5d#1
subclass of: http://lodlaundromat.org/.well-known/genid/b1d777ae0029e5815eb2dfe2bfc6b521#2
subclass of: http://lodlaundromat.org/.well-known/genid/87b3155a45f739091dc1b4f71dafba5d#6
subclass of: http://lodlaundromat.org/.well-known/genid/87b3155a45f739091dc1b4f71dafba5d#2
subclass of: http://lodlaundromat.org/.well-known/genid/87b3155a45f739091dc1b4f71dafba5d#4
equivalent class: http://lodlaundromat.org/.well-known/genid/87b3155a45f739091dc1b4f71dafba5d#4

Modules
type: Class
subclass of: Resource
comment: An "artificial" parent class for all Functions and Templates.
constructor: http://lodlaundromat.org/.well-known/genid/9fb05f53ba0c66117a615cb1cd805aaa#5
command: http://lodlaundromat.org/.well-known/genid/9fb05f53ba0c66117a615cb1cd805aaa#5

Q3
type: Quarter
type: Thing
type: Period
type: http://lodlaundromat.org/.well-known/genid/87b3155a45f739091dc1b4f71dafba5d#14
type: http://lodlaundromat.org/.well-known/genid/87b3155a45f739091dc1b4f71dafba5d#6
type: http://lodlaundromat.org/.well-known/genid/87b3155a45f739091dc1b4f71dafba5d#2
type: http://lodlaundromat.org/.well-known/genid/87b3155a45f739091dc1b4f71dafba5d#1
type: http://lodlaundromat.org/.well-known/genid/b1d777ae0029e5815eb2dfe2bfc6b521#2
type: http://lodlaundromat.org/.well-known/genid/b1d777ae0029e5815eb2dfe2bfc6b521#7

Column
type: Class
subclass of: Resource
comment: Provides metadata about a column in the result set of a (SPARQL) query, for example of the body queries of SPIN templates. Columns can define human-readable labels that serve as column titles, using rdfs:label.

Entity
subclass of: Resource
type: Class
subclass of: http://lodlaundromat.org/.well-known/genid/87b3155a45f739091dc1b4f71dafba5d#1
subclass of: http://lodlaundromat.org/.well-known/genid/87b3155a45f739091dc1b4f71dafba5d#2
subclass of: Thing
subclass of: http://lodlaundromat.org/.well-known/genid/87b3155a45f739091dc1b4f71dafba5d#6
subclass of: http://lodlaundromat.org/.well-known/genid/b1d777ae0029e5815eb2dfe2bfc6b521#7
subclass of: http://lodlaundromat.org/.well-known/genid/b1d777ae0029e5815eb2dfe2bfc6b521#2
subclass of: http://lodlaundromat.org/.well-known/genid/87b3155a45f739091dc1b4f71dafba5d#14

Function
subclass of: Resource
type: Class
subclass of: Module
comment: Metaclass for functions that can be used in SPARQL expressions (e.g. FILTER or BIND). The function themselves are classes that are instances of this metaclass. Function calls are instances of the function classes, with property values for the arguments.
constraint: http://lodlaundromat.org/.well-known/genid/9fb05f53ba0c66117a615cb1cd805aaa#1
query: http://lodlaundromat.org/.well-known/genid/9fb05f53ba0c66117a615cb1cd805aaa#1
command: http://lodlaundromat.org/.well-known/genid/9fb05f53ba0c66117a615cb1cd805aaa#1

http://lodlaundromat.org/.well-known/genid/87b3155a45f739091dc1b4f71dafba5d#11
subclass of: Thing
subclass of: Resource
type: Class
type: Restriction
max cardinality: 1
on property: image
subclass of: http://lodlaundromat.org/.well-known/genid/87b3155a45f739091dc1b4f71dafba5d#1
subclass of: http://lodlaundromat.org/.well-known/genid/87b3155a45f739091dc1b4f71dafba5d#6
subclass of: http://lodlaundromat.org/.well-known/genid/87b3155a45f739091dc1b4f71dafba5d#14
subclass of: http://lodlaundromat.org/.well-known/genid/b1d777ae0029e5815eb2dfe2bfc6b521#2
subclass of: http://lodlaundromat.org/.well-known/genid/b1d777ae0029e5815eb2dfe2bfc6b521#7
subclass of: http://lodlaundromat.org/.well-known/genid/87b3155a45f739091dc1b4f71dafba5d#2
subclass of: http://lodlaundromat.org/.well-known/genid/b1d777ae0029e5815eb2dfe2bfc6b521#1
equivalent class: http://lodlaundromat.org/.well-known/genid/b1d777ae0029e5815eb2dfe2bfc6b521#1

http://lodlaundromat.org/.well-known/genid/87b3155a45f739091dc1b4f71dafba5d#5
subclass of: Resource
type: Class
subclass of: Thing
type: Restriction
max cardinality: 1
on property: attributionURL
subclass of: http://lodlaundromat.org/.well-known/genid/b1d777ae0029e5815eb2dfe2bfc6b521#7
subclass of: http://lodlaundromat.org/.well-known/genid/b1d777ae0029e5815eb2dfe2bfc6b521#2
subclass of: http://lodlaundromat.org/.well-known/genid/87b3155a45f739091dc1b4f71dafba5d#2
subclass of: http://lodlaundromat.org/.well-known/genid/87b3155a45f739091dc1b4f71dafba5d#1
subclass of: http://lodlaundromat.org/.well-known/genid/87b3155a45f739091dc1b4f71dafba5d#14
subclass of: http://lodlaundromat.org/.well-known/genid/87b3155a45f739091dc1b4f71dafba5d#6
subclass of: http://lodlaundromat.org/.well-known/genid/b1d777ae0029e5815eb2dfe2bfc6b521#3
equivalent class: http://lodlaundromat.org/.well-known/genid/b1d777ae0029e5815eb2dfe2bfc6b521#3

Jurisdiction
subclass of: Resource
type: Class
comment: the legal jurisdiction of a license

person
range: Thing
domain: Thing
type: ObjectProperty
type: Property
range: http://lodlaundromat.org/.well-known/genid/87b3155a45f739091dc1b4f71dafba5d#6
range: http://lodlaundromat.org/.well-known/genid/87b3155a45f739091dc1b4f71dafba5d#2
range: http://lodlaundromat.org/.well-known/genid/87b3155a45f739091dc1b4f71dafba5d#1
range: http://lodlaundromat.org/.well-known/genid/b1d777ae0029e5815eb2dfe2bfc6b521#2
range: Resource
range: http://lodlaundromat.org/.well-known/genid/b1d777ae0029e5815eb2dfe2bfc6b521#7
range: http://lodlaundromat.org/.well-known/genid/87b3155a45f739091dc1b4f71dafba5d#14
domain: http://lodlaundromat.org/.well-known/genid/87b3155a45f739091dc1b4f71dafba5d#1
domain: http://lodlaundromat.org/.well-known/genid/87b3155a45f739091dc1b4f71dafba5d#2
domain: http://lodlaundromat.org/.well-known/genid/b1d777ae0029e5815eb2dfe2bfc6b521#7
domain: Resource
domain: http://lodlaundromat.org/.well-known/genid/b1d777ae0029e5815eb2dfe2bfc6b521#2
domain: http://lodlaundromat.org/.well-known/genid/87b3155a45f739091dc1b4f71dafba5d#14
domain: http://lodlaundromat.org/.well-known/genid/87b3155a45f739091dc1b4f71dafba5d#6

Magic property
subclass of: Resource
type: Class
subclass of: Property
subclass of: Function

Error
type: Constraint violation level
comment: Indicates that the associated constraint violation is an error that should be fixed.

Lesser Copyleft
type: Requirement
comment: derivative works must be licensed under specified terms, with at least the same conditions as the original work; combinations with the work may be licensed under different terms

short title
type: DatatypeProperty
range: string
type: Property
range: Resource

Publisher
description: Examples of a Publisher include a person, an organization, or a service. Typically, the name of a Publisher should be used to indicate the entity.
has version: publisher-006
issued: 1999-07-02
modified: 2008-01-14
type: Property
comment: An entity responsible for making the resource available.
note: A second property with the same name as this property has been declared in the dcterms: namespace (http://purl.org/dc/terms/). See the Introduction to the document "DCMI Metadata Terms" (http://dublincore.org/documents/dcmi-terms/) for an explanation.

abstract
type: Property
sub property of: system property
range: boolean
domain: Module
comment: Can be set to true to indicate that this module shall not be instantiated. Abstract modules are only there to organize other modules into hierarchies.
range: Resource
domain: Resource
domain: Class

Fatal
type: Constraint violation level
comment: Indicates that the associated constraint violation is a severe error that must be fixed. Constraint checking engines may decide to stop further evaluation once a fatal error has been detected.

http://lodlaundromat.org/.well-known/genid/9fb05f53ba0c66117a615cb1cd805aaa#7
type: Attribute
comment: the body of the Template
predicate: body
min count: 0
max count: 1
type: Query
type: Command

Coverage
description: Spatial topic and spatial applicability may be a named place or a location specified by its geographic coordinates. Temporal topic may be a named period, date, or date range. A jurisdiction may be a named administrative entity or a geographic place to which the resource applies. Recommended best practice is to use a controlled vocabulary such as the Thesaurus of Geographic Names [TGN]. Where appropriate, named places or time periods can be used in preference to numeric identifiers such as sets of coordinates or date ranges.
has version: coverage-006
issued: 1999-07-02
modified: 2008-01-14
type: Property
comment: The spatial or temporal topic of the resource, the spatial applicability of the resource, or the jurisdiction under which the resource is relevant.
note: A second property with the same name as this property has been declared in the dcterms: namespace (http://purl.org/dc/terms/). See the Introduction to the document "DCMI Metadata Terms" (http://dublincore.org/documents/dcmi-terms/) for an explanation.

system property
type: Property
comment: An "abstract" base property that groups together those system properties that the user will hardly ever need to see in property trees. This property may be dropped in future versions of this ontology - right now it's mainly here for convenience.

violation source
type: Property
sub property of: system property
range: Resource
domain: Constraint violation
comment: Can be used to link a spin:ConstraintViolation with the query or template call that caused it. This property is typically filled in automatically by the constraint checking engine and does not need to be set manually. However, it can be useful to learn more about the origin of a violation.
domain: Resource

start date
type: DatatypeProperty
range: date
sub property of: date
type: Property
range: DateUnion
range: Resource

imports
type: OntologyProperty
sub property of: system property
range: Ontology
domain: Ontology
comment: Can be used to link an RDF graph (usually the instance of owl:Ontology) with a SPIN library to define constraints. SPIN-aware tools should include the definitions from those libraries for constraint checking. Using such libraries is a simpler alternative than explicitly importing them using owl:imports, because it does not force all the SPIN triples into the RDF model.
type: Property
range: http://lodlaundromat.org/.well-known/genid/87b3155a45f739091dc1b4f71dafba5d#6
range: http://lodlaundromat.org/.well-known/genid/87b3155a45f739091dc1b4f71dafba5d#2
range: http://lodlaundromat.org/.well-known/genid/87b3155a45f739091dc1b4f71dafba5d#1
range: http://lodlaundromat.org/.well-known/genid/b1d777ae0029e5815eb2dfe2bfc6b521#2
range: Resource
range: Thing
range: http://lodlaundromat.org/.well-known/genid/87b3155a45f739091dc1b4f71dafba5d#14
range: http://lodlaundromat.org/.well-known/genid/b1d777ae0029e5815eb2dfe2bfc6b521#7
range: http://lodlaundromat.org/.well-known/genid/b1d777ae0029e5815eb2dfe2bfc6b521#5
range: http://lodlaundromat.org/.well-known/genid/87b3155a45f739091dc1b4f71dafba5d#13
range: http://lodlaundromat.org/.well-known/genid/87b3155a45f739091dc1b4f71dafba5d#12
range: http://lodlaundromat.org/.well-known/genid/b1d777ae0029e5815eb2dfe2bfc6b521#6
domain: http://lodlaundromat.org/.well-known/genid/87b3155a45f739091dc1b4f71dafba5d#13
domain: Resource
domain: http://lodlaundromat.org/.well-known/genid/b1d777ae0029e5815eb2dfe2bfc6b521#7
domain: http://lodlaundromat.org/.well-known/genid/87b3155a45f739091dc1b4f71dafba5d#2
domain: http://lodlaundromat.org/.well-known/genid/87b3155a45f739091dc1b4f71dafba5d#1
domain: http://lodlaundromat.org/.well-known/genid/87b3155a45f739091dc1b4f71dafba5d#14
domain: http://lodlaundromat.org/.well-known/genid/87b3155a45f739091dc1b4f71dafba5d#6
domain: Thing
domain: http://lodlaundromat.org/.well-known/genid/b1d777ae0029e5815eb2dfe2bfc6b521#2
domain: http://lodlaundromat.org/.well-known/genid/b1d777ae0029e5815eb2dfe2bfc6b521#5
domain: http://lodlaundromat.org/.well-known/genid/87b3155a45f739091dc1b4f71dafba5d#12
domain: http://lodlaundromat.org/.well-known/genid/b1d777ae0029e5815eb2dfe2bfc6b521#6

oeGOV Government Core Ontology
revision: $Revision: 1365 $
attribution URL: http://www.topquadrant.com
Rights: Creative Commons Attribution-Share Alike 3.0 United States License
has license: Creative Commons Attribution-Share Alike 3.0 United States License
date: $Date: 2009-08-24 10:59:06 -0700 (Mon, 24 Aug 2009) $
description: Government Core Ontology.
creator: Ralph Hodgson
imports: schema.rdf
version info: $Id: gc.n3 1365 2009-08-24 17:59:06Z RalphHodgson $
imports: Dublin Core Metadata Element Set, Version 1.1
imports: SPIN Modeling Vocabulary
Source: www.oegov.org
attributed source: TopQuadrant attribution
type: Ontology
imports: Creative Commons Ontology
type: Work
type: Thing
license: Creative Commons Attribution-Share Alike 3.0 United States License
type: http://lodlaundromat.org/.well-known/genid/87b3155a45f739091dc1b4f71dafba5d#6
type: http://lodlaundromat.org/.well-known/genid/87b3155a45f739091dc1b4f71dafba5d#2
type: http://lodlaundromat.org/.well-known/genid/87b3155a45f739091dc1b4f71dafba5d#1
type: http://lodlaundromat.org/.well-known/genid/87b3155a45f739091dc1b4f71dafba5d#14
type: http://lodlaundromat.org/.well-known/genid/b1d777ae0029e5815eb2dfe2bfc6b521#2
type: http://lodlaundromat.org/.well-known/genid/b1d777ae0029e5815eb2dfe2bfc6b521#7
type: http://lodlaundromat.org/.well-known/genid/b1d777ae0029e5815eb2dfe2bfc6b521#6
type: http://lodlaundromat.org/.well-known/genid/87b3155a45f739091dc1b4f71dafba5d#12
type: http://lodlaundromat.org/.well-known/genid/b1d777ae0029e5815eb2dfe2bfc6b521#5
type: http://lodlaundromat.org/.well-known/genid/87b3155a45f739091dc1b4f71dafba5d#13

http://lodlaundromat.org/.well-known/genid/9fb05f53ba0c66117a615cb1cd805aaa#2
type: Attribute
comment: The CONSTRUCT query wrapped by this template.
value type: Construct
predicate: body
min count: 0
max count: 1
type: Query
type: Command

founded on
type: DatatypeProperty
range: DateUnion
sub property of: date
type: Property
range: Resource

SPIN Modeling Vocabulary
type: Ontology
version info: 1.3.2
imports: sp
comment: An RDF Schema that can be used to attach constraints and rules to RDFS classes, and to encapsulate reusable SPARQL queries into functions and templates.
type: http://lodlaundromat.org/.well-known/genid/87b3155a45f739091dc1b4f71dafba5d#6
type: http://lodlaundromat.org/.well-known/genid/87b3155a45f739091dc1b4f71dafba5d#2
type: http://lodlaundromat.org/.well-known/genid/87b3155a45f739091dc1b4f71dafba5d#1
type: http://lodlaundromat.org/.well-known/genid/87b3155a45f739091dc1b4f71dafba5d#14
type: Thing
type: http://lodlaundromat.org/.well-known/genid/b1d777ae0029e5815eb2dfe2bfc6b521#2
type: http://lodlaundromat.org/.well-known/genid/b1d777ae0029e5815eb2dfe2bfc6b521#7
type: http://lodlaundromat.org/.well-known/genid/b1d777ae0029e5815eb2dfe2bfc6b521#6
type: http://lodlaundromat.org/.well-known/genid/87b3155a45f739091dc1b4f71dafba5d#12
type: http://lodlaundromat.org/.well-known/genid/b1d777ae0029e5815eb2dfe2bfc6b521#5
type: http://lodlaundromat.org/.well-known/genid/87b3155a45f739091dc1b4f71dafba5d#13

Ask templates
type: Ask template
subclass of: Templates
comment: Suggested abstract base class for all AskTemplates.
abstract: true
system property: true
type: Module
type: Template
type: Class

return type
type: Property
sub property of: system property
range: Class
domain: Function
comment: The return type of a Function, e.g. xsd:string.
range: Resource
domain: Module
domain: Resource
domain: Class

creation date
type: DatatypeProperty
range: DateUnion
sub property of: date
type: Property
range: Resource

Identifier
description: Recommended best practice is to identify the resource by means of a string conforming to a formal identification system.
has version: identifier-006
issued: 1999-07-02
modified: 2008-01-14
type: Property
comment: An unambiguous reference to the resource within a given context.
note: A second property with the same name as this property has been declared in the dcterms: namespace (http://purl.org/dc/terms/). See the Introduction to the document "DCMI Metadata Terms" (http://dublincore.org/documents/dcmi-terms/) for an explanation.

arg3
type: Variable
var name: arg3

Language
issued: 1999-07-02
note: A second property with the same name as this property has been declared in the dcterms: namespace (http://purl.org/dc/terms/). See the Introduction to the document "DCMI Metadata Terms" (http://dublincore.org/documents/dcmi-terms/) for an explanation.
has version: language-007
description: Recommended best practice is to use a controlled vocabulary such as RFC 4646 [RFC4646].
type: Property
comment: A language of the resource.
modified: 2008-01-14

this unbound
type: Property
sub property of: system property
range: boolean
domain: Construct
comment: Can be set to true for SPIN rules and constraints that do not require pre-binding the variable ?this with all members of the associated class. This flag should only be set to true if the WHERE clause is sufficiently strong to only bind instances of the associated class, or its subclasses. In those cases, the engine can greatly improve performance of query execution, because it does not need to add clauses to narrow down the WHERE clause.
range: Resource
domain: Rule
domain: Resource
domain: Command

construct
type: Magic property
subclass of: Magic properties
comment: Evaluates a given sp:Construct or SPIN template call (first argument on the left hand side) and binds the resulting triples to the variables on the right hand side. Example: (?query "this" owl:Thing) spin:construct (?s ?p ?o) will execute the sp:Construct ?query using the binding of owl:Thing to ?this. The resulting triples will be bound to ?s, ?p and ?o. If any of ?s ?p ?o are bound, it will only return the matching triples.
type: Class
type: Module
type: Property
type: Function

licence
type: DatatypeProperty
range: string
type: Property
range: Resource

violation path
type: Property
sub property of: system property
range: Resource
domain: Constraint violation
comment: An optional attribute of ConstraintViolations to provide a path expression from the root resource to the value that is invalid. If this is a URI then the path represents the predicate of a subject/predicate combination. Otherwise it should be a blank node of type sp:Path.
domain: Resource

end date
type: DatatypeProperty
range: date
sub property of: date
type: Property
range: DateUnion
range: Resource

violation level
type: Property
sub property of: system property
range: Constraint violation level
domain: Constraint violation
comment: An optional attribute of ConstraintViolations to point at a violation level (such as Error and Warning). Defaults to spin:Error.
range: Resource
domain: Resource

deprecated on
type: Property
domain: License
range: date
type: AnnotationProperty
range: Resource
domain: http://lodlaundromat.org/.well-known/genid/b1d777ae0029e5815eb2dfe2bfc6b521#7
domain: http://lodlaundromat.org/.well-known/genid/87b3155a45f739091dc1b4f71dafba5d#11
domain: Resource
domain: http://lodlaundromat.org/.well-known/genid/87b3155a45f739091dc1b4f71dafba5d#1
domain: http://lodlaundromat.org/.well-known/genid/87b3155a45f739091dc1b4f71dafba5d#2
domain: http://lodlaundromat.org/.well-known/genid/87b3155a45f739091dc1b4f71dafba5d#6
domain: Thing
domain: http://lodlaundromat.org/.well-known/genid/87b3155a45f739091dc1b4f71dafba5d#14
domain: http://lodlaundromat.org/.well-known/genid/b1d777ae0029e5815eb2dfe2bfc6b521#2
domain: http://lodlaundromat.org/.well-known/genid/b1d777ae0029e5815eb2dfe2bfc6b521#1
domain: LicenseDocument

licence
type: DatatypeProperty
range: string
type: Property
range: Resource

OWL Format
type: Data Format
type: http://lodlaundromat.org/.well-known/genid/87b3155a45f739091dc1b4f71dafba5d#3
type: Thing
type: Category
type: http://lodlaundromat.org/.well-known/genid/87b3155a45f739091dc1b4f71dafba5d#14
type: http://lodlaundromat.org/.well-known/genid/87b3155a45f739091dc1b4f71dafba5d#6
type: http://lodlaundromat.org/.well-known/genid/87b3155a45f739091dc1b4f71dafba5d#2
type: http://lodlaundromat.org/.well-known/genid/87b3155a45f739091dc1b4f71dafba5d#1
type: http://lodlaundromat.org/.well-known/genid/b1d777ae0029e5815eb2dfe2bfc6b521#2
type: http://lodlaundromat.org/.well-known/genid/b1d777ae0029e5815eb2dfe2bfc6b521#7

Subject
description: Typically, the subject will be represented using keywords, key phrases, or classification codes. Recommended best practice is to use a controlled vocabulary.
has version: subject-007
issued: 1999-07-02
modified: 2012-06-14
type: Property
comment: The topic of the resource.
note: A second property with the same name as this property has been declared in the dcterms: namespace (http://purl.org/dc/terms/). See the Introduction to the document "DCMI Metadata Terms" (http://dublincore.org/documents/dcmi-terms/) for an explanation.

Copyleft
type: Requirement
comment: derivative and combined works must be licensed under specified terms, similar to those on the original work

Construct templates
type: Construct template
subclass of: Templates
comment: Suggested abstract base class for all ConstructTemplates.
abstract: true
system property: true
type: Module
type: Class
type: Template

cessation date
type: DatatypeProperty
range: DateUnion
sub property of: date
type: Property
range: Resource

query
type: Property
sub property of: command
range: Query
comment: Can be used to point from any resource to a Query.
range: Command
range: Resource

KML-Format
description: Keyhole Markup Language (KML) is an XML-based language schema for expressing geographic annotation and visualization on existing or future Web-based, two-dimensional maps and three-dimensional Earth browsers.
type: Data Format
type: http://lodlaundromat.org/.well-known/genid/87b3155a45f739091dc1b4f71dafba5d#3
type: Thing
type: Category
type: http://lodlaundromat.org/.well-known/genid/87b3155a45f739091dc1b4f71dafba5d#14
type: http://lodlaundromat.org/.well-known/genid/87b3155a45f739091dc1b4f71dafba5d#6
type: http://lodlaundromat.org/.well-known/genid/87b3155a45f739091dc1b4f71dafba5d#2
type: http://lodlaundromat.org/.well-known/genid/87b3155a45f739091dc1b4f71dafba5d#1
type: http://lodlaundromat.org/.well-known/genid/b1d777ae0029e5815eb2dfe2bfc6b521#2
type: http://lodlaundromat.org/.well-known/genid/b1d777ae0029e5815eb2dfe2bfc6b521#7

violation root
type: Property
sub property of: system property
range: Resource
domain: Constraint violation
comment: The root resource of the violation (often ?this in the constraint body).
domain: Resource

Magic properties
type: Magic property
sub property of: system property
subclass of: Functions
comment: An abstract superclass that can be used to group all spin:MagicProperty instances under a single parent class.
abstract: true
system property: true
type: Module
type: Class
type: Property
type: Function

Relation
description: Recommended best practice is to identify the related resource by means of a string conforming to a formal identification system.
has version: relation-006
issued: 1999-07-02
modified: 2008-01-14
type: Property
comment: A related resource.
note: A second property with the same name as this property has been declared in the dcterms: namespace (http://purl.org/dc/terms/). See the Introduction to the document "DCMI Metadata Terms" (http://dublincore.org/documents/dcmi-terms/) for an explanation.

TopQuadrant attribution
type: Attributed Source
point of contact: Ralph Hodgson
attribution URL: http://www.topquadrant.com
attribution name: TopQuadrant, Inc.
type: Work
type: Thing
type: http://lodlaundromat.org/.well-known/genid/b1d777ae0029e5815eb2dfe2bfc6b521#3
type: http://lodlaundromat.org/.well-known/genid/b1d777ae0029e5815eb2dfe2bfc6b521#2
type: http://lodlaundromat.org/.well-known/genid/b1d777ae0029e5815eb2dfe2bfc6b521#4
type: http://lodlaundromat.org/.well-known/genid/87b3155a45f739091dc1b4f71dafba5d#14
type: http://lodlaundromat.org/.well-known/genid/87b3155a45f739091dc1b4f71dafba5d#4
type: http://lodlaundromat.org/.well-known/genid/87b3155a45f739091dc1b4f71dafba5d#6
type: http://lodlaundromat.org/.well-known/genid/87b3155a45f739091dc1b4f71dafba5d#2
type: http://lodlaundromat.org/.well-known/genid/87b3155a45f739091dc1b4f71dafba5d#1
type: http://lodlaundromat.org/.well-known/genid/87b3155a45f739091dc1b4f71dafba5d#5
type: http://lodlaundromat.org/.well-known/genid/b1d777ae0029e5815eb2dfe2bfc6b521#7

Functions
type: Function
subclass of: Modules
comment: An abstract base class for all defined functions. This class mainly serves as a shared root so that the various instances of the Function metaclass are grouped together.
abstract: true
system property: true
type: Module
type: Class

Creator
description: Examples of a Creator include a person, an organization, or a service. Typically, the name of a Creator should be used to indicate the entity.
has version: creator-006
issued: 1999-07-02
modified: 2008-01-14
type: Property
comment: An entity primarily responsible for making the resource.
note: A second property with the same name as this property has been declared in the dcterms: namespace (http://purl.org/dc/terms/). See the Introduction to the document "DCMI Metadata Terms" (http://dublincore.org/documents/dcmi-terms/) for an explanation.

next rule property
type: Property
sub property of: system property
range: Rule property
domain: Rule property
comment: Can be used to link two sub-properties of spin:rule (or spin:rule itself) to instruct the SPIN engine to execute one set of rules before another one. The values of the subject property will be executed before those of the object property.
range: Property
range: Resource
domain: Property
domain: Resource

Format
description: Examples of dimensions include size and duration. Recommended best practice is to use a controlled vocabulary such as the list of Internet Media Types [MIME].
has version: format-007
issued: 1999-07-02
modified: 2008-01-14
type: Property
comment: The file format, physical medium, or dimensions of the resource.
note: A second property with the same name as this property has been declared in the dcterms: namespace (http://purl.org/dc/terms/). See the Introduction to the document "DCMI Metadata Terms" (http://dublincore.org/documents/dcmi-terms/) for an explanation.

number
type: DatatypeProperty
range: int
type: Property
range: long
range: integer
range: Resource
range: decimal

updated date
type: DatatypeProperty
range: date
sub property of: date
type: Property
range: DateUnion
range: Resource

RSS Format
type: Data Format
type: http://lodlaundromat.org/.well-known/genid/87b3155a45f739091dc1b4f71dafba5d#3
type: Thing
type: Category
type: http://lodlaundromat.org/.well-known/genid/87b3155a45f739091dc1b4f71dafba5d#14
type: http://lodlaundromat.org/.well-known/genid/87b3155a45f739091dc1b4f71dafba5d#6
type: http://lodlaundromat.org/.well-known/genid/87b3155a45f739091dc1b4f71dafba5d#2
type: http://lodlaundromat.org/.well-known/genid/87b3155a45f739091dc1b4f71dafba5d#1
type: http://lodlaundromat.org/.well-known/genid/b1d777ae0029e5815eb2dfe2bfc6b521#2
type: http://lodlaundromat.org/.well-known/genid/b1d777ae0029e5815eb2dfe2bfc6b521#7

arg1
type: Variable
var name: arg1

Source
description: The described resource may be derived from the related resource in whole or in part. Recommended best practice is to identify the related resource by means of a string conforming to a formal identification system.
has version: source-006
issued: 1999-07-02
modified: 2008-01-14
type: Property
comment: A related resource from which the described resource is derived.
note: A second property with the same name as this property has been declared in the dcterms: namespace (http://purl.org/dc/terms/). See the Introduction to the document "DCMI Metadata Terms" (http://dublincore.org/documents/dcmi-terms/) for an explanation.

Description
description: Description may include but is not limited to: an abstract, a table of contents, a graphical representation, or a free-text account of the resource.
has version: description-006
issued: 1999-07-02
modified: 2008-01-14
type: Property
comment: An account of the resource.
note: A second property with the same name as this property has been declared in the dcterms: namespace (http://purl.org/dc/terms/). See the Introduction to the document "DCMI Metadata Terms" (http://dublincore.org/documents/dcmi-terms/) for an explanation.

HTML Format
type: Data Format
type: Category
type: http://lodlaundromat.org/.well-known/genid/87b3155a45f739091dc1b4f71dafba5d#3
type: Thing
type: http://lodlaundromat.org/.well-known/genid/87b3155a45f739091dc1b4f71dafba5d#14
type: http://lodlaundromat.org/.well-known/genid/87b3155a45f739091dc1b4f71dafba5d#6
type: http://lodlaundromat.org/.well-known/genid/87b3155a45f739091dc1b4f71dafba5d#2
type: http://lodlaundromat.org/.well-known/genid/87b3155a45f739091dc1b4f71dafba5d#1
type: http://lodlaundromat.org/.well-known/genid/b1d777ae0029e5815eb2dfe2bfc6b521#2
type: http://lodlaundromat.org/.well-known/genid/b1d777ae0029e5815eb2dfe2bfc6b521#7

Unstructured Data Format
sub category: HTML Format
type: Data Format
type: Thing
type: http://lodlaundromat.org/.well-known/genid/87b3155a45f739091dc1b4f71dafba5d#3
type: Category
type: http://lodlaundromat.org/.well-known/genid/87b3155a45f739091dc1b4f71dafba5d#14
type: http://lodlaundromat.org/.well-known/genid/87b3155a45f739091dc1b4f71dafba5d#6
type: http://lodlaundromat.org/.well-known/genid/87b3155a45f739091dc1b4f71dafba5d#2
type: http://lodlaundromat.org/.well-known/genid/87b3155a45f739091dc1b4f71dafba5d#1
type: http://lodlaundromat.org/.well-known/genid/b1d777ae0029e5815eb2dfe2bfc6b521#2
type: http://lodlaundromat.org/.well-known/genid/b1d777ae0029e5815eb2dfe2bfc6b521#7

RDF Fomat
type: Data Format
type: http://lodlaundromat.org/.well-known/genid/87b3155a45f739091dc1b4f71dafba5d#3
type: Thing
type: Category
type: http://lodlaundromat.org/.well-known/genid/87b3155a45f739091dc1b4f71dafba5d#14
type: http://lodlaundromat.org/.well-known/genid/87b3155a45f739091dc1b4f71dafba5d#6
type: http://lodlaundromat.org/.well-known/genid/87b3155a45f739091dc1b4f71dafba5d#2
type: http://lodlaundromat.org/.well-known/genid/87b3155a45f739091dc1b4f71dafba5d#1
type: http://lodlaundromat.org/.well-known/genid/b1d777ae0029e5815eb2dfe2bfc6b521#2
type: http://lodlaundromat.org/.well-known/genid/b1d777ae0029e5815eb2dfe2bfc6b521#7

http://lodlaundromat.org/.well-known/genid/9fb05f53ba0c66117a615cb1cd805aaa#3
type: Attribute
comment: The ASK query wrapped by this template.
value type: Ask
predicate: body
min count: 0
max count: 1
type: Query
type: Command

select
type: Magic property
subclass of: Magic properties
comment: Executes a given SELECT or ASK query (or a corresponding SPIN template call) and binds its result rows to the variables specified on the right hand side. May also pre-bind variables for the query execution, using name-value pairs on the left hand side. Example: (?query "this" owl:Thing) spin:select (?a ?b) will execute the sp:Select or sp:Ask that ?query points to and pre-bind ?this with the value of owl:Thing for the execution of the query. The first result variable of the query's result set will be bound to ?a, the second to ?b etc. If the nodes on the right are bound (or constants) then it will match with the values from the result set.
type: Class
type: Module
type: Property
type: Function

submission date
type: DatatypeProperty
range: date
sub property of: date
type: Property
range: DateUnion
range: Resource

Select templates
type: Select template
subclass of: Templates
comment: Suggested abstract base class for all SelectTemplates.
abstract: true
system property: true
type: Module
type: Class
type: Template
type: Table data provider

update
type: Property
sub property of: command
range: Update
comment: Can be used to point from any resource to an Update.
range: Command
range: Resource

Update templates
type: Update template
subclass of: Templates
comment: Suggested abstract base class for all UpdateTemplates.
abstract: true
system property: true
type: Module
type: Template
type: Class

label template
type: Property
sub property of: system property
range: string
domain: Template
comment: A template string for displaying instantiations of a module in human-readable form. The template may contain the argument variable names in curly braces to support substitution. For example, "The number of values of the {?arg1} property."
range: Resource
domain: Module
domain: Resource
domain: Class

XML Format
description: XML (Extensible Markup Language) is a general-purpose specification for creating custom markup languages. It is classified as an extensible language, because it allows the user to define the mark-up elements. XML's purpose is to aid information systems in sharing structured data, especially via the Internet, to encode documents, and to serialize data.
type: Data Format
type: http://lodlaundromat.org/.well-known/genid/87b3155a45f739091dc1b4f71dafba5d#3
type: Thing
type: Category
type: http://lodlaundromat.org/.well-known/genid/87b3155a45f739091dc1b4f71dafba5d#14
type: http://lodlaundromat.org/.well-known/genid/87b3155a45f739091dc1b4f71dafba5d#6
type: http://lodlaundromat.org/.well-known/genid/87b3155a45f739091dc1b4f71dafba5d#2
type: http://lodlaundromat.org/.well-known/genid/87b3155a45f739091dc1b4f71dafba5d#1
type: http://lodlaundromat.org/.well-known/genid/b1d777ae0029e5815eb2dfe2bfc6b521#2
type: http://lodlaundromat.org/.well-known/genid/b1d777ae0029e5815eb2dfe2bfc6b521#7

arg4
type: Variable
var name: arg4

command
type: Property
range: Command
comment: Can be used to link a resource with a SPARQL query or update request (sp:Command).
range: Resource

archive URL
type: DatatypeProperty
range: anyURI
sub property of: url
type: Property
range: Thing
range: http://lodlaundromat.org/.well-known/genid/87b3155a45f739091dc1b4f71dafba5d#6
range: http://lodlaundromat.org/.well-known/genid/87b3155a45f739091dc1b4f71dafba5d#1
range: http://lodlaundromat.org/.well-known/genid/b1d777ae0029e5815eb2dfe2bfc6b521#7
range: http://lodlaundromat.org/.well-known/genid/87b3155a45f739091dc1b4f71dafba5d#2
range: http://lodlaundromat.org/.well-known/genid/87b3155a45f739091dc1b4f71dafba5d#14
range: http://lodlaundromat.org/.well-known/genid/b1d777ae0029e5815eb2dfe2bfc6b521#2
range: Resource
domain: Thing
domain: http://lodlaundromat.org/.well-known/genid/87b3155a45f739091dc1b4f71dafba5d#6
domain: http://lodlaundromat.org/.well-known/genid/87b3155a45f739091dc1b4f71dafba5d#1
domain: http://lodlaundromat.org/.well-known/genid/b1d777ae0029e5815eb2dfe2bfc6b521#7
domain: http://lodlaundromat.org/.well-known/genid/87b3155a45f739091dc1b4f71dafba5d#2
domain: http://lodlaundromat.org/.well-known/genid/87b3155a45f739091dc1b4f71dafba5d#14
domain: http://lodlaundromat.org/.well-known/genid/b1d777ae0029e5815eb2dfe2bfc6b521#2
domain: Resource

KMZ Format
description: KML files are very often distributed in KMZ files, which are zipped files with a ".KMZ" extension. When a KMZ file is unzipped, a single "doc.kml" is found along with any overlay and icon images referenced in the KML as well as any network-linked KML files.
type: Data Format
type: http://lodlaundromat.org/.well-known/genid/87b3155a45f739091dc1b4f71dafba5d#3
type: Thing
type: Category
type: http://lodlaundromat.org/.well-known/genid/87b3155a45f739091dc1b4f71dafba5d#14
type: http://lodlaundromat.org/.well-known/genid/87b3155a45f739091dc1b4f71dafba5d#6
type: http://lodlaundromat.org/.well-known/genid/87b3155a45f739091dc1b4f71dafba5d#2
type: http://lodlaundromat.org/.well-known/genid/87b3155a45f739091dc1b4f71dafba5d#1
type: http://lodlaundromat.org/.well-known/genid/b1d777ae0029e5815eb2dfe2bfc6b521#2
type: http://lodlaundromat.org/.well-known/genid/b1d777ae0029e5815eb2dfe2bfc6b521#7

url
type: DatatypeProperty
range: anyURI
type: Property
range: Resource

private
type: Property
sub property of: system property
range: boolean
domain: Module
comment: Can be set to true to indicate that a SPIN function or template is only meant to be used as a helper of other modules, but not directly. Among others, this allows user interfaces to filter out private modules. Furthermore, it tells potential users of this module that they should avoid using this module, as it may not be stable.
range: Resource
domain: Resource
domain: Class

rule property max iteration count
type: Property
sub property of: system property
range: integer
domain: Rule property
comment: Can be attached to spin:rule (or subclasses thereof) to instruct a SPIN rules engine that it shall only execute the rules max times. If no value is specified, then the rules will be executed with no specific limit.
range: Resource
range: decimal
domain: Property
domain: Resource

released date
type: DatatypeProperty
range: DateUnion
sub property of: date
type: Property
range: Resource

Contributor
description: Examples of a Contributor include a person, an organization, or a service. Typically, the name of a Contributor should be used to indicate the entity.
has version: contributor-006
issued: 1999-07-02
modified: 2008-01-14
type: Property
comment: An entity responsible for making contributions to the resource.
note: A second property with the same name as this property has been declared in the dcterms: namespace (http://purl.org/dc/terms/). See the Introduction to the document "DCMI Metadata Terms" (http://dublincore.org/documents/dcmi-terms/) for an explanation.

TopQuadrant attribution
attribution name: TopQuadrant, Inc.
attribution URL: http://www.topquadrant.com
point of contact: Ralph Hodgson
type: Attributed Source
type: Work
type: http://lodlaundromat.org/.well-known/genid/87b3155a45f739091dc1b4f71dafba5d#4
type: http://lodlaundromat.org/.well-known/genid/87b3155a45f739091dc1b4f71dafba5d#6
type: Thing
type: http://lodlaundromat.org/.well-known/genid/87b3155a45f739091dc1b4f71dafba5d#5
type: http://lodlaundromat.org/.well-known/genid/87b3155a45f739091dc1b4f71dafba5d#14
type: http://lodlaundromat.org/.well-known/genid/b1d777ae0029e5815eb2dfe2bfc6b521#4
type: http://lodlaundromat.org/.well-known/genid/b1d777ae0029e5815eb2dfe2bfc6b521#3
type: http://lodlaundromat.org/.well-known/genid/87b3155a45f739091dc1b4f71dafba5d#2
type: http://lodlaundromat.org/.well-known/genid/87b3155a45f739091dc1b4f71dafba5d#1
type: http://lodlaundromat.org/.well-known/genid/b1d777ae0029e5815eb2dfe2bfc6b521#2
type: http://lodlaundromat.org/.well-known/genid/b1d777ae0029e5815eb2dfe2bfc6b521#7

column
type: Property
sub property of: system property
range: Column
domain: Table data provider
comment: Can link a TableDataProvider (esp. SelectTemplate) with one or more columns that provide metadata for rendering purposes. Columns can be sorted by their spin:columnIndex (which must align with the ordering of variables in the SELECT query starting with 0). Not all result variables of the underlying query need to have a matching spin:Column.
range: Resource
domain: Class
domain: Resource

rule
type: Rule property
sub property of: command
range: Rule
domain: Class
comment: An inferencing rule attached to a class. Rules are expressed as CONSTRUCT queries or INSERT/DELETE operations where the variable ?this will be bound to the current instance of the class. These inferences can be used to derive new values from existing values at the instance.
type: Property
range: Command
range: Resource
domain: Resource

http://lodlaundromat.org/.well-known/genid/9fb05f53ba0c66117a615cb1cd805aaa#6
type: Attribute
comment: The SELECT query wrapped by this template.
value type: Select
predicate: body
min count: 0
max count: 1
type: Query
type: Command

Date
description: Date may be used to express temporal information at any level of granularity. Recommended best practice is to use an encoding scheme, such as the W3CDTF profile of ISO 8601 [W3CDTF].
has version: date-006
issued: 1999-07-02
modified: 2008-01-14
type: Property
comment: A point or period of time associated with an event in the lifecycle of the resource.
note: A second property with the same name as this property has been declared in the dcterms: namespace (http://purl.org/dc/terms/). See the Introduction to the document "DCMI Metadata Terms" (http://dublincore.org/documents/dcmi-terms/) for an explanation.

Rights
description: Typically, rights information includes a statement about various property rights associated with the resource, including intellectual property rights.
has version: rights-006
issued: 1999-07-02
modified: 2008-01-14
type: Property
comment: Information about rights held in and over the resource.
note: A second property with the same name as this property has been declared in the dcterms: namespace (http://purl.org/dc/terms/). See the Introduction to the document "DCMI Metadata Terms" (http://dublincore.org/documents/dcmi-terms/) for an explanation.

year
type: DatatypeProperty
range: gYear
type: Property
range: DateUnion
range: Resource

summary
type: DatatypeProperty
range: string
type: Property
range: Resource

column type
type: Property
sub property of: system property
range: Class
domain: Column
comment: The datatype or resource type of a spin:Column. For example this is useful as metadata to inform a rendering engine that numeric columns (e.g. xsd:float) need to be right-aligned.
range: Resource
domain: Resource

constructor
type: Property
sub property of: command
range: Rule
domain: Class
comment: Can be used to attach a "constructor" to a class. A constructor is a SPARQL CONSTRUCT query or INSERT/DELETE Update operation that can add initial values to the current instance. At execution time, the variable ?this is bound to the current instance. Tools can call constructors of a class and its superclasses when an instance of a class has been created. Constructors will also be used to initialize resources that have received a new rdf:type triple as a result of spin:rules firing.
range: Command
range: Resource
domain: Resource

Shapefile Format
description: The ESRI Shapefile or simply a shapefile is a popular geospatial vector data format for geographic information systems software. It is developed and regulated by ESRI as a (mostly) open specification for data interoperability among ESRI and other software products.[1] A "shapefile" commonly refers to a collection of files with ".shp", ".shx", ".dbf", and other extensions on a common prefix name (e.g., "lakes.*"). The actual shapefile relates specifically to files with the ".shp" extension, however this file alone is incomplete for distribution, as the other supporting files are required. Shapefiles spatially describe geometries: points, polylines, and polygons. These, for example, could represent water wells, rivers, and lakes, respectively. Each item may also have attributes that describe the items, such as the name or temperature [Wikipedia].
type: Data Format
type: http://lodlaundromat.org/.well-known/genid/87b3155a45f739091dc1b4f71dafba5d#3
type: Thing
type: Category
type: http://lodlaundromat.org/.well-known/genid/87b3155a45f739091dc1b4f71dafba5d#14
type: http://lodlaundromat.org/.well-known/genid/87b3155a45f739091dc1b4f71dafba5d#6
type: http://lodlaundromat.org/.well-known/genid/87b3155a45f739091dc1b4f71dafba5d#2
type: http://lodlaundromat.org/.well-known/genid/87b3155a45f739091dc1b4f71dafba5d#1
type: http://lodlaundromat.org/.well-known/genid/b1d777ae0029e5815eb2dfe2bfc6b521#2
type: http://lodlaundromat.org/.well-known/genid/b1d777ae0029e5815eb2dfe2bfc6b521#7

text
type: DatatypeProperty
range: string
type: Property
range: Resource

http://lodlaundromat.org/.well-known/genid/9fb05f53ba0c66117a615cb1cd805aaa#1
type: Attribute
comment: the body of the function
predicate: body
min count: 0
max count: 1
type: Query
type: Command

column width
type: Property
sub property of: system property
range: integer
domain: Column
comment: The preferred width of the associated Column, for display purposes. Values in pixels (rendering engines may multiply the values depending on resolution).
range: Resource
range: decimal
domain: Resource

Text Format
type: Data Format
type: http://lodlaundromat.org/.well-known/genid/87b3155a45f739091dc1b4f71dafba5d#3
type: Thing
type: Category
type: http://lodlaundromat.org/.well-known/genid/87b3155a45f739091dc1b4f71dafba5d#14
type: http://lodlaundromat.org/.well-known/genid/87b3155a45f739091dc1b4f71dafba5d#6
type: http://lodlaundromat.org/.well-known/genid/87b3155a45f739091dc1b4f71dafba5d#2
type: http://lodlaundromat.org/.well-known/genid/87b3155a45f739091dc1b4f71dafba5d#1
type: http://lodlaundromat.org/.well-known/genid/b1d777ae0029e5815eb2dfe2bfc6b521#2
type: http://lodlaundromat.org/.well-known/genid/b1d777ae0029e5815eb2dfe2bfc6b521#7

body
type: Property
sub property of: system property
range: Command
comment: The body of a Function or Template. This points to a Query instance. For Functions, this is limited to either ASK or SELECT type queries. If the body is the ASK function then the return value is xsd:boolean. Otherwise, the SELECT query must have a single return variable. The first binding of this SELECT query will be returned as result of the function call.
range: Resource

Templates
type: Template
subclass of: Modules
comment: Suggested abstract base class for all Templates.
abstract: true
system property: true
type: Module
type: Class

title
type: DatatypeProperty
range: string
type: Property
range: Resource

violation value
type: Property
sub property of: system property
domain: Constraint violation
comment: An optional attribute of ConstraintViolations to point at a specific RDF node that caused the violation. Should be accessible from the root via the violationPath.
domain: Resource

column index
type: Property
sub property of: system property
range: integer
domain: Column
comment: The index of a column (from left to right) starting at 0.
range: Resource
range: decimal
domain: Resource

award date
type: DatatypeProperty
range: DateUnion
sub property of: date
type: Property
range: Resource

Info
type: Constraint violation level
comment: Indicates that the associated constraint violation is a not a problem. This level can be used for diagnostic and debugging purposes.

arg2
type: Variable
var name: arg2

identifier
type: DatatypeProperty
range: anySimpleType
type: Property
range: Resource

fix
type: Property
sub property of: system property
range: Update template
domain: Constraint violation
comment: Can be used to link a ConstraintViolation with one or more UPDATE Templates that would help fix the violation.
range: Resource
range: Class
range: Module
range: Template
domain: Resource

Creative Commons Attribution-Share Alike 3.0 United States License
type: License
requires: Share Alike
requires: Attribution
permits: Derivative Works
permits: Distribution
type: Thing
type: http://lodlaundromat.org/.well-known/genid/87b3155a45f739091dc1b4f71dafba5d#11
type: LicenseDocument
type: http://lodlaundromat.org/.well-known/genid/b1d777ae0029e5815eb2dfe2bfc6b521#1
type: http://lodlaundromat.org/.well-known/genid/87b3155a45f739091dc1b4f71dafba5d#14
type: http://lodlaundromat.org/.well-known/genid/87b3155a45f739091dc1b4f71dafba5d#6
type: http://lodlaundromat.org/.well-known/genid/87b3155a45f739091dc1b4f71dafba5d#2
type: http://lodlaundromat.org/.well-known/genid/87b3155a45f739091dc1b4f71dafba5d#1
type: http://lodlaundromat.org/.well-known/genid/b1d777ae0029e5815eb2dfe2bfc6b521#2
type: http://lodlaundromat.org/.well-known/genid/b1d777ae0029e5815eb2dfe2bfc6b521#7

Dublin Core Metadata Element Set, Version 1.1
modified: 2012-06-14
publisher: DCMI
type: Ontology
type: http://lodlaundromat.org/.well-known/genid/87b3155a45f739091dc1b4f71dafba5d#6
type: http://lodlaundromat.org/.well-known/genid/87b3155a45f739091dc1b4f71dafba5d#2
type: http://lodlaundromat.org/.well-known/genid/87b3155a45f739091dc1b4f71dafba5d#1
type: http://lodlaundromat.org/.well-known/genid/87b3155a45f739091dc1b4f71dafba5d#14
type: Thing
type: http://lodlaundromat.org/.well-known/genid/b1d777ae0029e5815eb2dfe2bfc6b521#2
type: http://lodlaundromat.org/.well-known/genid/b1d777ae0029e5815eb2dfe2bfc6b521#7
type: http://lodlaundromat.org/.well-known/genid/b1d777ae0029e5815eb2dfe2bfc6b521#6
type: http://lodlaundromat.org/.well-known/genid/87b3155a45f739091dc1b4f71dafba5d#12
type: http://lodlaundromat.org/.well-known/genid/b1d777ae0029e5815eb2dfe2bfc6b521#5
type: http://lodlaundromat.org/.well-known/genid/87b3155a45f739091dc1b4f71dafba5d#13

Title
has version: title-006
issued: 1999-07-02
modified: 2008-01-14
type: Property
comment: A name given to the resource.
note: A second property with the same name as this property has been declared in the dcterms: namespace (http://purl.org/dc/terms/). See the Introduction to the document "DCMI Metadata Terms" (http://dublincore.org/documents/dcmi-terms/) for an explanation.

ask
type: Function
subclass of: Functions
comment: Executes a given ASK query and returns its boolean result. The first argument must point to an sp:Ask or a SPIN template call that has an ASK query as its body. All subsequent argument can come in pairs, with the first one being a variable name and the second its binding. Example: BIND (spin:ask(?query, "this", owl:Thing) AS ?result) will execute the sp:Ask behind ?query with the variable ?this pre-bound to owl:Thing.
type: Class
type: Module

_this
type: Variable
comment: A system variable representing the current context instance in a rule or constraint.
var name: this

High Income Nation Use
type: Prohibition
comment: use in a non-developing country

date
type: DatatypeProperty
range: DateUnion
type: Property
range: Resource

CVS Format
description: A comma separated values (CSV) file is a computer data file used for implementing the tried and true organizational tool, the Comma Separated List. The CSV file is used for the digital storage of data structured in a table of lists form. Each line in the CSV file corresponds to a row in the table. Within a line, fields are separated by commas, and each field belongs to one table column. CSV files are often used for moving tabular data between two different computer programs (like moving between a database program and a spreadsheet program).
type: Data Format
type: http://lodlaundromat.org/.well-known/genid/87b3155a45f739091dc1b4f71dafba5d#3
type: Thing
type: Category
type: http://lodlaundromat.org/.well-known/genid/87b3155a45f739091dc1b4f71dafba5d#14
type: http://lodlaundromat.org/.well-known/genid/87b3155a45f739091dc1b4f71dafba5d#6
type: http://lodlaundromat.org/.well-known/genid/87b3155a45f739091dc1b4f71dafba5d#2
type: http://lodlaundromat.org/.well-known/genid/87b3155a45f739091dc1b4f71dafba5d#1
type: http://lodlaundromat.org/.well-known/genid/b1d777ae0029e5815eb2dfe2bfc6b521#2
type: http://lodlaundromat.org/.well-known/genid/b1d777ae0029e5815eb2dfe2bfc6b521#7

Creative Commons Attribution-Share Alike 3.0 United States License
permits: Derivative Works
permits: Distribution
requires: Attribution
requires: Share Alike
type: License
type: Thing
type: http://lodlaundromat.org/.well-known/genid/87b3155a45f739091dc1b4f71dafba5d#11
type: LicenseDocument
type: http://lodlaundromat.org/.well-known/genid/b1d777ae0029e5815eb2dfe2bfc6b521#1
type: http://lodlaundromat.org/.well-known/genid/87b3155a45f739091dc1b4f71dafba5d#14
type: http://lodlaundromat.org/.well-known/genid/87b3155a45f739091dc1b4f71dafba5d#6
type: http://lodlaundromat.org/.well-known/genid/87b3155a45f739091dc1b4f71dafba5d#2
type: http://lodlaundromat.org/.well-known/genid/87b3155a45f739091dc1b4f71dafba5d#1
type: http://lodlaundromat.org/.well-known/genid/b1d777ae0029e5815eb2dfe2bfc6b521#2
type: http://lodlaundromat.org/.well-known/genid/b1d777ae0029e5815eb2dfe2bfc6b521#7

Type
description: Recommended best practice is to use a controlled vocabulary such as the DCMI Type Vocabulary [DCMITYPE]. To describe the file format, physical medium, or dimensions of the resource, use the Format element.
has version: type-006
issued: 1999-07-02
modified: 2008-01-14
type: Property
comment: The nature or genre of the resource.
note: A second property with the same name as this property has been declared in the dcterms: namespace (http://purl.org/dc/terms/). See the Introduction to the document "DCMI Metadata Terms" (http://dublincore.org/documents/dcmi-terms/) for an explanation.

cachable
type: Property
sub property of: system property
range: boolean
domain: Function
comment: Can be set to true to instruct the SPIN engine that it may cache the results of all calls to the associated function. Functions should only be marked as cachable if the same combination of input arguments always returns the same result. Functions that query a graph or other background data that may change over time should not be cached. Caching can significantly improve performance of frequently needed functions.
range: Resource
domain: Module
domain: Resource
domain: Class

Warning
type: Constraint violation level
comment: Indicates that the associated constraint violation is a problem that may not have to be fixed but may lead to issues in the future.

http://lodlaundromat.org/.well-known/genid/9fb05f53ba0c66117a615cb1cd805aaa#4
type: Attribute
comment: The UPDATE command wrapped by this template.
value type: Update
predicate: body
min count: 0
max count: 1
type: Query
type: Command

Creative Commons Ontology
attributed source: TopQuadrant attribution
description: Creative Commons Ontology, extending RDF file at http://creativecommons.org/schema.rdf
attribution URL: http://www.topquadrant.com
version info: $Id: cc.n3 1348 2009-08-20 00:39:32Z RalphHodgson $
revision: $Revision: 1348 $
date: $Date: 2009-08-20 02:39:32 +0200 (Thu, 20 Aug 2009) $
Rights: Creative Commons Attribution-Share Alike 3.0 United States License
imports: schema.rdf
has license: Creative Commons Attribution-Share Alike 3.0 United States License
imports: Dublin Core Metadata Element Set, Version 1.1
Source: www.oegov.org
type: Ontology
creator: Ralph Hodgson
type: Work
type: Thing
license: Creative Commons Attribution-Share Alike 3.0 United States License
type: http://lodlaundromat.org/.well-known/genid/87b3155a45f739091dc1b4f71dafba5d#6
type: http://lodlaundromat.org/.well-known/genid/87b3155a45f739091dc1b4f71dafba5d#2
type: http://lodlaundromat.org/.well-known/genid/87b3155a45f739091dc1b4f71dafba5d#1
type: http://lodlaundromat.org/.well-known/genid/87b3155a45f739091dc1b4f71dafba5d#14
type: http://lodlaundromat.org/.well-known/genid/b1d777ae0029e5815eb2dfe2bfc6b521#2
type: http://lodlaundromat.org/.well-known/genid/b1d777ae0029e5815eb2dfe2bfc6b521#7
type: http://lodlaundromat.org/.well-known/genid/b1d777ae0029e5815eb2dfe2bfc6b521#6
type: http://lodlaundromat.org/.well-known/genid/87b3155a45f739091dc1b4f71dafba5d#12
type: http://lodlaundromat.org/.well-known/genid/b1d777ae0029e5815eb2dfe2bfc6b521#5
type: http://lodlaundromat.org/.well-known/genid/87b3155a45f739091dc1b4f71dafba5d#13

Sharing
type: Permission
comment: permits commercial derivatives, but only non-commercial distribution

arg5
type: Variable
var name: arg5

XSL Format
type: Data Format
type: http://lodlaundromat.org/.well-known/genid/87b3155a45f739091dc1b4f71dafba5d#3
type: Thing
type: Category
type: http://lodlaundromat.org/.well-known/genid/87b3155a45f739091dc1b4f71dafba5d#14
type: http://lodlaundromat.org/.well-known/genid/87b3155a45f739091dc1b4f71dafba5d#6
type: http://lodlaundromat.org/.well-known/genid/87b3155a45f739091dc1b4f71dafba5d#2
type: http://lodlaundromat.org/.well-known/genid/87b3155a45f739091dc1b4f71dafba5d#1
type: http://lodlaundromat.org/.well-known/genid/b1d777ae0029e5815eb2dfe2bfc6b521#2
type: http://lodlaundromat.org/.well-known/genid/b1d777ae0029e5815eb2dfe2bfc6b521#7

eval
type: Function
subclass of: Functions
comment: Evaluates a given SPIN expression or SELECT or ASK query, and returns its result. The first argument must be the expression in SPIN RDF syntax. All other arguments must come in pairs: first a property name, and then a value. These name/value pairs will be pre-bound variables for the execution of the expression.
type: Class
type: Module

symbol
type: Property
sub property of: system property
range: string
domain: Function
comment: The symbol of a function, e.g. "=" for the eq function.
range: Resource
domain: Module
domain: Resource
domain: Class