model
subclass of: Resource
type: Class
subclass of: Thing
subclass of: discourse element
comment: A description of a model used or produced by the work described in the publication.

data
subclass of: Resource
type: Class
subclass of: Thing
subclass of: discourse element
comment: A textual description of data used or produced in the work which the document describes, or the data themselves.

introduction
subclass of: Resource
type: Class
subclass of: Thing
subclass of: Introduction
equivalent class: Introduction
subclass of: discourse element
comment: An initial description which states the purpose and goals of the following writing, and, in the case of journal articles, typically includes background information on the research topic and a review of related work in the area.

http://lodlaundromat.org/.well-known/genid/1035a7c7a9b194dabf1cc21a3fd99a64#114
subclass of: Resource
type: Class
subclass of: Thing
type: Restriction
on property: can contain homonymous elements
has value: true
subclass of: structured element
subclass of: pattern-based element

bibliographic reference
subclass of: Resource
type: Class
subclass of: Thing
subclass of: References
subclass of: reference
comment: A reference, usually contained in a footnote or a bibliographic reference list, that refer to another publication, such as a journal article, a book, a book chapter or a Web site. The inclusion of the bibliographic reference in a publication constitutes the performative act of bibliographic citation.
subclass of: discourse element

has part
range: Thing
domain: Thing
sub property of: topObjectProperty
type: ObjectProperty
type: TransitiveProperty
comment: A related resource that is included either physically or logically in the described resource.
inverse of: is part of
sub property of: has relation
type: Property
domain: Resource
range: Resource

marker element
subclass of: Resource
type: Class
subclass of: Thing
subclass of: http://lodlaundromat.org/.well-known/genid/1035a7c7a9b194dabf1cc21a3fd99a64#84
subclass of: http://lodlaundromat.org/.well-known/genid/1035a7c7a9b194dabf1cc21a3fd99a64#85
subclass of: non-structured element
subclass of: non-textual element
comment: The class of elements that can contain neither text nodes nor elements.
subclass of: pattern-based element
disjoint with: bucket element

pattern-based element
subclass of: Resource
type: Class
subclass of: Thing
comment: A structural pattern is an atomic component of a document, that is able to capture a recurrent and well knwon structure of a document. Any entity belonging to this class is compliant with exactly one structural pattern.

has relation
range: Thing
domain: Thing
type: ObjectProperty
type: SymmetricProperty
comment: A related resource.
sub property of: topObjectProperty
type: Property
domain: Resource
range: Resource

is part of
inverse of: has part
sub property of: topObjectProperty
range: Thing
domain: Thing
type: ObjectProperty
type: TransitiveProperty
comment: A related resource in which the described resource is physically or logically included.
sub property of: has relation
type: Property
domain: Resource
range: Resource

http://lodlaundromat.org/.well-known/genid/1035a7c7a9b194dabf1cc21a3fd99a64#108
subclass of: Resource
type: Class
subclass of: Thing
type: Restriction
on property: can contain homonymous elements
has value: false
subclass of: structured element
subclass of: pattern-based element

discourse element
subclass of: Resource
type: Class
subclass of: Thing
comment: An element of a document that carries out a rhetorical function.

structured element
subclass of: Thing
subclass of: Resource
type: Class
subclass of: pattern-based element
comment: The class of elements that can contain other elements.
disjoint with: non-structured element

legend
subclass of: Resource
type: Class
subclass of: Thing
subclass of: caption
comment: Informative text that explicitly explains another item, such as a figure or a table.
subclass of: discourse element

atom element
subclass of: http://lodlaundromat.org/.well-known/genid/1035a7c7a9b194dabf1cc21a3fd99a64#20
subclass of: http://lodlaundromat.org/.well-known/genid/1035a7c7a9b194dabf1cc21a3fd99a64#1
subclass of: Resource
subclass of: Thing
type: Class
subclass of: http://lodlaundromat.org/.well-known/genid/1035a7c7a9b194dabf1cc21a3fd99a64#61
equivalent class: http://lodlaundromat.org/.well-known/genid/1035a7c7a9b194dabf1cc21a3fd99a64#1
subclass of: http://lodlaundromat.org/.well-known/genid/1035a7c7a9b194dabf1cc21a3fd99a64#8
disjoint with: field element
comment: This class is defined to describe literal text that is part of the document body. Moreover, similarly to Inline, elements following the Atom pattern can only be contained within block or inline elements (and consequently they also cannot be used as root elements of documents). It can contain textual content and no other elements.
subclass of: http://lodlaundromat.org/.well-known/genid/1035a7c7a9b194dabf1cc21a3fd99a64#4
subclass of: flat element
subclass of: non-structured element
subclass of: http://lodlaundromat.org/.well-known/genid/1035a7c7a9b194dabf1cc21a3fd99a64#84
subclass of: pattern-based element
subclass of: textual element

non-textual element
subclass of: Resource
type: Class
subclass of: Thing
subclass of: http://lodlaundromat.org/.well-known/genid/1035a7c7a9b194dabf1cc21a3fd99a64#85
equivalent class: http://lodlaundromat.org/.well-known/genid/1035a7c7a9b194dabf1cc21a3fd99a64#85
subclass of: pattern-based element
disjoint with: textual element
comment: The class of elements that cannot have textual content in their content models.

prologue
subclass of: Resource
type: Class
subclass of: Thing
subclass of: discourse element
comment: A piece of writing at the beginning of a work of literature or drama, usually used to set the scene or to introduce the work.

caption
subclass of: Resource
type: Class
subclass of: Thing
subclass of: discourse element
comment: Text accompanying another item, such as a picture.

discussion
subclass of: Resource
type: Class
subclass of: Thing
subclass of: Discussion
equivalent class: Discussion
subclass of: discourse element
comment: An interpretation and discussion of the results obtained and an analysis of their significance, in support of conclusions. These conclusions may be part of this discussion or may be included in a separate section of the document.

evaluation
subclass of: Resource
type: Class
subclass of: Thing
subclass of: Evaluation
equivalent class: Evaluation
subclass of: discourse element
comment: A consideration of the value, meaning and significance of the results obtained.

popup element
subclass of: http://lodlaundromat.org/.well-known/genid/1035a7c7a9b194dabf1cc21a3fd99a64#29
subclass of: Thing
type: Class
subclass of: http://lodlaundromat.org/.well-known/genid/1035a7c7a9b194dabf1cc21a3fd99a64#61
subclass of: http://lodlaundromat.org/.well-known/genid/1035a7c7a9b194dabf1cc21a3fd99a64#42
subclass of: http://lodlaundromat.org/.well-known/genid/1035a7c7a9b194dabf1cc21a3fd99a64#86
subclass of: http://lodlaundromat.org/.well-known/genid/1035a7c7a9b194dabf1cc21a3fd99a64#16
subclass of: http://lodlaundromat.org/.well-known/genid/1035a7c7a9b194dabf1cc21a3fd99a64#70
subclass of: http://lodlaundromat.org/.well-known/genid/1035a7c7a9b194dabf1cc21a3fd99a64#20
subclass of: Resource
equivalent class: http://lodlaundromat.org/.well-known/genid/1035a7c7a9b194dabf1cc21a3fd99a64#86
subclass of: http://lodlaundromat.org/.well-known/genid/1035a7c7a9b194dabf1cc21a3fd99a64#93
subclass of: http://lodlaundromat.org/.well-known/genid/1035a7c7a9b194dabf1cc21a3fd99a64#97
comment: This class defines bucket elements that are only present within block and inline elements. Popup elements are used whenever complex structures need to be placed within content elements such as paragraphs.
subclass of: http://lodlaundromat.org/.well-known/genid/1035a7c7a9b194dabf1cc21a3fd99a64#89
subclass of: bucket element
subclass of: pattern-based element
subclass of: http://lodlaundromat.org/.well-known/genid/1035a7c7a9b194dabf1cc21a3fd99a64#85
subclass of: non-textual element
subclass of: structured element
disjoint with: container element

milestone element
subclass of: Resource
subclass of: http://lodlaundromat.org/.well-known/genid/1035a7c7a9b194dabf1cc21a3fd99a64#73
subclass of: Thing
subclass of: http://lodlaundromat.org/.well-known/genid/1035a7c7a9b194dabf1cc21a3fd99a64#61
subclass of: http://lodlaundromat.org/.well-known/genid/1035a7c7a9b194dabf1cc21a3fd99a64#20
type: Class
equivalent class: http://lodlaundromat.org/.well-known/genid/1035a7c7a9b194dabf1cc21a3fd99a64#73
subclass of: http://lodlaundromat.org/.well-known/genid/1035a7c7a9b194dabf1cc21a3fd99a64#80
comment: This class describe elements that contain neither other elements nor textual content. Moreover, similarly to Inline, elements following the Milestone pattern can only be contained within block or inline elements (and consequently they also cannot be used as root elements of documents). The distinctive characteristic of the pattern Milestone is the location it assumes within the document.
subclass of: http://lodlaundromat.org/.well-known/genid/1035a7c7a9b194dabf1cc21a3fd99a64#76
subclass of: marker element
subclass of: non-textual element
subclass of: http://lodlaundromat.org/.well-known/genid/1035a7c7a9b194dabf1cc21a3fd99a64#85
subclass of: pattern-based element
subclass of: non-structured element
subclass of: http://lodlaundromat.org/.well-known/genid/1035a7c7a9b194dabf1cc21a3fd99a64#84
disjoint with: meta element

dataset description
subclass of: Resource
type: Class
subclass of: Thing
subclass of: external resource description
comment: Information describing a dataset held in an external database or repository and including a reference to it, such as a database ID or an accession number.
subclass of: http://lodlaundromat.org/.well-known/genid/54bc63b489957b9b4bc7b64032777f8a#4
subclass of: discourse element
subclass of: http://lodlaundromat.org/.well-known/genid/54bc63b489957b9b4bc7b64032777f8a#1

contains as header
range: Thing
domain: Thing
type: ObjectProperty
comment: A structured element contains another generic element as part of its header.
sub property of: contains
inverse of: is contained by as header
type: Property
domain: structured element
domain: Resource
domain: pattern-based element
range: Resource

bucket element
subclass of: http://lodlaundromat.org/.well-known/genid/1035a7c7a9b194dabf1cc21a3fd99a64#85
subclass of: Resource
type: Class
subclass of: Thing
subclass of: non-textual element
subclass of: structured element
disjoint with: marker element
comment: The class of elements that can contain other elements but no text nodes.
subclass of: pattern-based element

container element
subclass of: http://lodlaundromat.org/.well-known/genid/1035a7c7a9b194dabf1cc21a3fd99a64#25
subclass of: http://lodlaundromat.org/.well-known/genid/1035a7c7a9b194dabf1cc21a3fd99a64#42
subclass of: http://lodlaundromat.org/.well-known/genid/1035a7c7a9b194dabf1cc21a3fd99a64#98
subclass of: Resource
subclass of: http://lodlaundromat.org/.well-known/genid/1035a7c7a9b194dabf1cc21a3fd99a64#16
subclass of: http://lodlaundromat.org/.well-known/genid/1035a7c7a9b194dabf1cc21a3fd99a64#33
subclass of: http://lodlaundromat.org/.well-known/genid/1035a7c7a9b194dabf1cc21a3fd99a64#29
subclass of: Thing
type: Class
subclass of: http://lodlaundromat.org/.well-known/genid/1035a7c7a9b194dabf1cc21a3fd99a64#70
equivalent class: http://lodlaundromat.org/.well-known/genid/1035a7c7a9b194dabf1cc21a3fd99a64#25
subclass of: http://lodlaundromat.org/.well-known/genid/1035a7c7a9b194dabf1cc21a3fd99a64#32
disjoint with: popup element
comment: This class concerns the structural organization of a document. Elements following this pattern contain no textual content and contain only elements compliant with the patterns: Meta, Field, Block and any subtype of Container. It is disjointed with the pattern Popup, although they share the same content model.
subclass of: http://lodlaundromat.org/.well-known/genid/1035a7c7a9b194dabf1cc21a3fd99a64#28
subclass of: pattern-based element
subclass of: structured element
subclass of: non-textual element
subclass of: http://lodlaundromat.org/.well-known/genid/1035a7c7a9b194dabf1cc21a3fd99a64#85
subclass of: bucket element

problem statement
subclass of: Resource
type: Class
subclass of: Thing
subclass of: discourse element
description: A concise description of the issues that needed to be addressed by a work described in the document.

epilogue
subclass of: Resource
type: Class
subclass of: Thing
subclass of: discourse element
comment: A piece of writing at the end of a work of literature or drama, usually used to bring closure to the work.

future work
subclass of: Resource
type: Class
subclass of: Thing
subclass of: discourse element
comment: A proposal for new investigation to be undertaken in order to continue and advance the work described in the publication.

block element
subclass of: Resource
subclass of: http://lodlaundromat.org/.well-known/genid/1035a7c7a9b194dabf1cc21a3fd99a64#98
subclass of: http://lodlaundromat.org/.well-known/genid/1035a7c7a9b194dabf1cc21a3fd99a64#77
subclass of: http://lodlaundromat.org/.well-known/genid/1035a7c7a9b194dabf1cc21a3fd99a64#81
subclass of: http://lodlaundromat.org/.well-known/genid/1035a7c7a9b194dabf1cc21a3fd99a64#33
subclass of: http://lodlaundromat.org/.well-known/genid/1035a7c7a9b194dabf1cc21a3fd99a64#5
subclass of: http://lodlaundromat.org/.well-known/genid/1035a7c7a9b194dabf1cc21a3fd99a64#9
subclass of: http://lodlaundromat.org/.well-known/genid/1035a7c7a9b194dabf1cc21a3fd99a64#94
subclass of: http://lodlaundromat.org/.well-known/genid/1035a7c7a9b194dabf1cc21a3fd99a64#53
subclass of: Thing
subclass of: http://lodlaundromat.org/.well-known/genid/1035a7c7a9b194dabf1cc21a3fd99a64#57
subclass of: http://lodlaundromat.org/.well-known/genid/1035a7c7a9b194dabf1cc21a3fd99a64#90
type: Class
subclass of: http://lodlaundromat.org/.well-known/genid/1035a7c7a9b194dabf1cc21a3fd99a64#12
equivalent class: http://lodlaundromat.org/.well-known/genid/1035a7c7a9b194dabf1cc21a3fd99a64#12
subclass of: http://lodlaundromat.org/.well-known/genid/1035a7c7a9b194dabf1cc21a3fd99a64#19
disjoint with: inline element
comment: This class organise the document content as a sequence of nestable elements and text nodes. In particular, elements following this pattern can contain text and other elements compliant with the patterns Inline, Atom, Milestones and Popup, which will be introduced in the following. Furthermore, it is a requirement that block elements are contained only by container and popup elements
subclass of: http://lodlaundromat.org/.well-known/genid/1035a7c7a9b194dabf1cc21a3fd99a64#15
subclass of: mixed element
subclass of: pattern-based element
subclass of: structured element
subclass of: textual element

supplementary information description
subclass of: Resource
type: Class
subclass of: Thing
subclass of: external resource description
comment: Information describing supplementary information relating to the document, including references or links to the relevant supplementary information.
subclass of: http://lodlaundromat.org/.well-known/genid/54bc63b489957b9b4bc7b64032777f8a#4
subclass of: http://lodlaundromat.org/.well-known/genid/54bc63b489957b9b4bc7b64032777f8a#1
subclass of: discourse element

author contribution
subclass of: Resource
type: Class
subclass of: Thing
subclass of: discourse element
comment: A description of the roles played by an author in the publication.

results
subclass of: Resource
type: Class
subclass of: Thing
subclass of: Results
equivalent class: Results
subclass of: discourse element
comment: The report of the specific findings of an investigation, given without discussion or conclusion being drawn.

meta element
subclass of: http://lodlaundromat.org/.well-known/genid/1035a7c7a9b194dabf1cc21a3fd99a64#98
subclass of: Resource
type: Class
subclass of: Thing
subclass of: http://lodlaundromat.org/.well-known/genid/1035a7c7a9b194dabf1cc21a3fd99a64#66
subclass of: http://lodlaundromat.org/.well-known/genid/1035a7c7a9b194dabf1cc21a3fd99a64#33
equivalent class: http://lodlaundromat.org/.well-known/genid/1035a7c7a9b194dabf1cc21a3fd99a64#66
disjoint with: milestone element
comment: This class describes elements that contain neither other elements nor textual content. Contrarily to the pattern Milestone, which was meant to describe markup elements that impact the document because of their location, the main feature of its disjoint sibling is the mere existence, independently from the position it has within the document. Meta elements convey metadata information about the document or part of it, independently of where they are. Thus, meta elements can be contained only within container elements.
subclass of: http://lodlaundromat.org/.well-known/genid/1035a7c7a9b194dabf1cc21a3fd99a64#69
subclass of: marker element
subclass of: pattern-based element
subclass of: http://lodlaundromat.org/.well-known/genid/1035a7c7a9b194dabf1cc21a3fd99a64#85
subclass of: non-textual element
subclass of: http://lodlaundromat.org/.well-known/genid/1035a7c7a9b194dabf1cc21a3fd99a64#84
subclass of: non-structured element

scenario
subclass of: Resource
type: Class
subclass of: Thing
subclass of: Scenario
equivalent class: Scenario
subclass of: discourse element
comment: A presentation of a use case or test, based on a real or hypothetical situation, used to help someone think through a complex problem or system.

textual element
subclass of: Resource
type: Class
subclass of: Thing
subclass of: pattern-based element
comment: The class of elements that can have textual content in their content models.
disjoint with: non-textual element

postscript
subclass of: Resource
type: Class
subclass of: Thing
subclass of: discourse element
comment: Text added after the signature of a letter, or sometimes after the main body of an essay or book.

related work
subclass of: Resource
type: Class
subclass of: Thing
subclass of: discourse element
comment: The authors' critical review of current knowledge by specific reference to others' work, both in terms of substantive findings and theoretical and methodological contributions to a particular topic. This description is often included within the introduction section.

is contained by as header
inverse of: contains as header
range: Thing
domain: Thing
type: ObjectProperty
comment: An element is contained by another structured element as part of its header.
sub property of: is contained by
type: Property
domain: Resource
range: structured element
range: Resource
range: pattern-based element

non-structured element
subclass of: Resource
type: Class
subclass of: Thing
subclass of: http://lodlaundromat.org/.well-known/genid/1035a7c7a9b194dabf1cc21a3fd99a64#84
equivalent class: http://lodlaundromat.org/.well-known/genid/1035a7c7a9b194dabf1cc21a3fd99a64#84
subclass of: pattern-based element
disjoint with: structured element
comment: The class of elements that cannot contain other elements.

mixed element
subclass of: Resource
type: Class
subclass of: Thing
subclass of: structured element
subclass of: textual element
comment: The class of elements that can contain other elements and text nodes.
subclass of: pattern-based element
disjoint with: flat element

motivation
subclass of: Resource
type: Class
subclass of: Thing
subclass of: Motivation
equivalent class: Motivation
subclass of: discourse element
comment: A description of the justification for undertaking the work described in the publication.

reference
subclass of: Resource
type: Class
subclass of: Thing
subclass of: discourse element
comment: A reference to a specific part of the document, or to another publication.

flat element
subclass of: http://lodlaundromat.org/.well-known/genid/1035a7c7a9b194dabf1cc21a3fd99a64#84
subclass of: Resource
type: Class
subclass of: Thing
subclass of: non-structured element
subclass of: textual element
disjoint with: mixed element
comment: The class of elements that can contain text nodes but no elements.
subclass of: pattern-based element

external resource description
subclass of: Resource
type: Class
subclass of: Thing
subclass of: http://lodlaundromat.org/.well-known/genid/54bc63b489957b9b4bc7b64032777f8a#1
comment: Information describing an external resource and including a reference to that resource.
subclass of: http://lodlaundromat.org/.well-known/genid/54bc63b489957b9b4bc7b64032777f8a#4
subclass of: discourse element

contribution
subclass of: Resource
type: Class
subclass of: Thing
subclass of: Contribution
equivalent class: Contribution
subclass of: discourse element
comment: A description of the part that this publication plays in the overall field.

http://lodlaundromat.org/.well-known/genid/1035a7c7a9b194dabf1cc21a3fd99a64#112
subclass of: Resource
type: Class
subclass of: Thing
type: Restriction
on property: can contain heteronymous elements
has value: false
subclass of: pattern-based element
subclass of: structured element

headed-container element
subclass of: Resource
type: Class
subclass of: Thing
subclass of: http://lodlaundromat.org/.well-known/genid/1035a7c7a9b194dabf1cc21a3fd99a64#45
comment: This class describes container elements whose content model need to begin with one or more block elements (the heading), specified through the property containsAsHeader.
subclass of: http://lodlaundromat.org/.well-known/genid/1035a7c7a9b194dabf1cc21a3fd99a64#48
subclass of: http://lodlaundromat.org/.well-known/genid/1035a7c7a9b194dabf1cc21a3fd99a64#32
subclass of: http://lodlaundromat.org/.well-known/genid/1035a7c7a9b194dabf1cc21a3fd99a64#28
subclass of: container element
subclass of: bucket element
subclass of: http://lodlaundromat.org/.well-known/genid/1035a7c7a9b194dabf1cc21a3fd99a64#25
subclass of: http://lodlaundromat.org/.well-known/genid/1035a7c7a9b194dabf1cc21a3fd99a64#85
subclass of: non-textual element
subclass of: pattern-based element
subclass of: structured element
subclass of: http://lodlaundromat.org/.well-known/genid/1035a7c7a9b194dabf1cc21a3fd99a64#16
subclass of: http://lodlaundromat.org/.well-known/genid/1035a7c7a9b194dabf1cc21a3fd99a64#70
subclass of: http://lodlaundromat.org/.well-known/genid/1035a7c7a9b194dabf1cc21a3fd99a64#42
subclass of: http://lodlaundromat.org/.well-known/genid/1035a7c7a9b194dabf1cc21a3fd99a64#33
subclass of: http://lodlaundromat.org/.well-known/genid/1035a7c7a9b194dabf1cc21a3fd99a64#98
subclass of: http://lodlaundromat.org/.well-known/genid/1035a7c7a9b194dabf1cc21a3fd99a64#29

is contained by
range: Thing
domain: Thing
range: structured element
inverse of: contains
type: ObjectProperty
comment: An element that is contained by another structured element.
type: Property
domain: Resource
range: Resource
range: pattern-based element

table element
subclass of: Resource
subclass of: http://lodlaundromat.org/.well-known/genid/1035a7c7a9b194dabf1cc21a3fd99a64#109
subclass of: Thing
type: Class
equivalent class: http://lodlaundromat.org/.well-known/genid/1035a7c7a9b194dabf1cc21a3fd99a64#109
comment: This class describes container elements that must contain only homogeneous elements (but they can be repeated).
subclass of: http://lodlaundromat.org/.well-known/genid/1035a7c7a9b194dabf1cc21a3fd99a64#32
subclass of: http://lodlaundromat.org/.well-known/genid/1035a7c7a9b194dabf1cc21a3fd99a64#114
subclass of: http://lodlaundromat.org/.well-known/genid/1035a7c7a9b194dabf1cc21a3fd99a64#28
subclass of: http://lodlaundromat.org/.well-known/genid/1035a7c7a9b194dabf1cc21a3fd99a64#112
subclass of: container element
subclass of: bucket element
subclass of: http://lodlaundromat.org/.well-known/genid/1035a7c7a9b194dabf1cc21a3fd99a64#25
subclass of: structured element
subclass of: pattern-based element
subclass of: non-textual element
subclass of: http://lodlaundromat.org/.well-known/genid/1035a7c7a9b194dabf1cc21a3fd99a64#85
subclass of: http://lodlaundromat.org/.well-known/genid/1035a7c7a9b194dabf1cc21a3fd99a64#33
subclass of: http://lodlaundromat.org/.well-known/genid/1035a7c7a9b194dabf1cc21a3fd99a64#70
subclass of: http://lodlaundromat.org/.well-known/genid/1035a7c7a9b194dabf1cc21a3fd99a64#42
subclass of: http://lodlaundromat.org/.well-known/genid/1035a7c7a9b194dabf1cc21a3fd99a64#16
subclass of: http://lodlaundromat.org/.well-known/genid/1035a7c7a9b194dabf1cc21a3fd99a64#98
subclass of: http://lodlaundromat.org/.well-known/genid/1035a7c7a9b194dabf1cc21a3fd99a64#29

inline element
subclass of: http://lodlaundromat.org/.well-known/genid/1035a7c7a9b194dabf1cc21a3fd99a64#61
subclass of: http://lodlaundromat.org/.well-known/genid/1035a7c7a9b194dabf1cc21a3fd99a64#57
subclass of: http://lodlaundromat.org/.well-known/genid/1035a7c7a9b194dabf1cc21a3fd99a64#94
subclass of: Thing
subclass of: http://lodlaundromat.org/.well-known/genid/1035a7c7a9b194dabf1cc21a3fd99a64#81
subclass of: http://lodlaundromat.org/.well-known/genid/1035a7c7a9b194dabf1cc21a3fd99a64#5
subclass of: http://lodlaundromat.org/.well-known/genid/1035a7c7a9b194dabf1cc21a3fd99a64#90
subclass of: http://lodlaundromat.org/.well-known/genid/1035a7c7a9b194dabf1cc21a3fd99a64#77
subclass of: http://lodlaundromat.org/.well-known/genid/1035a7c7a9b194dabf1cc21a3fd99a64#53
subclass of: http://lodlaundromat.org/.well-known/genid/1035a7c7a9b194dabf1cc21a3fd99a64#20
type: Class
subclass of: http://lodlaundromat.org/.well-known/genid/1035a7c7a9b194dabf1cc21a3fd99a64#9
subclass of: http://lodlaundromat.org/.well-known/genid/1035a7c7a9b194dabf1cc21a3fd99a64#49
subclass of: Resource
equivalent class: http://lodlaundromat.org/.well-known/genid/1035a7c7a9b194dabf1cc21a3fd99a64#49
subclass of: http://lodlaundromat.org/.well-known/genid/1035a7c7a9b194dabf1cc21a3fd99a64#56
subclass of: http://lodlaundromat.org/.well-known/genid/1035a7c7a9b194dabf1cc21a3fd99a64#60
comment: This class has the same use and content model of the pattern Block, but differing primarily because a) inline elements can contain other elements compliant with the same pattern while block elements cannot, and b) inline elements must always be contained by other block or inline elements and by no other type of element. These constraints also imply that inline elements cannot be used as root elements of documents and that the class Block is disjoint with the class Inline (i.e., a markup element cannot be a block and an inline at the same time).
subclass of: http://lodlaundromat.org/.well-known/genid/1035a7c7a9b194dabf1cc21a3fd99a64#52
subclass of: mixed element
subclass of: structured element
subclass of: pattern-based element
subclass of: textual element
disjoint with: block element

materials
subclass of: Resource
type: Class
subclass of: Thing
subclass of: discourse element
comment: A description in a research paper documenting the specialized materials used in the work described. This description is often combined with a description of the methods used, in a section entitled 'Methods and Materials', 'Experimental' or a related term.

contains
range: Thing
domain: Thing
type: ObjectProperty
comment: A structured element contains another generic element.
domain: structured element
inverse of: is contained by
type: Property
domain: pattern-based element
domain: Resource
range: Resource

http://lodlaundromat.org/.well-known/genid/1035a7c7a9b194dabf1cc21a3fd99a64#106
subclass of: Resource
type: Class
subclass of: Thing
type: Restriction
on property: can contain heteronymous elements
has value: true
subclass of: pattern-based element
subclass of: structured element

acknowledgements
subclass of: Resource
type: Class
subclass of: Thing
subclass of: Acknowledgements
equivalent class: Acknowledgements
subclass of: discourse element
comment: Usually part of the preface, or a separate section in its own right, often as part of the back matter, it acknowledges those, including funding agencies, who contributed to the undertaking of a research project described in a publication, or to the creation of the work in some way. In scientific articles, the acknowledgements are usually placed as a separated section immediately following the Discussion or Conclusions.

field element
subclass of: http://lodlaundromat.org/.well-known/genid/1035a7c7a9b194dabf1cc21a3fd99a64#98
subclass of: http://lodlaundromat.org/.well-known/genid/1035a7c7a9b194dabf1cc21a3fd99a64#33
subclass of: Resource
type: Class
subclass of: Thing
subclass of: http://lodlaundromat.org/.well-known/genid/1035a7c7a9b194dabf1cc21a3fd99a64#38
equivalent class: http://lodlaundromat.org/.well-known/genid/1035a7c7a9b194dabf1cc21a3fd99a64#38
comment: This class is defined to describe literal metadata or text that is not really part of the document body, contrarily to its disjointed sibling Atom. Its main difference with Meta is that Field can contain textual content.
subclass of: http://lodlaundromat.org/.well-known/genid/1035a7c7a9b194dabf1cc21a3fd99a64#41
subclass of: flat element
subclass of: pattern-based element
subclass of: non-structured element
subclass of: http://lodlaundromat.org/.well-known/genid/1035a7c7a9b194dabf1cc21a3fd99a64#84
subclass of: textual element
disjoint with: atom element

methods
subclass of: Resource
type: Class
subclass of: Thing
subclass of: Methods
equivalent class: Methods
subclass of: discourse element
comment: A description in a research paper documenting the specialized methods used in the work described. This description is often combined with a description of the materials used, in a section entitled 'Methods and Materials', 'Experimental' or a related term.

biography
subclass of: Resource
type: Class
subclass of: Thing
subclass of: discourse element
comment: Information describing a person and his or her life history and contributions.

background
subclass of: Resource
type: Class
subclass of: Thing
subclass of: Background
equivalent class: Background
subclass of: discourse element
comment: Presentation of information that is essential for understanding the situation or problem that is the subject of the publication. In a journal article, the background is usually part of the Introduction, but may be present as separated section.

dedication
subclass of: Resource
type: Class
subclass of: Thing
subclass of: discourse element
comment: Text in which the author names the person or people for whom he/she has written the document, or to whose memory it is dedicated.

record element
subclass of: Resource
subclass of: http://lodlaundromat.org/.well-known/genid/1035a7c7a9b194dabf1cc21a3fd99a64#103
type: Class
subclass of: Thing
equivalent class: http://lodlaundromat.org/.well-known/genid/1035a7c7a9b194dabf1cc21a3fd99a64#103
comment: This class describes container elements that can only contain heterogeneous and non repeatable elements.
subclass of: http://lodlaundromat.org/.well-known/genid/1035a7c7a9b194dabf1cc21a3fd99a64#32
subclass of: http://lodlaundromat.org/.well-known/genid/1035a7c7a9b194dabf1cc21a3fd99a64#28
subclass of: http://lodlaundromat.org/.well-known/genid/1035a7c7a9b194dabf1cc21a3fd99a64#106
subclass of: pattern-based element
subclass of: structured element
subclass of: http://lodlaundromat.org/.well-known/genid/1035a7c7a9b194dabf1cc21a3fd99a64#108
subclass of: container element
subclass of: http://lodlaundromat.org/.well-known/genid/1035a7c7a9b194dabf1cc21a3fd99a64#25
subclass of: bucket element
subclass of: http://lodlaundromat.org/.well-known/genid/1035a7c7a9b194dabf1cc21a3fd99a64#85
subclass of: non-textual element
subclass of: http://lodlaundromat.org/.well-known/genid/1035a7c7a9b194dabf1cc21a3fd99a64#16
subclass of: http://lodlaundromat.org/.well-known/genid/1035a7c7a9b194dabf1cc21a3fd99a64#29
subclass of: http://lodlaundromat.org/.well-known/genid/1035a7c7a9b194dabf1cc21a3fd99a64#98
subclass of: http://lodlaundromat.org/.well-known/genid/1035a7c7a9b194dabf1cc21a3fd99a64#33
subclass of: http://lodlaundromat.org/.well-known/genid/1035a7c7a9b194dabf1cc21a3fd99a64#42
subclass of: http://lodlaundromat.org/.well-known/genid/1035a7c7a9b194dabf1cc21a3fd99a64#70

conclusion
subclass of: Resource
type: Class
subclass of: Thing
subclass of: Conclusion
equivalent class: Conclusion
subclass of: discourse element
comment: A reflection on the preceding text, summarizing the evidence, arguments or premises presented in the document and their logical outcomes. Conclusions are a fundamental feature in academic research publications, and may be included in the Discussion section.

http://lodlaundromat.org/.well-known/genid/1035a7c7a9b194dabf1cc21a3fd99a64#228
type: DatavaluedPropertyAtom
argument2: false
property predicate: can contain heteronymous elements
argument1: http://www.essepuntato.it/2008/12/pattern#x

The Discourse Elements Ontology (DEO)
type: Ontology
version info: 1.1
creator: David Shotton
creator: Silvio Peroni
date: 2015-07-03
description: DEO, The Discourse Elements Ontology, is an ontology written in OWL 2 DL that provides a structured vocabulary for rhetorical elements within documents (e.g. Introduction, Discussion, Acknowledgements, Reference List, Figures, Appendix), enabling these to be described in RDF. It uses some of the rhetorical block elements from the SALT Rhetorical Ontology and the Ontology of Rhetorical Blocks.
comment: The Discourse Elements Ontology is an ontology for describing the major rhetorical elements of a document such as a journal article. It is a subsidiary ontology that is imported into the Document Components Ontology, itself part of SPAR, the Semantic Publishing and Referencing Ontologies. Other SPAR ontologies are described at http://purl.org/spar/.
rights: This work is distributed under a Creative Commons Attribution License (http://creativecommons.org/licenses/by/3.0/).

http://lodlaundromat.org/.well-known/genid/1035a7c7a9b194dabf1cc21a3fd99a64#152
type: DatavaluedPropertyAtom
argument2: false
property predicate: can contain homonymous elements
argument1: http://www.essepuntato.it/2008/12/pattern#x

has name
type: DatatypeProperty
type: FunctionalProperty
comment: The name of a particular element.
range: string
type: Property
range: Resource

The Pattern Ontology Describing documents by means of their structural components
version info: 1.4.2
creator: Fabio Vitali
backward compatible with: Pattern-1 4.owl
date: 2013-07-16
comment: An ontology defining formally patterns for segmenting a document into atomic components, in order to be manipulated independently and re-flowed in different contexts.
description: The idea of using patterns to produce reusable and high-quality assets is not new in the literature. Software engineers, architects (as Alexander who first introduced this term) and designers very often use – or rather reuse – patterns to handle problems which recur over and over. Patterns have also been studied to modularize and customize web ontologies (http://ontologydesignpatterns.org). They guarantee the flexibility and maintainability of concepts and solutions in several heterogeneous scenarios. We've been investigating patterns for XML documents for some time. The overall goal of this research is to understand how the structure of digital documents can be segmented into atomic components, that can be manipulated independently and re-flowed in different contexts. Instead of defining a large number of complex and diversified structures, we have identified a small number of structures/patterns that are sufficient to express what most users need. Our idea is that a low number of patterns are enough to capture the most relevant document structures.
label: pattern ontology
creator: Angelo Di Iorio
creator: Silvio Peroni
prior version: Pattern-1 4.owl
type: Ontology

http://lodlaundromat.org/.well-known/genid/1035a7c7a9b194dabf1cc21a3fd99a64#215
type: DatavaluedPropertyAtom
argument2: true
property predicate: can contain homonymous elements
argument1: p

http://lodlaundromat.org/.well-known/genid/1035a7c7a9b194dabf1cc21a3fd99a64#173
type: DatavaluedPropertyAtom
argument2: true
property predicate: can contain heteronymous elements
argument1: http://www.essepuntato.it/2008/12/pattern#p

can contain homonymous elements
type: DatatypeProperty
type: FunctionalProperty
comment: A hierarchical-based entity contains al least two entities that share the same name.
domain: structured element
range: boolean
type: Property
domain: pattern-based element
domain: Resource
domain: Thing
range: Resource

can contain heteronymous elements
type: DatatypeProperty
type: FunctionalProperty
comment: A hierarchical-based entity contains al least two entities having different names.
domain: structured element
range: boolean
type: Property
domain: pattern-based element
domain: Resource
domain: Thing
range: Resource