chapter label
subclass of: Resource
type: Class
subclass of: Thing
comment: A block containing a label for the chapter, that may include the chapter number.
subclass of: http://lodlaundromat.org/.well-known/genid/80db9884dc853b095ffa69d682298cec#57
disjoint with: section label
subclass of: http://lodlaundromat.org/.well-known/genid/80db9884dc853b095ffa69d682298cec#124
subclass of: http://lodlaundromat.org/.well-known/genid/80db9884dc853b095ffa69d682298cec#61
subclass of: http://lodlaundromat.org/.well-known/genid/80db9884dc853b095ffa69d682298cec#60
subclass of: label
subclass of: DiscourseElement

subtitle
subclass of: Resource
type: Class
subclass of: Thing
comment: An explanatory or alternative title of a publication. For example, Mary Shelley uses the alternative title 'The Modern Prometheus' to hint at the theme of her most famous novel 'Frankenstein'; Nick Efford uses the subtitle 'a practical introduction using Java' to qualify the title of his book 'Digital Image Processing'.
subclass of: DiscourseElement
subclass of: Block
subclass of: http://lodlaundromat.org/.well-known/genid/80db9884dc853b095ffa69d682298cec#129
subclass of: http://lodlaundromat.org/.well-known/genid/80db9884dc853b095ffa69d682298cec#125
subclass of: http://lodlaundromat.org/.well-known/genid/80db9884dc853b095ffa69d682298cec#235
subclass of: http://lodlaundromat.org/.well-known/genid/80db9884dc853b095ffa69d682298cec#182

foreword
subclass of: Resource
type: Class
subclass of: Thing
comment: A section in a book or report, usually written by someone other than the author, that introduces or commends the document to the reader. It may include description of the interaction between the writer of the foreword and the author.
subclass of: http://lodlaundromat.org/.well-known/genid/80db9884dc853b095ffa69d682298cec#84
subclass of: http://lodlaundromat.org/.well-known/genid/80db9884dc853b095ffa69d682298cec#194
subclass of: http://lodlaundromat.org/.well-known/genid/80db9884dc853b095ffa69d682298cec#193
subclass of: http://lodlaundromat.org/.well-known/genid/80db9884dc853b095ffa69d682298cec#87
subclass of: http://lodlaundromat.org/.well-known/genid/80db9884dc853b095ffa69d682298cec#198
subclass of: section
subclass of: http://lodlaundromat.org/.well-known/genid/80db9884dc853b095ffa69d682298cec#137
subclass of: DiscourseElement
subclass of: HeadedContainer
subclass of: http://lodlaundromat.org/.well-known/genid/80db9884dc853b095ffa69d682298cec#200
subclass of: http://lodlaundromat.org/.well-known/genid/80db9884dc853b095ffa69d682298cec#50
subclass of: http://lodlaundromat.org/.well-known/genid/80db9884dc853b095ffa69d682298cec#54
subclass of: http://lodlaundromat.org/.well-known/genid/80db9884dc853b095ffa69d682298cec#172
subclass of: http://lodlaundromat.org/.well-known/genid/80db9884dc853b095ffa69d682298cec#152
subclass of: http://lodlaundromat.org/.well-known/genid/80db9884dc853b095ffa69d682298cec#190
subclass of: http://lodlaundromat.org/.well-known/genid/80db9884dc853b095ffa69d682298cec#241
subclass of: http://lodlaundromat.org/.well-known/genid/80db9884dc853b095ffa69d682298cec#7
subclass of: http://lodlaundromat.org/.well-known/genid/80db9884dc853b095ffa69d682298cec#27
subclass of: http://lodlaundromat.org/.well-known/genid/80db9884dc853b095ffa69d682298cec#119
subclass of: http://lodlaundromat.org/.well-known/genid/80db9884dc853b095ffa69d682298cec#195

body matter
subclass of: http://lodlaundromat.org/.well-known/genid/80db9884dc853b095ffa69d682298cec#246
subclass of: http://lodlaundromat.org/.well-known/genid/80db9884dc853b095ffa69d682298cec#14
subclass of: Thing
subclass of: http://lodlaundromat.org/.well-known/genid/80db9884dc853b095ffa69d682298cec#100
subclass of: http://lodlaundromat.org/.well-known/genid/80db9884dc853b095ffa69d682298cec#34
type: Class
subclass of: Resource
comment: The central principle part of a document, that contains the real content. It may be subdivided hierarchically by the use of chapters and sections.
subclass of: http://lodlaundromat.org/.well-known/genid/80db9884dc853b095ffa69d682298cec#32
subclass of: http://lodlaundromat.org/.well-known/genid/80db9884dc853b095ffa69d682298cec#38
subclass of: DiscourseElement
subclass of: Container
subclass of: http://lodlaundromat.org/.well-known/genid/80db9884dc853b095ffa69d682298cec#125
subclass of: http://lodlaundromat.org/.well-known/genid/80db9884dc853b095ffa69d682298cec#81
subclass of: http://lodlaundromat.org/.well-known/genid/80db9884dc853b095ffa69d682298cec#187
subclass of: http://lodlaundromat.org/.well-known/genid/80db9884dc853b095ffa69d682298cec#18
subclass of: http://lodlaundromat.org/.well-known/genid/80db9884dc853b095ffa69d682298cec#208
subclass of: http://lodlaundromat.org/.well-known/genid/80db9884dc853b095ffa69d682298cec#90
subclass of: http://lodlaundromat.org/.well-known/genid/80db9884dc853b095ffa69d682298cec#43
subclass of: http://lodlaundromat.org/.well-known/genid/80db9884dc853b095ffa69d682298cec#95

text box
subclass of: Resource
type: Class
subclass of: Thing
comment: A space within a document that contains textual content relating to, quoting from or expanding upon the main text. Usually a textbox is delimited by a border or use of a background colour distinct from that of the main text.
subclass of: DiscourseElement
subclass of: Container
subclass of: http://lodlaundromat.org/.well-known/genid/80db9884dc853b095ffa69d682298cec#125
subclass of: http://lodlaundromat.org/.well-known/genid/80db9884dc853b095ffa69d682298cec#81
subclass of: http://lodlaundromat.org/.well-known/genid/80db9884dc853b095ffa69d682298cec#18
subclass of: http://lodlaundromat.org/.well-known/genid/80db9884dc853b095ffa69d682298cec#38
subclass of: http://lodlaundromat.org/.well-known/genid/80db9884dc853b095ffa69d682298cec#187
subclass of: http://lodlaundromat.org/.well-known/genid/80db9884dc853b095ffa69d682298cec#43
subclass of: http://lodlaundromat.org/.well-known/genid/80db9884dc853b095ffa69d682298cec#90
subclass of: http://lodlaundromat.org/.well-known/genid/80db9884dc853b095ffa69d682298cec#208
subclass of: http://lodlaundromat.org/.well-known/genid/80db9884dc853b095ffa69d682298cec#95

list of contributors
subclass of: Resource
type: Class
subclass of: Thing
comment: A list of items, each denoting a contributor to a publication such as an encyclopedia or a text book, where such contributions are insufficient to warrant classification as author.
subclass of: list of agents
subclass of: http://lodlaundromat.org/.well-known/genid/80db9884dc853b095ffa69d682298cec#143
subclass of: http://lodlaundromat.org/.well-known/genid/80db9884dc853b095ffa69d682298cec#128
subclass of: list
subclass of: http://lodlaundromat.org/.well-known/genid/80db9884dc853b095ffa69d682298cec#140
subclass of: DiscourseElement
subclass of: http://lodlaundromat.org/.well-known/genid/80db9884dc853b095ffa69d682298cec#137
subclass of: Table

bibliographic reference list
subclass of: Resource
type: Class
subclass of: Thing
comment: A list, usually within a bibliography, of all the references within the citing document that refer to journal articles, books, book chapters, Web sites or similar publications.
subclass of: http://lodlaundromat.org/.well-known/genid/80db9884dc853b095ffa69d682298cec#21
subclass of: http://lodlaundromat.org/.well-known/genid/80db9884dc853b095ffa69d682298cec#143
subclass of: http://lodlaundromat.org/.well-known/genid/80db9884dc853b095ffa69d682298cec#163
subclass of: http://lodlaundromat.org/.well-known/genid/80db9884dc853b095ffa69d682298cec#128
subclass of: http://lodlaundromat.org/.well-known/genid/80db9884dc853b095ffa69d682298cec#24
subclass of: list of references
subclass of: http://lodlaundromat.org/.well-known/genid/80db9884dc853b095ffa69d682298cec#160
subclass of: http://lodlaundromat.org/.well-known/genid/80db9884dc853b095ffa69d682298cec#137
subclass of: http://lodlaundromat.org/.well-known/genid/80db9884dc853b095ffa69d682298cec#140
subclass of: Table
subclass of: DiscourseElement
subclass of: list

captioned box
subclass of: Resource
type: Class
subclass of: Thing
comment: A rectangle space within a page that contains an object and its related caption.
subclass of: http://lodlaundromat.org/.well-known/genid/80db9884dc853b095ffa69d682298cec#41
subclass of: http://lodlaundromat.org/.well-known/genid/80db9884dc853b095ffa69d682298cec#47
subclass of: DiscourseElement
subclass of: Container
subclass of: http://lodlaundromat.org/.well-known/genid/80db9884dc853b095ffa69d682298cec#208
subclass of: http://lodlaundromat.org/.well-known/genid/80db9884dc853b095ffa69d682298cec#125
subclass of: http://lodlaundromat.org/.well-known/genid/80db9884dc853b095ffa69d682298cec#95
subclass of: http://lodlaundromat.org/.well-known/genid/80db9884dc853b095ffa69d682298cec#43
subclass of: http://lodlaundromat.org/.well-known/genid/80db9884dc853b095ffa69d682298cec#187
subclass of: http://lodlaundromat.org/.well-known/genid/80db9884dc853b095ffa69d682298cec#81
subclass of: http://lodlaundromat.org/.well-known/genid/80db9884dc853b095ffa69d682298cec#90
subclass of: http://lodlaundromat.org/.well-known/genid/80db9884dc853b095ffa69d682298cec#38
subclass of: http://lodlaundromat.org/.well-known/genid/80db9884dc853b095ffa69d682298cec#18

glossary
subclass of: Resource
type: Class
subclass of: Thing
comment: A set of definitions of words or phrases of importance to the work, normally alphabetized. In longer works of fiction, the entries may contains places and characters.
subclass of: http://lodlaundromat.org/.well-known/genid/80db9884dc853b095ffa69d682298cec#104
subclass of: http://lodlaundromat.org/.well-known/genid/80db9884dc853b095ffa69d682298cec#194
subclass of: http://lodlaundromat.org/.well-known/genid/80db9884dc853b095ffa69d682298cec#107
subclass of: http://lodlaundromat.org/.well-known/genid/80db9884dc853b095ffa69d682298cec#198
subclass of: section
subclass of: http://lodlaundromat.org/.well-known/genid/80db9884dc853b095ffa69d682298cec#241
subclass of: http://lodlaundromat.org/.well-known/genid/80db9884dc853b095ffa69d682298cec#54
subclass of: http://lodlaundromat.org/.well-known/genid/80db9884dc853b095ffa69d682298cec#27
subclass of: http://lodlaundromat.org/.well-known/genid/80db9884dc853b095ffa69d682298cec#195
subclass of: HeadedContainer
subclass of: DiscourseElement
subclass of: http://lodlaundromat.org/.well-known/genid/80db9884dc853b095ffa69d682298cec#7
subclass of: http://lodlaundromat.org/.well-known/genid/80db9884dc853b095ffa69d682298cec#50
subclass of: http://lodlaundromat.org/.well-known/genid/80db9884dc853b095ffa69d682298cec#200
subclass of: http://lodlaundromat.org/.well-known/genid/80db9884dc853b095ffa69d682298cec#137
subclass of: http://lodlaundromat.org/.well-known/genid/80db9884dc853b095ffa69d682298cec#152
subclass of: http://lodlaundromat.org/.well-known/genid/80db9884dc853b095ffa69d682298cec#172
subclass of: http://lodlaundromat.org/.well-known/genid/80db9884dc853b095ffa69d682298cec#119

list of agents
subclass of: Resource
type: Class
subclass of: Thing
comment: A list of items each denoting an agent, such as an author, a contributor or an organization, related to a particular publication.
subclass of: list
disjoint with: list of references
subclass of: http://lodlaundromat.org/.well-known/genid/80db9884dc853b095ffa69d682298cec#128
subclass of: http://lodlaundromat.org/.well-known/genid/80db9884dc853b095ffa69d682298cec#143
subclass of: http://lodlaundromat.org/.well-known/genid/80db9884dc853b095ffa69d682298cec#140
subclass of: DiscourseElement
subclass of: Table
subclass of: http://lodlaundromat.org/.well-known/genid/80db9884dc853b095ffa69d682298cec#137

paragraph
subclass of: http://lodlaundromat.org/.well-known/genid/80db9884dc853b095ffa69d682298cec#195
subclass of: Resource
type: Class
subclass of: Thing
subclass of: http://lodlaundromat.org/.well-known/genid/80db9884dc853b095ffa69d682298cec#54
comment: A self-contained unit of discourse that deals with a particular point or idea. Paragraphs contains one or more sentences. The start of a paragraph is indicated by beginning on a new line, which may be indented or separated by a small vertical space by the preceding paragraph.
subclass of: http://lodlaundromat.org/.well-known/genid/80db9884dc853b095ffa69d682298cec#180
subclass of: http://lodlaundromat.org/.well-known/genid/80db9884dc853b095ffa69d682298cec#186
subclass of: http://lodlaundromat.org/.well-known/genid/80db9884dc853b095ffa69d682298cec#182
subclass of: DiscourseElement
subclass of: Block
subclass of: http://lodlaundromat.org/.well-known/genid/80db9884dc853b095ffa69d682298cec#129
subclass of: http://lodlaundromat.org/.well-known/genid/80db9884dc853b095ffa69d682298cec#125
subclass of: http://lodlaundromat.org/.well-known/genid/80db9884dc853b095ffa69d682298cec#235

stanza
subclass of: Resource
type: Class
subclass of: Thing
comment: A unit within a larger poem. A stanza consists of a grouping of lines, set off by a vertical space from other stanzas, that usually has a set pattern of meter and rhyme.
subclass of: http://lodlaundromat.org/.well-known/genid/80db9884dc853b095ffa69d682298cec#206
subclass of: http://lodlaundromat.org/.well-known/genid/80db9884dc853b095ffa69d682298cec#212
subclass of: http://lodlaundromat.org/.well-known/genid/80db9884dc853b095ffa69d682298cec#208
subclass of: http://lodlaundromat.org/.well-known/genid/80db9884dc853b095ffa69d682298cec#81
subclass of: http://lodlaundromat.org/.well-known/genid/80db9884dc853b095ffa69d682298cec#125
subclass of: DiscourseElement
subclass of: Container
subclass of: http://lodlaundromat.org/.well-known/genid/80db9884dc853b095ffa69d682298cec#38
subclass of: http://lodlaundromat.org/.well-known/genid/80db9884dc853b095ffa69d682298cec#43
subclass of: http://lodlaundromat.org/.well-known/genid/80db9884dc853b095ffa69d682298cec#95
subclass of: http://lodlaundromat.org/.well-known/genid/80db9884dc853b095ffa69d682298cec#90
subclass of: http://lodlaundromat.org/.well-known/genid/80db9884dc853b095ffa69d682298cec#18
subclass of: http://lodlaundromat.org/.well-known/genid/80db9884dc853b095ffa69d682298cec#187

formula box
subclass of: Resource
type: Class
subclass of: Thing
comment: A space within a document that contains one or more formulae.
subclass of: http://lodlaundromat.org/.well-known/genid/80db9884dc853b095ffa69d682298cec#88
subclass of: http://lodlaundromat.org/.well-known/genid/80db9884dc853b095ffa69d682298cec#94
subclass of: http://lodlaundromat.org/.well-known/genid/80db9884dc853b095ffa69d682298cec#90
subclass of: DiscourseElement
subclass of: Container
subclass of: http://lodlaundromat.org/.well-known/genid/80db9884dc853b095ffa69d682298cec#81
subclass of: http://lodlaundromat.org/.well-known/genid/80db9884dc853b095ffa69d682298cec#125
subclass of: http://lodlaundromat.org/.well-known/genid/80db9884dc853b095ffa69d682298cec#95
subclass of: http://lodlaundromat.org/.well-known/genid/80db9884dc853b095ffa69d682298cec#18
subclass of: http://lodlaundromat.org/.well-known/genid/80db9884dc853b095ffa69d682298cec#208
subclass of: http://lodlaundromat.org/.well-known/genid/80db9884dc853b095ffa69d682298cec#38
subclass of: http://lodlaundromat.org/.well-known/genid/80db9884dc853b095ffa69d682298cec#43
subclass of: http://lodlaundromat.org/.well-known/genid/80db9884dc853b095ffa69d682298cec#187

colophon
subclass of: Resource
type: Class
subclass of: Thing
comment: A brief description of publication or production notes relevant to the document.
subclass of: http://lodlaundromat.org/.well-known/genid/80db9884dc853b095ffa69d682298cec#63
subclass of: http://lodlaundromat.org/.well-known/genid/80db9884dc853b095ffa69d682298cec#194
subclass of: http://lodlaundromat.org/.well-known/genid/80db9884dc853b095ffa69d682298cec#198
subclass of: http://lodlaundromat.org/.well-known/genid/80db9884dc853b095ffa69d682298cec#66
subclass of: section
subclass of: http://lodlaundromat.org/.well-known/genid/80db9884dc853b095ffa69d682298cec#27
subclass of: http://lodlaundromat.org/.well-known/genid/80db9884dc853b095ffa69d682298cec#54
subclass of: http://lodlaundromat.org/.well-known/genid/80db9884dc853b095ffa69d682298cec#195
subclass of: DiscourseElement
subclass of: HeadedContainer
subclass of: http://lodlaundromat.org/.well-known/genid/80db9884dc853b095ffa69d682298cec#7
subclass of: http://lodlaundromat.org/.well-known/genid/80db9884dc853b095ffa69d682298cec#137
subclass of: http://lodlaundromat.org/.well-known/genid/80db9884dc853b095ffa69d682298cec#200
subclass of: http://lodlaundromat.org/.well-known/genid/80db9884dc853b095ffa69d682298cec#50
subclass of: http://lodlaundromat.org/.well-known/genid/80db9884dc853b095ffa69d682298cec#119
subclass of: http://lodlaundromat.org/.well-known/genid/80db9884dc853b095ffa69d682298cec#172
subclass of: http://lodlaundromat.org/.well-known/genid/80db9884dc853b095ffa69d682298cec#241
subclass of: http://lodlaundromat.org/.well-known/genid/80db9884dc853b095ffa69d682298cec#152

list of figures
subclass of: Resource
type: Class
subclass of: Thing
comment: A section of the document listing all the figures, identified by their titles and referenced to their locations in the document. May also be referred to as 'List of illustrations'.
subclass of: http://lodlaundromat.org/.well-known/genid/80db9884dc853b095ffa69d682298cec#144
subclass of: http://lodlaundromat.org/.well-known/genid/80db9884dc853b095ffa69d682298cec#150
subclass of: http://lodlaundromat.org/.well-known/genid/80db9884dc853b095ffa69d682298cec#156
subclass of: http://lodlaundromat.org/.well-known/genid/80db9884dc853b095ffa69d682298cec#194
subclass of: http://lodlaundromat.org/.well-known/genid/80db9884dc853b095ffa69d682298cec#198
subclass of: http://lodlaundromat.org/.well-known/genid/80db9884dc853b095ffa69d682298cec#152
subclass of: HeadedContainer
subclass of: section
subclass of: http://lodlaundromat.org/.well-known/genid/80db9884dc853b095ffa69d682298cec#137
subclass of: http://lodlaundromat.org/.well-known/genid/80db9884dc853b095ffa69d682298cec#119
subclass of: http://lodlaundromat.org/.well-known/genid/80db9884dc853b095ffa69d682298cec#27
subclass of: http://lodlaundromat.org/.well-known/genid/80db9884dc853b095ffa69d682298cec#241
subclass of: http://lodlaundromat.org/.well-known/genid/80db9884dc853b095ffa69d682298cec#172
subclass of: http://lodlaundromat.org/.well-known/genid/80db9884dc853b095ffa69d682298cec#54
subclass of: DiscourseElement
subclass of: http://lodlaundromat.org/.well-known/genid/80db9884dc853b095ffa69d682298cec#200
subclass of: http://lodlaundromat.org/.well-known/genid/80db9884dc853b095ffa69d682298cec#50
subclass of: http://lodlaundromat.org/.well-known/genid/80db9884dc853b095ffa69d682298cec#7
subclass of: http://lodlaundromat.org/.well-known/genid/80db9884dc853b095ffa69d682298cec#195

table
subclass of: Resource
type: Class
subclass of: Thing
comment: A set of data arranged in cells within rows and columns.
subclass of: http://lodlaundromat.org/.well-known/genid/80db9884dc853b095ffa69d682298cec#213
subclass of: DiscourseElement
subclass of: Table
subclass of: http://lodlaundromat.org/.well-known/genid/80db9884dc853b095ffa69d682298cec#137

sentence
subclass of: Resource
type: Class
subclass of: Thing
comment: An expression in natural language forming a single grammatical unit. A sentence minimally consists of a subject and an intransitive verb, or a subject, a transitive verb and an object, and may include additional dependent clauses. In written text, a sentence is always terminated by a full stop. A sentence can include words grouped meaningfully to express a statement, a question, an exclamation, a request or a command.
subclass of: DiscourseElement
subclass of: Inline

afterword
subclass of: Resource
type: Class
subclass of: Thing
comment: A literary device that is often found at the end of a piece of literature. It generally covers the story of how the book came into being, or how the idea for the book was developed. Alternatively, it may be written by someone other than the author of the book, and may discuss the work's historical or cultural context, if the work is being reissued many years after its original publication.
subclass of: http://lodlaundromat.org/.well-known/genid/80db9884dc853b095ffa69d682298cec#1
subclass of: http://lodlaundromat.org/.well-known/genid/80db9884dc853b095ffa69d682298cec#198
subclass of: http://lodlaundromat.org/.well-known/genid/80db9884dc853b095ffa69d682298cec#11
subclass of: http://lodlaundromat.org/.well-known/genid/80db9884dc853b095ffa69d682298cec#4
subclass of: http://lodlaundromat.org/.well-known/genid/80db9884dc853b095ffa69d682298cec#123
subclass of: http://lodlaundromat.org/.well-known/genid/80db9884dc853b095ffa69d682298cec#194
subclass of: section
subclass of: http://lodlaundromat.org/.well-known/genid/80db9884dc853b095ffa69d682298cec#195
subclass of: http://lodlaundromat.org/.well-known/genid/80db9884dc853b095ffa69d682298cec#27
subclass of: http://lodlaundromat.org/.well-known/genid/80db9884dc853b095ffa69d682298cec#241
subclass of: http://lodlaundromat.org/.well-known/genid/80db9884dc853b095ffa69d682298cec#200
subclass of: http://lodlaundromat.org/.well-known/genid/80db9884dc853b095ffa69d682298cec#54
subclass of: HeadedContainer
subclass of: http://lodlaundromat.org/.well-known/genid/80db9884dc853b095ffa69d682298cec#152
subclass of: http://lodlaundromat.org/.well-known/genid/80db9884dc853b095ffa69d682298cec#119
subclass of: http://lodlaundromat.org/.well-known/genid/80db9884dc853b095ffa69d682298cec#117
subclass of: http://lodlaundromat.org/.well-known/genid/80db9884dc853b095ffa69d682298cec#137
subclass of: http://lodlaundromat.org/.well-known/genid/80db9884dc853b095ffa69d682298cec#7
subclass of: http://lodlaundromat.org/.well-known/genid/80db9884dc853b095ffa69d682298cec#172
subclass of: http://lodlaundromat.org/.well-known/genid/80db9884dc853b095ffa69d682298cec#50
subclass of: DiscourseElement
subclass of: http://lodlaundromat.org/.well-known/genid/80db9884dc853b095ffa69d682298cec#5

section label
subclass of: Resource
type: Class
subclass of: Thing
comment: A block containing a label for the section, that may include the section number.
subclass of: http://lodlaundromat.org/.well-known/genid/80db9884dc853b095ffa69d682298cec#203
subclass of: label
subclass of: http://lodlaundromat.org/.well-known/genid/80db9884dc853b095ffa69d682298cec#124
subclass of: http://lodlaundromat.org/.well-known/genid/80db9884dc853b095ffa69d682298cec#204
subclass of: DiscourseElement
disjoint with: chapter label

table label
subclass of: Resource
type: Class
subclass of: Thing
comment: A block containing a label for the table box, that may include the table number.
subclass of: http://lodlaundromat.org/.well-known/genid/80db9884dc853b095ffa69d682298cec#218
subclass of: http://lodlaundromat.org/.well-known/genid/80db9884dc853b095ffa69d682298cec#221
subclass of: http://lodlaundromat.org/.well-known/genid/80db9884dc853b095ffa69d682298cec#124
subclass of: label
subclass of: DiscourseElement

figure label
subclass of: Resource
type: Class
subclass of: Thing
comment: A block containing a label for the figure box, that may include the figure number.
subclass of: http://lodlaundromat.org/.well-known/genid/80db9884dc853b095ffa69d682298cec#77
subclass of: http://lodlaundromat.org/.well-known/genid/80db9884dc853b095ffa69d682298cec#80
subclass of: http://lodlaundromat.org/.well-known/genid/80db9884dc853b095ffa69d682298cec#124
subclass of: label
subclass of: DiscourseElement

preface
subclass of: Resource
type: Class
subclass of: Thing
comment: A section describing how the document came into being, or how the idea for it was developed. The preface may contains acknowledgements. The preface to a later edition of the work often explains in what respect that edition differs from previous ones.
subclass of: http://lodlaundromat.org/.well-known/genid/80db9884dc853b095ffa69d682298cec#190
subclass of: http://lodlaundromat.org/.well-known/genid/80db9884dc853b095ffa69d682298cec#198
subclass of: http://lodlaundromat.org/.well-known/genid/80db9884dc853b095ffa69d682298cec#193
subclass of: http://lodlaundromat.org/.well-known/genid/80db9884dc853b095ffa69d682298cec#87
subclass of: http://lodlaundromat.org/.well-known/genid/80db9884dc853b095ffa69d682298cec#194
subclass of: section
subclass of: http://lodlaundromat.org/.well-known/genid/80db9884dc853b095ffa69d682298cec#27
subclass of: http://lodlaundromat.org/.well-known/genid/80db9884dc853b095ffa69d682298cec#200
subclass of: http://lodlaundromat.org/.well-known/genid/80db9884dc853b095ffa69d682298cec#241
subclass of: http://lodlaundromat.org/.well-known/genid/80db9884dc853b095ffa69d682298cec#54
subclass of: http://lodlaundromat.org/.well-known/genid/80db9884dc853b095ffa69d682298cec#195
subclass of: DiscourseElement
subclass of: HeadedContainer
subclass of: http://lodlaundromat.org/.well-known/genid/80db9884dc853b095ffa69d682298cec#137
subclass of: http://lodlaundromat.org/.well-known/genid/80db9884dc853b095ffa69d682298cec#172
subclass of: http://lodlaundromat.org/.well-known/genid/80db9884dc853b095ffa69d682298cec#152
subclass of: http://lodlaundromat.org/.well-known/genid/80db9884dc853b095ffa69d682298cec#50
subclass of: http://lodlaundromat.org/.well-known/genid/80db9884dc853b095ffa69d682298cec#84
subclass of: http://lodlaundromat.org/.well-known/genid/80db9884dc853b095ffa69d682298cec#119
subclass of: http://lodlaundromat.org/.well-known/genid/80db9884dc853b095ffa69d682298cec#7

footnote
subclass of: Resource
type: Class
subclass of: Thing
comment: A structure within a sentence that permits the author to make a comment or to cite another publication in support of the text, or both. A footnote is normally flagged by a superscript number immediately following that portion of the text to which it relates. For convenience of reading, the text of the footnote is usually printed at the bottom of the page or at the end of a text.
subclass of: http://lodlaundromat.org/.well-known/genid/80db9884dc853b095ffa69d682298cec#81
subclass of: DiscourseElement

title
subclass of: Resource
type: Class
subclass of: Thing
comment: A word, phrase or sentence that precedes and indicates the subject of a document or a document component - e.g., a book, a report, a news article, a chapter, a section or a table.
subclass of: http://lodlaundromat.org/.well-known/genid/80db9884dc853b095ffa69d682298cec#235
subclass of: http://lodlaundromat.org/.well-known/genid/80db9884dc853b095ffa69d682298cec#238
subclass of: DiscourseElement

list of tables
subclass of: Resource
type: Class
subclass of: Thing
comment: A section of the document listing all the tables, identified by their titles and referenced to their locations in the document.
subclass of: http://lodlaundromat.org/.well-known/genid/80db9884dc853b095ffa69d682298cec#164
subclass of: http://lodlaundromat.org/.well-known/genid/80db9884dc853b095ffa69d682298cec#170
subclass of: http://lodlaundromat.org/.well-known/genid/80db9884dc853b095ffa69d682298cec#194
subclass of: http://lodlaundromat.org/.well-known/genid/80db9884dc853b095ffa69d682298cec#198
subclass of: http://lodlaundromat.org/.well-known/genid/80db9884dc853b095ffa69d682298cec#176
subclass of: http://lodlaundromat.org/.well-known/genid/80db9884dc853b095ffa69d682298cec#172
subclass of: HeadedContainer
subclass of: http://lodlaundromat.org/.well-known/genid/80db9884dc853b095ffa69d682298cec#137
subclass of: section
subclass of: http://lodlaundromat.org/.well-known/genid/80db9884dc853b095ffa69d682298cec#27
subclass of: http://lodlaundromat.org/.well-known/genid/80db9884dc853b095ffa69d682298cec#152
subclass of: http://lodlaundromat.org/.well-known/genid/80db9884dc853b095ffa69d682298cec#200
subclass of: DiscourseElement
subclass of: http://lodlaundromat.org/.well-known/genid/80db9884dc853b095ffa69d682298cec#50
subclass of: http://lodlaundromat.org/.well-known/genid/80db9884dc853b095ffa69d682298cec#119
subclass of: http://lodlaundromat.org/.well-known/genid/80db9884dc853b095ffa69d682298cec#241
subclass of: http://lodlaundromat.org/.well-known/genid/80db9884dc853b095ffa69d682298cec#195
subclass of: http://lodlaundromat.org/.well-known/genid/80db9884dc853b095ffa69d682298cec#54
subclass of: http://lodlaundromat.org/.well-known/genid/80db9884dc853b095ffa69d682298cec#7

section
subclass of: http://lodlaundromat.org/.well-known/genid/80db9884dc853b095ffa69d682298cec#241
subclass of: http://lodlaundromat.org/.well-known/genid/80db9884dc853b095ffa69d682298cec#195
subclass of: http://lodlaundromat.org/.well-known/genid/80db9884dc853b095ffa69d682298cec#27
type: Class
subclass of: Thing
subclass of: http://lodlaundromat.org/.well-known/genid/80db9884dc853b095ffa69d682298cec#54
subclass of: Resource
comment: A logical division of the text, usually numbered and/or titled, which may contain subsections.
subclass of: http://lodlaundromat.org/.well-known/genid/80db9884dc853b095ffa69d682298cec#194
subclass of: http://lodlaundromat.org/.well-known/genid/80db9884dc853b095ffa69d682298cec#198
subclass of: http://lodlaundromat.org/.well-known/genid/80db9884dc853b095ffa69d682298cec#200
subclass of: HeadedContainer
subclass of: http://lodlaundromat.org/.well-known/genid/80db9884dc853b095ffa69d682298cec#137
subclass of: DiscourseElement
subclass of: http://lodlaundromat.org/.well-known/genid/80db9884dc853b095ffa69d682298cec#50
subclass of: http://lodlaundromat.org/.well-known/genid/80db9884dc853b095ffa69d682298cec#172
subclass of: http://lodlaundromat.org/.well-known/genid/80db9884dc853b095ffa69d682298cec#119
subclass of: http://lodlaundromat.org/.well-known/genid/80db9884dc853b095ffa69d682298cec#7
subclass of: http://lodlaundromat.org/.well-known/genid/80db9884dc853b095ffa69d682298cec#152
equivalent class: http://lodlaundromat.org/.well-known/genid/80db9884dc853b095ffa69d682298cec#172
equivalent class: http://lodlaundromat.org/.well-known/genid/80db9884dc853b095ffa69d682298cec#119
equivalent class: http://lodlaundromat.org/.well-known/genid/80db9884dc853b095ffa69d682298cec#7
equivalent class: http://lodlaundromat.org/.well-known/genid/80db9884dc853b095ffa69d682298cec#152

index
subclass of: Resource
type: Class
subclass of: Thing
comment: A section containing a list of references to information on the named topic of importance to the content of the document. The references may be to page numbers, paragraph numbers, section numbers or chapter numbers within the document.
subclass of: http://lodlaundromat.org/.well-known/genid/80db9884dc853b095ffa69d682298cec#111
subclass of: http://lodlaundromat.org/.well-known/genid/80db9884dc853b095ffa69d682298cec#117
subclass of: http://lodlaundromat.org/.well-known/genid/80db9884dc853b095ffa69d682298cec#194
subclass of: http://lodlaundromat.org/.well-known/genid/80db9884dc853b095ffa69d682298cec#119
subclass of: http://lodlaundromat.org/.well-known/genid/80db9884dc853b095ffa69d682298cec#11
subclass of: http://lodlaundromat.org/.well-known/genid/80db9884dc853b095ffa69d682298cec#4
subclass of: http://lodlaundromat.org/.well-known/genid/80db9884dc853b095ffa69d682298cec#123
subclass of: http://lodlaundromat.org/.well-known/genid/80db9884dc853b095ffa69d682298cec#198
subclass of: http://lodlaundromat.org/.well-known/genid/80db9884dc853b095ffa69d682298cec#137
subclass of: section
subclass of: HeadedContainer
subclass of: http://lodlaundromat.org/.well-known/genid/80db9884dc853b095ffa69d682298cec#54
subclass of: http://lodlaundromat.org/.well-known/genid/80db9884dc853b095ffa69d682298cec#172
subclass of: http://lodlaundromat.org/.well-known/genid/80db9884dc853b095ffa69d682298cec#27
subclass of: http://lodlaundromat.org/.well-known/genid/80db9884dc853b095ffa69d682298cec#152
subclass of: http://lodlaundromat.org/.well-known/genid/80db9884dc853b095ffa69d682298cec#7
subclass of: DiscourseElement
subclass of: http://lodlaundromat.org/.well-known/genid/80db9884dc853b095ffa69d682298cec#50
subclass of: http://lodlaundromat.org/.well-known/genid/80db9884dc853b095ffa69d682298cec#200
subclass of: http://lodlaundromat.org/.well-known/genid/80db9884dc853b095ffa69d682298cec#5
subclass of: http://lodlaundromat.org/.well-known/genid/80db9884dc853b095ffa69d682298cec#1
subclass of: http://lodlaundromat.org/.well-known/genid/80db9884dc853b095ffa69d682298cec#195
subclass of: http://lodlaundromat.org/.well-known/genid/80db9884dc853b095ffa69d682298cec#241

chapter
subclass of: Resource
type: Class
subclass of: Thing
subclass of: http://lodlaundromat.org/.well-known/genid/80db9884dc853b095ffa69d682298cec#241
subclass of: http://lodlaundromat.org/.well-known/genid/80db9884dc853b095ffa69d682298cec#27
comment: A principle division of the body matter of a large document, such as a book, a report or a legislative document.
subclass of: http://lodlaundromat.org/.well-known/genid/80db9884dc853b095ffa69d682298cec#48
subclass of: http://lodlaundromat.org/.well-known/genid/80db9884dc853b095ffa69d682298cec#50
subclass of: http://lodlaundromat.org/.well-known/genid/80db9884dc853b095ffa69d682298cec#53
subclass of: DiscourseElement
subclass of: HeadedContainer
subclass of: http://lodlaundromat.org/.well-known/genid/80db9884dc853b095ffa69d682298cec#137
subclass of: http://lodlaundromat.org/.well-known/genid/80db9884dc853b095ffa69d682298cec#200

list of references
subclass of: Resource
type: Class
subclass of: Thing
comment: A list of items each representing a reference to a specific part of the same document, or to another publication.
subclass of: http://lodlaundromat.org/.well-known/genid/80db9884dc853b095ffa69d682298cec#160
subclass of: http://lodlaundromat.org/.well-known/genid/80db9884dc853b095ffa69d682298cec#163
subclass of: http://lodlaundromat.org/.well-known/genid/80db9884dc853b095ffa69d682298cec#143
subclass of: http://lodlaundromat.org/.well-known/genid/80db9884dc853b095ffa69d682298cec#128
subclass of: http://lodlaundromat.org/.well-known/genid/80db9884dc853b095ffa69d682298cec#140
subclass of: http://lodlaundromat.org/.well-known/genid/80db9884dc853b095ffa69d682298cec#137
subclass of: Table
subclass of: DiscourseElement
subclass of: list
disjoint with: list of agents

figure
subclass of: Resource
type: Class
subclass of: Thing
comment: A communication object comprising one or more graphics, drawings, images, or other visual representations..
subclass of: http://lodlaundromat.org/.well-known/genid/80db9884dc853b095ffa69d682298cec#70
subclass of: DiscourseElement

simple run-in quotation
subclass of: Resource
type: Class
subclass of: Thing
comment: A textual quotation that is included inline and is usually enclosed within quotation marks.
subclass of: Inline

table of contents
subclass of: Resource
type: Class
subclass of: Thing
comment: A section of the document listing all the chapters and sections, identified by their titles and referenced to their locations in the document. The table of contents may include a list of the front-matter and back-matter items, in addition to the body-matter items. Where the document is a journal or magazine issue, the table of content lists the constituent items contained in that issue, typically by title, authors and first page number.
subclass of: http://lodlaundromat.org/.well-known/genid/80db9884dc853b095ffa69d682298cec#222
subclass of: http://lodlaundromat.org/.well-known/genid/80db9884dc853b095ffa69d682298cec#229
subclass of: http://lodlaundromat.org/.well-known/genid/80db9884dc853b095ffa69d682298cec#225
subclass of: section
subclass of: http://lodlaundromat.org/.well-known/genid/80db9884dc853b095ffa69d682298cec#198
subclass of: http://lodlaundromat.org/.well-known/genid/80db9884dc853b095ffa69d682298cec#194
subclass of: http://lodlaundromat.org/.well-known/genid/80db9884dc853b095ffa69d682298cec#54
subclass of: http://lodlaundromat.org/.well-known/genid/80db9884dc853b095ffa69d682298cec#200
subclass of: http://lodlaundromat.org/.well-known/genid/80db9884dc853b095ffa69d682298cec#27
subclass of: http://lodlaundromat.org/.well-known/genid/80db9884dc853b095ffa69d682298cec#241
subclass of: DiscourseElement
subclass of: http://lodlaundromat.org/.well-known/genid/80db9884dc853b095ffa69d682298cec#137
subclass of: http://lodlaundromat.org/.well-known/genid/80db9884dc853b095ffa69d682298cec#119
subclass of: http://lodlaundromat.org/.well-known/genid/80db9884dc853b095ffa69d682298cec#172
subclass of: http://lodlaundromat.org/.well-known/genid/80db9884dc853b095ffa69d682298cec#152
subclass of: http://lodlaundromat.org/.well-known/genid/80db9884dc853b095ffa69d682298cec#50
subclass of: HeadedContainer
subclass of: http://lodlaundromat.org/.well-known/genid/80db9884dc853b095ffa69d682298cec#195
subclass of: http://lodlaundromat.org/.well-known/genid/80db9884dc853b095ffa69d682298cec#7

table box
subclass of: Resource
type: Class
subclass of: Thing
comment: A space within a document that contains a table and its caption.
subclass of: http://lodlaundromat.org/.well-known/genid/80db9884dc853b095ffa69d682298cec#214
subclass of: http://lodlaundromat.org/.well-known/genid/80db9884dc853b095ffa69d682298cec#217
subclass of: http://lodlaundromat.org/.well-known/genid/80db9884dc853b095ffa69d682298cec#47
subclass of: captioned box
subclass of: http://lodlaundromat.org/.well-known/genid/80db9884dc853b095ffa69d682298cec#43
subclass of: http://lodlaundromat.org/.well-known/genid/80db9884dc853b095ffa69d682298cec#81
subclass of: http://lodlaundromat.org/.well-known/genid/80db9884dc853b095ffa69d682298cec#125
subclass of: DiscourseElement
subclass of: Container
subclass of: http://lodlaundromat.org/.well-known/genid/80db9884dc853b095ffa69d682298cec#41
subclass of: http://lodlaundromat.org/.well-known/genid/80db9884dc853b095ffa69d682298cec#95
subclass of: http://lodlaundromat.org/.well-known/genid/80db9884dc853b095ffa69d682298cec#208
subclass of: http://lodlaundromat.org/.well-known/genid/80db9884dc853b095ffa69d682298cec#90
subclass of: http://lodlaundromat.org/.well-known/genid/80db9884dc853b095ffa69d682298cec#187
subclass of: http://lodlaundromat.org/.well-known/genid/80db9884dc853b095ffa69d682298cec#18
subclass of: http://lodlaundromat.org/.well-known/genid/80db9884dc853b095ffa69d682298cec#38
disjoint with: figure box

text chunk
subclass of: Resource
type: Class
subclass of: Thing
comment: A piece of text defined by a start point and an end point.
subclass of: Inline

figure box
subclass of: Resource
type: Class
subclass of: Thing
comment: A space within a document that contains a figure and its caption.
subclass of: http://lodlaundromat.org/.well-known/genid/80db9884dc853b095ffa69d682298cec#73
disjoint with: table box
subclass of: http://lodlaundromat.org/.well-known/genid/80db9884dc853b095ffa69d682298cec#76
subclass of: captioned box
subclass of: http://lodlaundromat.org/.well-known/genid/80db9884dc853b095ffa69d682298cec#47
subclass of: http://lodlaundromat.org/.well-known/genid/80db9884dc853b095ffa69d682298cec#41
subclass of: http://lodlaundromat.org/.well-known/genid/80db9884dc853b095ffa69d682298cec#43
subclass of: Container
subclass of: DiscourseElement
subclass of: http://lodlaundromat.org/.well-known/genid/80db9884dc853b095ffa69d682298cec#125
subclass of: http://lodlaundromat.org/.well-known/genid/80db9884dc853b095ffa69d682298cec#95
subclass of: http://lodlaundromat.org/.well-known/genid/80db9884dc853b095ffa69d682298cec#81
subclass of: http://lodlaundromat.org/.well-known/genid/80db9884dc853b095ffa69d682298cec#18
subclass of: http://lodlaundromat.org/.well-known/genid/80db9884dc853b095ffa69d682298cec#208
subclass of: http://lodlaundromat.org/.well-known/genid/80db9884dc853b095ffa69d682298cec#187
subclass of: http://lodlaundromat.org/.well-known/genid/80db9884dc853b095ffa69d682298cec#38
subclass of: http://lodlaundromat.org/.well-known/genid/80db9884dc853b095ffa69d682298cec#90

chapter title
subclass of: Resource
type: Class
subclass of: Thing
comment: The title of a chapter.
subclass of: http://lodlaundromat.org/.well-known/genid/80db9884dc853b095ffa69d682298cec#62
subclass of: title
disjoint with: section title
subclass of: http://lodlaundromat.org/.well-known/genid/80db9884dc853b095ffa69d682298cec#238
subclass of: DiscourseElement
subclass of: http://lodlaundromat.org/.well-known/genid/80db9884dc853b095ffa69d682298cec#235

bibliography
subclass of: Resource
type: Class
subclass of: Thing
comment: A document section containing a list of bibliographic references.
subclass of: http://lodlaundromat.org/.well-known/genid/80db9884dc853b095ffa69d682298cec#25
subclass of: http://lodlaundromat.org/.well-known/genid/80db9884dc853b095ffa69d682298cec#31
subclass of: http://lodlaundromat.org/.well-known/genid/80db9884dc853b095ffa69d682298cec#27

abstract
subclass of: Resource
type: Class
subclass of: Thing
comment: A brief summary of a book, a research article, thesis, review, conference proceeding or any in-depth analysis of a particular subject or discipline, the purpose of which is to help the reader quickly ascertain the publication's purpose.
subclass of: http://lodlaundromat.org/.well-known/genid/80db9884dc853b095ffa69d682298cec#239
subclass of: http://lodlaundromat.org/.well-known/genid/80db9884dc853b095ffa69d682298cec#245
subclass of: http://lodlaundromat.org/.well-known/genid/80db9884dc853b095ffa69d682298cec#241

back matter
subclass of: http://lodlaundromat.org/.well-known/genid/80db9884dc853b095ffa69d682298cec#226
subclass of: http://lodlaundromat.org/.well-known/genid/80db9884dc853b095ffa69d682298cec#34
subclass of: http://lodlaundromat.org/.well-known/genid/80db9884dc853b095ffa69d682298cec#108
subclass of: Resource
subclass of: Thing
type: Class
subclass of: http://lodlaundromat.org/.well-known/genid/80db9884dc853b095ffa69d682298cec#157
subclass of: http://lodlaundromat.org/.well-known/genid/80db9884dc853b095ffa69d682298cec#14
subclass of: http://lodlaundromat.org/.well-known/genid/80db9884dc853b095ffa69d682298cec#67
subclass of: http://lodlaundromat.org/.well-known/genid/80db9884dc853b095ffa69d682298cec#177
subclass of: http://lodlaundromat.org/.well-known/genid/80db9884dc853b095ffa69d682298cec#100
comment: The final principle part of a document, in which is usually found the bibliography, index, appendixes, etc.
subclass of: http://lodlaundromat.org/.well-known/genid/80db9884dc853b095ffa69d682298cec#12
subclass of: http://lodlaundromat.org/.well-known/genid/80db9884dc853b095ffa69d682298cec#18
subclass of: Container
subclass of: DiscourseElement
subclass of: http://lodlaundromat.org/.well-known/genid/80db9884dc853b095ffa69d682298cec#81
subclass of: http://lodlaundromat.org/.well-known/genid/80db9884dc853b095ffa69d682298cec#125
subclass of: http://lodlaundromat.org/.well-known/genid/80db9884dc853b095ffa69d682298cec#90
subclass of: http://lodlaundromat.org/.well-known/genid/80db9884dc853b095ffa69d682298cec#208
subclass of: http://lodlaundromat.org/.well-known/genid/80db9884dc853b095ffa69d682298cec#43
subclass of: http://lodlaundromat.org/.well-known/genid/80db9884dc853b095ffa69d682298cec#38
subclass of: http://lodlaundromat.org/.well-known/genid/80db9884dc853b095ffa69d682298cec#95
subclass of: http://lodlaundromat.org/.well-known/genid/80db9884dc853b095ffa69d682298cec#187

chapter subtitle
subclass of: Resource
type: Class
subclass of: Thing
comment: The subtitle of a chapter.
subclass of: http://lodlaundromat.org/.well-known/genid/80db9884dc853b095ffa69d682298cec#61
subclass of: subtitle
disjoint with: section subtitle
subclass of: http://lodlaundromat.org/.well-known/genid/80db9884dc853b095ffa69d682298cec#60
subclass of: DiscourseElement
subclass of: Block
subclass of: http://lodlaundromat.org/.well-known/genid/80db9884dc853b095ffa69d682298cec#129
subclass of: http://lodlaundromat.org/.well-known/genid/80db9884dc853b095ffa69d682298cec#125
subclass of: http://lodlaundromat.org/.well-known/genid/80db9884dc853b095ffa69d682298cec#235
subclass of: http://lodlaundromat.org/.well-known/genid/80db9884dc853b095ffa69d682298cec#182

section subtitle
subclass of: Resource
type: Class
subclass of: Thing
comment: The subtitle of a section.
subclass of: http://lodlaundromat.org/.well-known/genid/80db9884dc853b095ffa69d682298cec#204
subclass of: subtitle
subclass of: Block
subclass of: http://lodlaundromat.org/.well-known/genid/80db9884dc853b095ffa69d682298cec#125
subclass of: http://lodlaundromat.org/.well-known/genid/80db9884dc853b095ffa69d682298cec#235
subclass of: http://lodlaundromat.org/.well-known/genid/80db9884dc853b095ffa69d682298cec#129
subclass of: DiscourseElement
subclass of: http://lodlaundromat.org/.well-known/genid/80db9884dc853b095ffa69d682298cec#203
subclass of: http://lodlaundromat.org/.well-known/genid/80db9884dc853b095ffa69d682298cec#182
disjoint with: chapter subtitle

front matter
subclass of: http://lodlaundromat.org/.well-known/genid/80db9884dc853b095ffa69d682298cec#14
subclass of: http://lodlaundromat.org/.well-known/genid/80db9884dc853b095ffa69d682298cec#246
subclass of: http://lodlaundromat.org/.well-known/genid/80db9884dc853b095ffa69d682298cec#108
subclass of: http://lodlaundromat.org/.well-known/genid/80db9884dc853b095ffa69d682298cec#67
subclass of: http://lodlaundromat.org/.well-known/genid/80db9884dc853b095ffa69d682298cec#100
subclass of: http://lodlaundromat.org/.well-known/genid/80db9884dc853b095ffa69d682298cec#157
subclass of: http://lodlaundromat.org/.well-known/genid/80db9884dc853b095ffa69d682298cec#226
type: Class
subclass of: http://lodlaundromat.org/.well-known/genid/80db9884dc853b095ffa69d682298cec#34
subclass of: Resource
subclass of: Thing
subclass of: http://lodlaundromat.org/.well-known/genid/80db9884dc853b095ffa69d682298cec#177
comment: The initial principle part of a document, usually containing self-referential metadata. In a book, this typically includes its title, authors, publisher, publication date, ISBN and copyright declaration, together with the preface, foreword, table of content, etc. In a journal article, the front matter is normally restricted to the title, authors and the authors' affiliation details, although the latter may alternatively be included in a footnote or the back matter. In books, the front matter pages may be numbered in lowercase Roman numerals.
subclass of: http://lodlaundromat.org/.well-known/genid/80db9884dc853b095ffa69d682298cec#95
subclass of: http://lodlaundromat.org/.well-known/genid/80db9884dc853b095ffa69d682298cec#98
subclass of: DiscourseElement
subclass of: Container
subclass of: http://lodlaundromat.org/.well-known/genid/80db9884dc853b095ffa69d682298cec#125
subclass of: http://lodlaundromat.org/.well-known/genid/80db9884dc853b095ffa69d682298cec#81
subclass of: http://lodlaundromat.org/.well-known/genid/80db9884dc853b095ffa69d682298cec#187
subclass of: http://lodlaundromat.org/.well-known/genid/80db9884dc853b095ffa69d682298cec#90
subclass of: http://lodlaundromat.org/.well-known/genid/80db9884dc853b095ffa69d682298cec#208
subclass of: http://lodlaundromat.org/.well-known/genid/80db9884dc853b095ffa69d682298cec#38
subclass of: http://lodlaundromat.org/.well-known/genid/80db9884dc853b095ffa69d682298cec#43
subclass of: http://lodlaundromat.org/.well-known/genid/80db9884dc853b095ffa69d682298cec#18

line
subclass of: Resource
type: Class
subclass of: Thing
comment: A line in poetry is a unit of language into which a poem is divided which operates on principles which are distinct from and not necessarily coincident with grammatical structures, such as the sentence or clauses in sentences. A distinct numbered group of lines in verse is normally called a stanza.
subclass of: DiscourseElement
subclass of: Block
subclass of: http://lodlaundromat.org/.well-known/genid/80db9884dc853b095ffa69d682298cec#235
subclass of: http://lodlaundromat.org/.well-known/genid/80db9884dc853b095ffa69d682298cec#129
subclass of: http://lodlaundromat.org/.well-known/genid/80db9884dc853b095ffa69d682298cec#125
subclass of: http://lodlaundromat.org/.well-known/genid/80db9884dc853b095ffa69d682298cec#182

label
subclass of: Resource
type: Class
subclass of: Thing
comment: A block containing text, that may include a number (e.g., "Chapter Three", "3.2", "Figure 1", "Table"), used to identify an item within the document, for example a chapter, a figure, a section or a table.
subclass of: http://lodlaundromat.org/.well-known/genid/80db9884dc853b095ffa69d682298cec#124
subclass of: DiscourseElement

block quotation
subclass of: Resource
type: Class
subclass of: Thing
comment: A block quotation (also known as a long quotation or extract) is a quotation in a written document which is set off from the main text as a container for distinct paragraphs, which is typically distinguished visually using indentation, a different font, or smaller size. Block quotations are used for longer passages than run-in quotations (which are set off with quotation marks).
subclass of: Container
subclass of: http://lodlaundromat.org/.well-known/genid/80db9884dc853b095ffa69d682298cec#125
subclass of: http://lodlaundromat.org/.well-known/genid/80db9884dc853b095ffa69d682298cec#81

list
subclass of: Resource
type: Class
subclass of: Thing
comment: An enumeration of items.
subclass of: http://lodlaundromat.org/.well-known/genid/80db9884dc853b095ffa69d682298cec#128
subclass of: http://lodlaundromat.org/.well-known/genid/80db9884dc853b095ffa69d682298cec#140
subclass of: DiscourseElement
subclass of: http://lodlaundromat.org/.well-known/genid/80db9884dc853b095ffa69d682298cec#143
subclass of: http://lodlaundromat.org/.well-known/genid/80db9884dc853b095ffa69d682298cec#137
subclass of: Table

part
subclass of: Resource
type: Class
subclass of: Thing
comment: A container of a semantic subdivision of a document. For example, chapters of a novel may be grouped into distinct parts that may be named 'Part 1', 'Part 2', etc., 'Book 1', 'Book 2', etc., or 'Genesis', 'Exodus', etc.
subclass of: http://lodlaundromat.org/.well-known/genid/80db9884dc853b095ffa69d682298cec#187
subclass of: DiscourseElement
subclass of: Container
subclass of: http://lodlaundromat.org/.well-known/genid/80db9884dc853b095ffa69d682298cec#125
subclass of: http://lodlaundromat.org/.well-known/genid/80db9884dc853b095ffa69d682298cec#81
subclass of: http://lodlaundromat.org/.well-known/genid/80db9884dc853b095ffa69d682298cec#18
subclass of: http://lodlaundromat.org/.well-known/genid/80db9884dc853b095ffa69d682298cec#208
subclass of: http://lodlaundromat.org/.well-known/genid/80db9884dc853b095ffa69d682298cec#95
subclass of: http://lodlaundromat.org/.well-known/genid/80db9884dc853b095ffa69d682298cec#43
subclass of: http://lodlaundromat.org/.well-known/genid/80db9884dc853b095ffa69d682298cec#38
subclass of: http://lodlaundromat.org/.well-known/genid/80db9884dc853b095ffa69d682298cec#90

list of organizations
subclass of: Resource
type: Class
subclass of: Thing
comment: A list of items, each denoting an organization or institution related to the publication, for example the authors' affiliations, or the suppliers of information, software, equipment or consumables used in the work described in the publication.
subclass of: list of agents
subclass of: http://lodlaundromat.org/.well-known/genid/80db9884dc853b095ffa69d682298cec#143
subclass of: list
subclass of: http://lodlaundromat.org/.well-known/genid/80db9884dc853b095ffa69d682298cec#128
subclass of: http://lodlaundromat.org/.well-known/genid/80db9884dc853b095ffa69d682298cec#140
subclass of: http://lodlaundromat.org/.well-known/genid/80db9884dc853b095ffa69d682298cec#137
subclass of: Table
subclass of: DiscourseElement

formula
subclass of: Resource
type: Class
subclass of: Thing
comment: A unit of information expressed in mathematical, chemical or logical symbols and language.
subclass of: DiscourseElement
subclass of: Popup
subclass of: http://lodlaundromat.org/.well-known/genid/80db9884dc853b095ffa69d682298cec#81

appendix
subclass of: Resource
type: Class
subclass of: Thing
comment: A supplemental addition to the main work. It may contain data, more detailed information about methods and materials, or provide additional detail concerning the information found in the main work.
subclass of: http://lodlaundromat.org/.well-known/genid/80db9884dc853b095ffa69d682298cec#5
subclass of: http://lodlaundromat.org/.well-known/genid/80db9884dc853b095ffa69d682298cec#4
subclass of: http://lodlaundromat.org/.well-known/genid/80db9884dc853b095ffa69d682298cec#11
subclass of: http://lodlaundromat.org/.well-known/genid/80db9884dc853b095ffa69d682298cec#123
subclass of: http://lodlaundromat.org/.well-known/genid/80db9884dc853b095ffa69d682298cec#198
subclass of: http://lodlaundromat.org/.well-known/genid/80db9884dc853b095ffa69d682298cec#7
subclass of: http://lodlaundromat.org/.well-known/genid/80db9884dc853b095ffa69d682298cec#194
subclass of: HeadedContainer
subclass of: section
subclass of: http://lodlaundromat.org/.well-known/genid/80db9884dc853b095ffa69d682298cec#137
subclass of: http://lodlaundromat.org/.well-known/genid/80db9884dc853b095ffa69d682298cec#195
subclass of: http://lodlaundromat.org/.well-known/genid/80db9884dc853b095ffa69d682298cec#54
subclass of: http://lodlaundromat.org/.well-known/genid/80db9884dc853b095ffa69d682298cec#27
subclass of: http://lodlaundromat.org/.well-known/genid/80db9884dc853b095ffa69d682298cec#200
subclass of: http://lodlaundromat.org/.well-known/genid/80db9884dc853b095ffa69d682298cec#50
subclass of: DiscourseElement
subclass of: http://lodlaundromat.org/.well-known/genid/80db9884dc853b095ffa69d682298cec#152
subclass of: http://lodlaundromat.org/.well-known/genid/80db9884dc853b095ffa69d682298cec#172
subclass of: http://lodlaundromat.org/.well-known/genid/80db9884dc853b095ffa69d682298cec#119
subclass of: http://lodlaundromat.org/.well-known/genid/80db9884dc853b095ffa69d682298cec#117
subclass of: http://lodlaundromat.org/.well-known/genid/80db9884dc853b095ffa69d682298cec#1
subclass of: http://lodlaundromat.org/.well-known/genid/80db9884dc853b095ffa69d682298cec#241

section title
subclass of: Resource
type: Class
subclass of: Thing
comment: The title of a section.
subclass of: http://lodlaundromat.org/.well-known/genid/80db9884dc853b095ffa69d682298cec#205
subclass of: title
subclass of: http://lodlaundromat.org/.well-known/genid/80db9884dc853b095ffa69d682298cec#235
subclass of: http://lodlaundromat.org/.well-known/genid/80db9884dc853b095ffa69d682298cec#238
subclass of: DiscourseElement
disjoint with: chapter title

list of authors
subclass of: Resource
type: Class
subclass of: Thing
comment: A list of items each denoting an author of a particular publication.
subclass of: list of agents
subclass of: http://lodlaundromat.org/.well-known/genid/80db9884dc853b095ffa69d682298cec#143
subclass of: http://lodlaundromat.org/.well-known/genid/80db9884dc853b095ffa69d682298cec#128
subclass of: list
subclass of: http://lodlaundromat.org/.well-known/genid/80db9884dc853b095ffa69d682298cec#137
subclass of: http://lodlaundromat.org/.well-known/genid/80db9884dc853b095ffa69d682298cec#140
subclass of: Table
subclass of: DiscourseElement

complex run-in quotation
subclass of: Resource
type: Class
subclass of: Thing
comment: A quotation with a complex structure, that is included inline and is usually enclosed within quotation marks.
subclass of: DiscourseElement
subclass of: Popup
subclass of: http://lodlaundromat.org/.well-known/genid/80db9884dc853b095ffa69d682298cec#81

DoCO, the Document Components Ontology
creator: Silvio Peroni
description: DoCO, the Document Components Ontology, provides a structured vocabulary written in OWL 2 DL of document components, both structural (e.g. block, inline, paragraph, section, chapter) and rhetorical (e.g. introduction, discussion, acknowledgements, reference list, figure, appendix), enabling these components, and documents composed of them, to be described in RDF. It imports the Discourse Elements Ontology (http://purl.org/spar/deo) and the Document Structural Patterns Ontology (http://www.essepuntato.it/2008/12/pattern), and uses seven rhetorical block elements (background, conclusion, contribution, discussion, evaluation, motivation and scenario) abstracted from the SALT Rhetorical Ontology (http://salt.semanticauthoring.org/ontologies/sro.rdfs).
date: 2014-05-14
type: Ontology
rights: This work is distributed under a Creative Commons Attribution License (http://creativecommons.org/licenses/by/3.0/).
imports: deo
imports: pattern
comment: DoCO, the Document Components Ontology, is an ontology for describing the component parts of a bibliographic document. It forms part of SPAR, a suite of Semantic Publishing and Referencing Ontologies. Other SPAR ontologies are described at http://purl.org/spar/.
creator: David Shotton
version info: 1.2
comment: This ontology is available at http://purl.org/spar/doco, and uses the namespace prefix doco.