has playlist item
range: Thing
domain: Thing
type: ObjectProperty
comment: A specific playlist item, e.g. a music track, video or slides. The range types of this property must be based on bibo:Document or frbr:Endeavour (to keep it somehow media based).
domain: Playlist Slot
range: http://lodlaundromat.org/.well-known/genid/7c78318871269ae0124a6749bfd74265#8
sub property of: item
inverse of: is playlist item of
term status: unstable
type: Property
domain: http://lodlaundromat.org/.well-known/genid/7c78318871269ae0124a6749bfd74265#1
domain: Resource
domain: Slot
range: Resource

Media Action Counter
subclass of: Thing
subclass of: Resource
type: Class
comment: A media action counter. Media actions are for example play back or skip events.
subclass of: Counter
term status: unstable

has transition
range: Thing
domain: Thing
type: ObjectProperty
comment: This relation directs to a description of a transition between two neighbouring playlist slots, e.g. two successive music tracks in a dj mix.
domain: Playlist Slot
sub property of: association
term status: testing
type: Property
domain: http://lodlaundromat.org/.well-known/genid/7c78318871269ae0124a6749bfd74265#1
domain: Resource
domain: Slot
range: Resource

has playlist
range: Thing
type: ObjectProperty
comment: Associates a playlist to something.
domain: Thing
range: Playlist
term status: testing
type: Property
domain: Resource
range: Resource
range: http://lodlaundromat.org/.well-known/genid/7c78318871269ae0124a6749bfd74265#2
range: http://lodlaundromat.org/.well-known/genid/7c78318871269ae0124a6749bfd74265#5
range: http://lodlaundromat.org/.well-known/genid/7c78318871269ae0124a6749bfd74265#8
range: Document
range: OrderedList

has media object
range: Thing
domain: Thing
type: ObjectProperty
comment: Associates a media object to its related counter.
domain: Media Action Counter
range: http://lodlaundromat.org/.well-known/genid/7c78318871269ae0124a6749bfd74265#2
sub property of: object
term status: unstable
type: Property
domain: Resource
domain: Counter
range: Resource

Play Back Counter
subclass of: Resource
subclass of: Thing
type: Class
comment: A play back counter, e.g. to count the playback of a media object.
subclass of: Media Action Counter
term status: unstable
subclass of: Counter

has skip time
range: Thing
domain: Thing
type: ObjectProperty
comment: The moment, when someone skipped the media object, e.g. an instant of a timeline of an audio signal.
domain: Skip Event
sub property of: time
term status: testing
type: Property
domain: Resource
domain: ScrobbleEvent
range: Resource

Playlist Slot
subclass of: Resource
subclass of: Thing
type: Class
comment: A playlist slot. It could contain e.g. a music track, a video or a slide, and maybe related with some additional properties. However, it could maybe also included a "sub" playlist, e.g. to keep a fixed sequence of some tracks.
subclass of: http://lodlaundromat.org/.well-known/genid/7c78318871269ae0124a6749bfd74265#1
subclass of: Slot
term status: testing

Skip Counter
subclass of: Resource
subclass of: Thing
type: Class
comment: A skip counter, e.g. to count skip events of a media object.
subclass of: Media Action Counter
term status: unstable
subclass of: Counter

http://lodlaundromat.org/.well-known/genid/7c78318871269ae0124a6749bfd74265#1
type: Class
subclass of: Thing
subclass of: Resource
type: Restriction
min cardinality: 1
on property: has playlist item

Playlist
subclass of: Thing
subclass of: Resource
type: Class
comment: A playlist of specific media items, e.g. music tracks, videos or slides.
subclass of: Document
subclass of: OrderedList
term status: unstable
subclass of: http://lodlaundromat.org/.well-known/genid/7c78318871269ae0124a6749bfd74265#2
subclass of: http://lodlaundromat.org/.well-known/genid/7c78318871269ae0124a6749bfd74265#5
subclass of: http://lodlaundromat.org/.well-known/genid/7c78318871269ae0124a6749bfd74265#8

has playlist slot
range: Thing
domain: Thing
type: ObjectProperty
comment: A specific slot in a playlist.
domain: Playlist
range: Playlist Slot
sub property of: slot
term status: testing
type: Property
domain: Resource
domain: http://lodlaundromat.org/.well-known/genid/7c78318871269ae0124a6749bfd74265#2
domain: http://lodlaundromat.org/.well-known/genid/7c78318871269ae0124a6749bfd74265#5
domain: http://lodlaundromat.org/.well-known/genid/7c78318871269ae0124a6749bfd74265#8
domain: Document
domain: OrderedList
range: http://lodlaundromat.org/.well-known/genid/7c78318871269ae0124a6749bfd74265#1
range: Resource
range: Slot

is playlist item of
range: Playlist Slot
domain: http://lodlaundromat.org/.well-known/genid/7c78318871269ae0124a6749bfd74265#8
inverse of: has playlist item
range: Thing
domain: Thing
type: ObjectProperty
type: Property
domain: Resource
range: http://lodlaundromat.org/.well-known/genid/7c78318871269ae0124a6749bfd74265#1
range: Resource
range: Slot

Fixed Playlist
subclass of: Resource
subclass of: Thing
type: Class
comment: A (sub) playlist of a fixed length and a fixed order. This concept should be used to express static relations, e.g. "those three music tracks must always be played in a row".
subclass of: Playlist
term status: testing
subclass of: OrderedList
subclass of: Document
subclass of: http://lodlaundromat.org/.well-known/genid/7c78318871269ae0124a6749bfd74265#2
subclass of: http://lodlaundromat.org/.well-known/genid/7c78318871269ae0124a6749bfd74265#8
subclass of: http://lodlaundromat.org/.well-known/genid/7c78318871269ae0124a6749bfd74265#5

has media scrobble object
range: Thing
domain: Thing
type: ObjectProperty
comment: A media specific scrobble object, e.g. a music track or a video.
range: http://lodlaundromat.org/.well-known/genid/7c78318871269ae0124a6749bfd74265#5
sub property of: scrobble object
term status: testing
type: Property
domain: Resource
range: Resource

Skip Event
subclass of: Thing
subclass of: Resource
type: Class
comment: A specific skip event of something.
subclass of: ScrobbleEvent
term status: testing

The Play Back Ontology
imports: event.owl
imports: bibo
imports: core
type: Ontology
imports: similarity
imports: ns
description: The Play Back Ontology specification provides basic concepts and properties for describing concepts that are related to the play back domain, e.g. an playlist, play back count and skip counter on/ for the Semantic Web. This document contains a RDF description of the Play Back Ontology.
date: 2010-09-13T17:31:52Z
creator: me
version info: 0.6
creator: kurtjx
imports: http://purl.org/dc/elements/1.1/