preferred label
range: Thing
domain: Thing
type: Property
type: ObjectProperty
comment: If C skosxl:prefLabel L and L skosxl:literalForm V, then X skos:prefLabel V.
range: Label
definition: The property skosxl:prefLabel is used to associate an skosxl:Label with a skos:Concept. The property is analogous to skos:prefLabel.
range: http://lodlaundromat.org/.well-known/genid/6cf636276d4078b836ac19854e682ea2#1
range: Resource
domain: Resource

alternative label
range: Thing
domain: Thing
type: Property
type: ObjectProperty
comment: If C skosxl:altLabel L and L skosxl:literalForm V, then X skos:altLabel V.
range: Label
definition: The property skosxl:altLabel is used to associate an skosxl:Label with a skos:Concept. The property is analogous to skos:altLabel.
range: http://lodlaundromat.org/.well-known/genid/6cf636276d4078b836ac19854e682ea2#1
range: Resource
domain: Resource

label relation
range: Thing
domain: Thing
type: Property
type: ObjectProperty
type: SymmetricProperty
domain: Label
range: Label
definition: The property skosxl:labelRelation is used for representing binary ('direct') relations between instances of the class skosxl:Label.
scope note: skosxl:labelRelation is not intended to be used directly, but rather as the basis for a design pattern which can be refined for more specific labeling scenarios.
range: http://lodlaundromat.org/.well-known/genid/6cf636276d4078b836ac19854e682ea2#1
range: Resource
domain: http://lodlaundromat.org/.well-known/genid/6cf636276d4078b836ac19854e682ea2#1
domain: Resource

Label
subclass of: Thing
subclass of: Resource
type: Class
subclass of: http://lodlaundromat.org/.well-known/genid/6cf636276d4078b836ac19854e682ea2#1
disjoint with: Collection
disjoint with: Concept
disjoint with: ConceptScheme
definition: A special class of lexical entities.

hidden label
range: Thing
domain: Thing
type: Property
type: ObjectProperty
comment: If C skosxl:hiddenLabel L and L skosxl:literalForm V, then C skos:hiddenLabel V.
range: Label
definition: The property skosxl:hiddenLabel is used to associate an skosxl:Label with a skos:Concept. The property is analogous to skos:hiddenLabel.
range: http://lodlaundromat.org/.well-known/genid/6cf636276d4078b836ac19854e682ea2#1
range: Resource
domain: Resource

http://lodlaundromat.org/.well-known/genid/6cf636276d4078b836ac19854e682ea2#1
subclass of: Resource
subclass of: Thing
type: Class
type: Restriction
cardinality: 1
on property: literal form

SKOS XL Vocabulary
contributor: Participants in W3C's Semantic Web Deployment Working Group.
creator: Alistair Miles
creator: Sean Bechhofer
description: An RDF vocabulary extending SKOS and allowing the description and linking of lexical entities.
type: Ontology
imports: core

literal form
type: Property
type: DatatypeProperty
comment: If two instances of the class skosxl:Label have the same literal form, they are not necessarily the same resource.
comment: The range of skosxl:literalForm is the class of RDF plain literals.
domain: Label
definition: The property skosxl:literalForm is used to give the literal form of an skosxl:Label.
domain: Thing
domain: http://lodlaundromat.org/.well-known/genid/6cf636276d4078b836ac19854e682ea2#1
domain: Resource