ratingValue
property disjoint with: mainOriginalTitle
property disjoint with: date
property disjoint with: title
property disjoint with: locationLatitude
property disjoint with: collectionName
property disjoint with: locationAltitude
sub property of: topDataProperty
property disjoint with: samplingRate
property disjoint with: frameHeight
property disjoint with: numberOfTracks
property disjoint with: alternativeTitle
type: DatatypeProperty
property disjoint with: description
property disjoint with: trackName
property disjoint with: recordDate
property disjoint with: bottomDataProperty
property disjoint with: locationLongitude
property disjoint with: creationDate
property disjoint with: averageBitRate
property disjoint with: releaseDate
property disjoint with: frameSizeUnit
property disjoint with: frameRate
property disjoint with: locator
property disjoint with: editDate
property disjoint with: locationName
property disjoint with: duration
property disjoint with: frameWidth
property disjoint with: copyright
property disjoint with: fragmentName
comment: Corresponds to 'rating.value' in the Ontology for Media Resources.
domain: Rating
range: decimal

AudioTrack
disjoint with: Rating
disjoint with: Agent
disjoint with: Person
disjoint with: Collection
disjoint with: Nothing
disjoint with: VideoTrack
type: Class
subclass of: Thing
disjoint with: Organisation
subclass of: Track
disjoint with: TargetAudience
disjoint with: Location
subclass of: MediaFragment
subclass of: MediaResource
disjoint with: DataTrack
comment: A specialisation of Track for Audio to provide a link to specific data properties such as sampleRate, etc. Specialisation is defined through object properties.

hasRatingSystem
property disjoint with: hasPublisher
property disjoint with: bottomObjectProperty
property disjoint with: hasFragment
property disjoint with: hasRelatedImage
property disjoint with: hasCreated
property disjoint with: depictsFictionalLocation
property disjoint with: hasCopyrightOver
property disjoint with: hasCompression
property disjoint with: hasContributedTo
property disjoint with: hasCreator
property disjoint with: hasPublished
property disjoint with: hasGenre
property disjoint with: isSigningOf
property disjoint with: hasPolicy
property disjoint with: hasCaptioning
property disjoint with: provides
property disjoint with: hasClassificationSystem
property disjoint with: hasTargetAudience
property disjoint with: hasRating
property disjoint with: hasSubtitling
property disjoint with: hasNamedFragment
property disjoint with: hasContributor
property disjoint with: hasAudioDescription
property disjoint with: playsIn
property disjoint with: hasFormat
property disjoint with: isImageRelatedTo
property disjoint with: hasRelatedLocation
property disjoint with: hasChapter
property disjoint with: createdIn
property disjoint with: isCopyrightedBy
property disjoint with: hasRelatedResource
sub property of: topObjectProperty
property disjoint with: isFragmentOf
property disjoint with: isMemberOf
property disjoint with: isTrackOf
property disjoint with: hasSigning
property disjoint with: isLocationRelatedTo
property disjoint with: hasPermissions
property disjoint with: hasSource
property disjoint with: isNamedFragmentOf
property disjoint with: isFictionalLocationDepictedIn
type: ObjectProperty
property disjoint with: isChapterOf
property disjoint with: isCreationLocationOf
property disjoint with: hasAccessConditions
property disjoint with: hasLanguage
property disjoint with: hasClassification
property disjoint with: isCaptioningOf
property disjoint with: features
property disjoint with: hasKeyword
property disjoint with: hasMember
property disjoint with: isTargetAudienceOf
property disjoint with: hasTrack
property disjoint with: hasLocationCoordinateSystem
comment: Corresponds to 'rating.type' in the Ontology for Media Resources.
domain: Rating

mainOriginalTitle
type: DatatypeProperty
property disjoint with: ratingScaleMin
sub property of: topDataProperty
property disjoint with: locationAltitude
property disjoint with: ratingScaleMax
property disjoint with: locationName
property disjoint with: bottomDataProperty
property disjoint with: collectionName
sub property of: title
property disjoint with: ratingValue
property disjoint with: locationLatitude
property disjoint with: locationLongitude
comment: Corresponds to 'title.title' in the Ontology for Media Resources with a 'title.type' meaning "original".

frameSizeUnit
sub property of: topDataProperty
type: DatatypeProperty
property disjoint with: locationName
property disjoint with: bottomDataProperty
property disjoint with: collectionName
property disjoint with: locationLongitude
property disjoint with: locationLatitude
property disjoint with: ratingValue
property disjoint with: locationAltitude
property disjoint with: ratingScaleMax
property disjoint with: ratingScaleMin
comment: Corresponds to 'frameSize.unit' in the Ontology for Media Resources.
domain: MediaResource

Identifier
issued: 1999-07-02
property disjoint with: bottomObjectProperty
description: Recommended best practice is to identify the resource by means of a string conforming to a formal identification system.
type: Thing
modified: 2008-01-14
note: A second property with the same name as this property has been declared in the dcterms: namespace (http://purl.org/dc/terms/). See the Introduction to the document "DCMI Metadata Terms" (http://dublincore.org/documents/dcmi-terms/) for an explanation.
sub property of: topObjectProperty
has version: identifier-006
type: ObjectProperty
type: Property
comment: An unambiguous reference to the resource within a given context.

VideoTrack
subclass of: MediaFragment
subclass of: Track
disjoint with: Collection
disjoint with: Location
disjoint with: AudioTrack
disjoint with: TargetAudience
disjoint with: Nothing
subclass of: Thing
disjoint with: DataTrack
disjoint with: Organisation
disjoint with: Person
disjoint with: Rating
type: Class
subclass of: MediaResource
disjoint with: Agent
comment: A specialisation of Track for Video to provide a link to specific data properties such as frameRate, etc. Signing is another possible example of video track. Specialisation is defined through object properties.

hasPolicy
property disjoint with: hasPublished
property disjoint with: isLocationRelatedTo
property disjoint with: hasLocationCoordinateSystem
property disjoint with: hasCreated
property disjoint with: provides
property disjoint with: isFictionalLocationDepictedIn
property disjoint with: hasMember
property disjoint with: isRatingOf
property disjoint with: isProvidedBy
property disjoint with: hasContributedTo
property disjoint with: hasCopyrightOver
property disjoint with: isTargetAudienceOf
property disjoint with: hasRatingSystem
sub property of: topObjectProperty
property disjoint with: bottomObjectProperty
type: ObjectProperty
property disjoint with: hasClassification
property disjoint with: isCreationLocationOf
property disjoint with: playsIn
property disjoint with: hasClassificationSystem
comment: Corresponds to 'policy' in the Ontology for Media Resources. Subproperties can be used to distinguish different values of 'policy.type'.
domain: MediaResource

isMemberOf
property disjoint with: hasContributor
property disjoint with: depictsFictionalLocation
property disjoint with: isFragmentOf
property disjoint with: isCreationLocationOf
inverse of: hasMember
sub property of: topObjectProperty
property disjoint with: hasCaptioning
property disjoint with: hasCreator
property disjoint with: hasSubtitling
property disjoint with: hasRating
property disjoint with: isRelatedTo
property disjoint with: isCaptioningOf
property disjoint with: isLocationRelatedTo
property disjoint with: hasSigning
property disjoint with: hasFragment
property disjoint with: hasCopyrightOver
property disjoint with: hasLocationCoordinateSystem
type: ObjectProperty
property disjoint with: hasClassificationSystem
property disjoint with: hasMember
property disjoint with: hasTrack
property disjoint with: isNamedFragmentOf
property disjoint with: bottomObjectProperty
property disjoint with: hasNamedFragment
property disjoint with: playsIn
property disjoint with: isProvidedBy
property disjoint with: isTargetAudienceOf
property disjoint with: isSourceOf
property disjoint with: hasTargetAudience
property disjoint with: isCopyrightedBy
property disjoint with: hasCreated
property disjoint with: isTrackOf
property disjoint with: hasClassification
property disjoint with: hasRelatedLocation
property disjoint with: hasChapter
property disjoint with: isRatingOf
property disjoint with: isImageRelatedTo
property disjoint with: hasContributedTo
property disjoint with: isFictionalLocationDepictedIn
property disjoint with: hasPublisher
property disjoint with: isSigningOf
property disjoint with: hasRatingSystem
property disjoint with: isChapterOf
property disjoint with: hasAudioDescription
property disjoint with: createdIn
property disjoint with: hasPublished
property disjoint with: provides
property disjoint with: hasRelatedImage
property disjoint with: features
comment: Corresponds to 'collection' in the Ontology for Media Resources.
domain: MediaResource
range: Collection

duration
property disjoint with: bottomDataProperty
property disjoint with: ratingValue
property disjoint with: locationLatitude
type: DatatypeProperty
property disjoint with: locator
property disjoint with: locationName
property disjoint with: collectionName
property disjoint with: locationAltitude
property disjoint with: locationLongitude
property disjoint with: ratingScaleMax
sub property of: topDataProperty
property disjoint with: ratingScaleMin
comment: Corresponds to 'duration' in the Ontology for Media Resources.
domain: http://lodlaundromat.org/.well-known/genid/6498517e3d480e4884df0dc5fd2da7bd#5
range: decimal

hasCaptioning
property disjoint with: hasLocationCoordinateSystem
sub property of: topObjectProperty
property disjoint with: hasContributor
property disjoint with: provides
property disjoint with: depictsFictionalLocation
property disjoint with: hasMember
type: ObjectProperty
property disjoint with: isLocationRelatedTo
property disjoint with: isRatingOf
property disjoint with: isProvidedBy
property disjoint with: hasCreated
property disjoint with: isMemberOf
property disjoint with: hasRatingSystem
property disjoint with: hasPublisher
property disjoint with: isTargetAudienceOf
property disjoint with: hasPublished
property disjoint with: hasRelatedLocation
property disjoint with: isCopyrightedBy
property disjoint with: createdIn
property disjoint with: isFictionalLocationDepictedIn
property disjoint with: hasTargetAudience
sub property of: hasFragment
property disjoint with: playsIn
property disjoint with: hasRating
inverse of: isCaptioningOf
property disjoint with: hasCreator
property disjoint with: isCreationLocationOf
property disjoint with: hasClassificationSystem
property disjoint with: features
property disjoint with: hasClassification
property disjoint with: hasContributedTo
property disjoint with: bottomObjectProperty
property disjoint with: hasCopyrightOver
comment: Corresponds to 'fragment' in the Ontology for Media Resources with a 'fragment.role' meaning "captioning". This property can for example point to a spatial fragment, a VideoTrack or a DataTrack. The language of the captioning track can be expressed by attaching a 'hasLanguage' property to the specific track.

frameRate
property disjoint with: locator
property disjoint with: ratingScaleMin
property disjoint with: locationLongitude
sub property of: topDataProperty
property disjoint with: ratingValue
property disjoint with: bottomDataProperty
property disjoint with: locationLatitude
property disjoint with: locationName
property disjoint with: ratingScaleMax
property disjoint with: locationAltitude
property disjoint with: collectionName
type: DatatypeProperty
comment: Corresponds to 'frameRate' in the Ontology for Media Resources, in frame per second.
domain: MediaResource
range: decimal

recordDate
property disjoint with: collectionName
property disjoint with: locationLatitude
property disjoint with: ratingScaleMin
property disjoint with: ratingScaleMax
property disjoint with: locationName
property disjoint with: bottomDataProperty
sub property of: topDataProperty
type: DatatypeProperty
property disjoint with: locationLongitude
sub property of: date
property disjoint with: ratingValue
property disjoint with: locationAltitude
comment: Corresponds to 'date.date' in the Ontology for Media Resources with a 'date.type' meaning "recordDate".

Type
type: Thing
modified: 2008-01-14
sub property of: topObjectProperty
note: A second property with the same name as this property has been declared in the dcterms: namespace (http://purl.org/dc/terms/). See the Introduction to the document "DCMI Metadata Terms" (http://dublincore.org/documents/dcmi-terms/) for an explanation.
issued: 1999-07-02
property disjoint with: bottomObjectProperty
type: ObjectProperty
has version: type-006
description: Recommended best practice is to use a controlled vocabulary such as the DCMI Type Vocabulary [DCMITYPE]. To describe the file format, physical medium, or dimensions of the resource, use the Format element.
type: Property
comment: The nature or genre of the resource.

Subject
modified: 2008-01-14
property disjoint with: bottomObjectProperty
sub property of: topObjectProperty
type: ObjectProperty
description: Typically, the subject will be represented using keywords, key phrases, or classification codes. Recommended best practice is to use a controlled vocabulary. To describe the spatial or temporal topic of the resource, use the Coverage element.
note: A second property with the same name as this property has been declared in the dcterms: namespace (http://purl.org/dc/terms/). See the Introduction to the document "DCMI Metadata Terms" (http://dublincore.org/documents/dcmi-terms/) for an explanation.
type: Thing
issued: 1999-07-02
has version: subject-006
type: Property
comment: The topic of the resource.

depictsFictionalLocation
property disjoint with: hasSigning
property disjoint with: hasCaptioning
property disjoint with: isCopyrightedBy
property disjoint with: isTrackOf
property disjoint with: hasChapter
property disjoint with: isMemberOf
property disjoint with: hasLocationCoordinateSystem
property disjoint with: hasCreated
property disjoint with: isSigningOf
property disjoint with: isCreationLocationOf
property disjoint with: hasRatingSystem
property disjoint with: hasCopyrightOver
property disjoint with: isNamedFragmentOf
property disjoint with: hasSubtitling
property disjoint with: isRelatedTo
sub property of: topObjectProperty
property disjoint with: isFragmentOf
property disjoint with: hasContributedTo
property disjoint with: hasNamedFragment
property disjoint with: hasContributor
property disjoint with: bottomObjectProperty
property disjoint with: hasTargetAudience
property disjoint with: isImageRelatedTo
property disjoint with: hasPublisher
property disjoint with: playsIn
property disjoint with: hasAudioDescription
property disjoint with: hasPublished
property disjoint with: hasFragment
property disjoint with: isProvidedBy
type: ObjectProperty
property disjoint with: hasTrack
property disjoint with: hasMember
property disjoint with: features
property disjoint with: isFictionalLocationDepictedIn
property disjoint with: provides
property disjoint with: isLocationRelatedTo
sub property of: hasRelatedLocation
property disjoint with: isChapterOf
property disjoint with: hasCreator
property disjoint with: hasClassification
property disjoint with: isCaptioningOf
property disjoint with: hasClassificationSystem
property disjoint with: isTargetAudienceOf
property disjoint with: isSourceOf
inverse of: isFictionalLocationDepictedIn
property disjoint with: hasRating
property disjoint with: isRatingOf
property disjoint with: hasRelatedImage
comment: A subproperty of 'hasRelatedLocation' used to specify where the action depicted in the media is supposed to take place, as opposed to the location where shooting actually took place (see 'createdIn').

Language
type: Thing
modified: 2008-01-14
type: ObjectProperty
note: A second property with the same name as this property has been declared in the dcterms: namespace (http://purl.org/dc/terms/). See the Introduction to the document "DCMI Metadata Terms" (http://dublincore.org/documents/dcmi-terms/) for an explanation.
has version: language-007
description: Recommended best practice is to use a controlled vocabulary such as RFC 4646 [RFC4646].
sub property of: topObjectProperty
issued: 1999-07-02
property disjoint with: bottomObjectProperty
type: Property
comment: A language of the resource.

hasNamedFragment
property disjoint with: hasPublisher
property disjoint with: hasCopyrightOver
property disjoint with: playsIn
type: ObjectProperty
property disjoint with: provides
property disjoint with: isProvidedBy
property disjoint with: hasRating
property disjoint with: hasCreated
sub property of: hasFragment
property disjoint with: hasClassificationSystem
property disjoint with: hasLocationCoordinateSystem
property disjoint with: hasPublished
property disjoint with: createdIn
inverse of: isNamedFragmentOf
property disjoint with: hasTargetAudience
property disjoint with: isFictionalLocationDepictedIn
property disjoint with: depictsFictionalLocation
property disjoint with: isCopyrightedBy
property disjoint with: hasCreator
property disjoint with: isMemberOf
property disjoint with: isTargetAudienceOf
property disjoint with: isCreationLocationOf
property disjoint with: features
sub property of: topObjectProperty
property disjoint with: isRatingOf
property disjoint with: hasContributedTo
property disjoint with: hasRelatedLocation
property disjoint with: bottomObjectProperty
property disjoint with: hasClassification
property disjoint with: hasContributor
property disjoint with: hasRatingSystem
property disjoint with: isLocationRelatedTo
property disjoint with: hasMember
comment: Corresponds to 'namedFragment' in the Ontology for Media Resources.

hasTrack
sub property of: topObjectProperty
property disjoint with: hasRelatedLocation
property disjoint with: hasLocationCoordinateSystem
property disjoint with: hasMember
property disjoint with: hasClassificationSystem
property disjoint with: features
property disjoint with: hasContributor
property disjoint with: isMemberOf
property disjoint with: provides
property disjoint with: hasRatingSystem
property disjoint with: isLocationRelatedTo
inverse of: isTrackOf
property disjoint with: isFictionalLocationDepictedIn
property disjoint with: hasCopyrightOver
property disjoint with: isRatingOf
property disjoint with: playsIn
property disjoint with: hasPublished
sub property of: hasFragment
property disjoint with: hasRating
property disjoint with: hasTargetAudience
property disjoint with: isCopyrightedBy
property disjoint with: depictsFictionalLocation
property disjoint with: hasCreator
property disjoint with: hasCreated
property disjoint with: hasClassification
type: ObjectProperty
property disjoint with: isCreationLocationOf
property disjoint with: isTargetAudienceOf
property disjoint with: createdIn
property disjoint with: isProvidedBy
property disjoint with: bottomObjectProperty
property disjoint with: hasContributedTo
property disjoint with: hasPublisher
comment: Corresponds to 'fragment' in the Ontology for Media Resources with a 'fragment.role' meaning "track".
range: Track

hasCreator
property disjoint with: depictsFictionalLocation
property disjoint with: hasClassification
property disjoint with: isTrackOf
property disjoint with: hasChapter
property disjoint with: provides
property disjoint with: isFictionalLocationDepictedIn
property disjoint with: hasSubtitling
property disjoint with: isNamedFragmentOf
property disjoint with: isRelatedTo
sub property of: hasContributor
property disjoint with: hasPublished
property disjoint with: hasAudioDescription
property disjoint with: hasTrack
sub property of: topObjectProperty
property disjoint with: isTargetAudienceOf
property disjoint with: playsIn
property disjoint with: hasTargetAudience
property disjoint with: isSigningOf
property disjoint with: isLocationRelatedTo
property disjoint with: hasClassificationSystem
property disjoint with: hasContributedTo
property disjoint with: isFragmentOf
property disjoint with: hasCreated
property disjoint with: isChapterOf
property disjoint with: hasCopyrightOver
property disjoint with: isSourceOf
inverse of: hasCreated
property disjoint with: isMemberOf
property disjoint with: isCaptioningOf
property disjoint with: isProvidedBy
property disjoint with: hasRatingSystem
property disjoint with: hasRating
type: ObjectProperty
property disjoint with: hasRelatedLocation
property disjoint with: hasFragment
property disjoint with: hasNamedFragment
property disjoint with: isRatingOf
property disjoint with: bottomObjectProperty
property disjoint with: isCreationLocationOf
property disjoint with: hasLocationCoordinateSystem
property disjoint with: createdIn
property disjoint with: hasSigning
property disjoint with: hasRelatedImage
property disjoint with: hasMember
property disjoint with: hasCaptioning
property disjoint with: isImageRelatedTo
comment: Corresponds to 'creator.creator' in the Ontology for Media Resources. Subproperties can be used to distinguish different values of 'creator.role'. Note that this property is semantically a subproperty of 'hasContributor'.

Format
type: Thing
modified: 2008-01-14
description: Examples of dimensions include size and duration. Recommended best practice is to use a controlled vocabulary such as the list of Internet Media Types [MIME].
sub property of: topObjectProperty
property disjoint with: bottomObjectProperty
note: A second property with the same name as this property has been declared in the dcterms: namespace (http://purl.org/dc/terms/). See the Introduction to the document "DCMI Metadata Terms" (http://dublincore.org/documents/dcmi-terms/) for an explanation.
issued: 1999-07-02
has version: format-007
type: ObjectProperty
type: Property
comment: The file format, physical medium, or dimensions of the resource.

hasContributor
property disjoint with: hasPublished
property disjoint with: isChapterOf
property disjoint with: hasRating
type: ObjectProperty
property disjoint with: hasFragment
property disjoint with: isFictionalLocationDepictedIn
property disjoint with: hasTargetAudience
inverse of: hasContributedTo
property disjoint with: hasRelatedLocation
property disjoint with: isFragmentOf
property disjoint with: hasTrack
property disjoint with: isSourceOf
property disjoint with: hasContributedTo
property disjoint with: provides
property disjoint with: isTrackOf
property disjoint with: hasClassification
property disjoint with: createdIn
property disjoint with: isTargetAudienceOf
property disjoint with: hasCreated
property disjoint with: isMemberOf
property disjoint with: isRatingOf
property disjoint with: isRelatedTo
property disjoint with: hasRelatedImage
property disjoint with: hasAudioDescription
property disjoint with: hasSigning
property disjoint with: hasMember
sub property of: topObjectProperty
property disjoint with: isCaptioningOf
property disjoint with: depictsFictionalLocation
property disjoint with: hasRatingSystem
property disjoint with: isSigningOf
property disjoint with: hasClassificationSystem
property disjoint with: isNamedFragmentOf
property disjoint with: hasCopyrightOver
property disjoint with: isCreationLocationOf
property disjoint with: hasChapter
property disjoint with: isImageRelatedTo
property disjoint with: hasLocationCoordinateSystem
property disjoint with: hasCaptioning
property disjoint with: hasSubtitling
property disjoint with: bottomObjectProperty
property disjoint with: isProvidedBy
property disjoint with: isLocationRelatedTo
property disjoint with: playsIn
property disjoint with: hasNamedFragment
comment: Corresponds to 'contributor.contributor' in the Ontology for Media Resources. Subproperties can be used to distinguish different values of 'contributor.role'.
domain: MediaResource
range: Agent

Agent
disjoint with: Track
disjoint with: VideoTrack
disjoint with: MediaResource
disjoint with: Collection
subclass of: Thing
disjoint with: http://lodlaundromat.org/.well-known/genid/6498517e3d480e4884df0dc5fd2da7bd#1
disjoint with: http://lodlaundromat.org/.well-known/genid/6498517e3d480e4884df0dc5fd2da7bd#5
disjoint with: DataTrack
subclass of: http://lodlaundromat.org/.well-known/genid/6498517e3d480e4884df0dc5fd2da7bd#8
disjoint with: TargetAudience
disjoint with: MediaFragment
disjoint with: Location
disjoint with: Nothing
disjoint with: Rating
type: Class
disjoint with: Image
disjoint with: AudioTrack
subclass of: http://lodlaundromat.org/.well-known/genid/6498517e3d480e4884df0dc5fd2da7bd#4
comment: A person or organisation contributing to the media resource.

hasFormat
property disjoint with: provides
property disjoint with: playsIn
property disjoint with: isFictionalLocationDepictedIn
sub property of: topObjectProperty
property disjoint with: isRatingOf
property disjoint with: hasClassificationSystem
property disjoint with: hasPublished
property disjoint with: hasRatingSystem
property disjoint with: hasCreated
property disjoint with: hasMember
property disjoint with: hasCopyrightOver
property disjoint with: isTargetAudienceOf
property disjoint with: bottomObjectProperty
property disjoint with: isLocationRelatedTo
property disjoint with: hasClassification
type: ObjectProperty
property disjoint with: isCreationLocationOf
property disjoint with: hasLocationCoordinateSystem
property disjoint with: isProvidedBy
property disjoint with: hasContributedTo
comment: Corresponds to 'format' in the Ontology for Media Resources.
domain: MediaResource

locationName
property disjoint with: samplingRate
property disjoint with: ratingScaleMax
property disjoint with: creationDate
property disjoint with: date
property disjoint with: fragmentName
sub property of: topDataProperty
property disjoint with: collectionName
property disjoint with: alternativeTitle
property disjoint with: averageBitRate
property disjoint with: trackName
property disjoint with: frameHeight
property disjoint with: frameRate
type: DatatypeProperty
property disjoint with: duration
property disjoint with: ratingScaleMin
property disjoint with: description
property disjoint with: recordDate
property disjoint with: numberOfTracks
property disjoint with: ratingValue
property disjoint with: frameWidth
property disjoint with: locator
property disjoint with: title
property disjoint with: bottomDataProperty
property disjoint with: releaseDate
property disjoint with: copyright
property disjoint with: editDate
property disjoint with: mainOriginalTitle
property disjoint with: frameSizeUnit
comment: Corresponds to 'location.name' in the Ontology for Media Resources.
domain: Location

hasKeyword
property disjoint with: isLocationRelatedTo
property disjoint with: hasRatingSystem
property disjoint with: hasClassification
property disjoint with: provides
property disjoint with: isRatingOf
property disjoint with: isTargetAudienceOf
property disjoint with: hasMember
property disjoint with: hasCopyrightOver
property disjoint with: hasPublished
property disjoint with: hasContributedTo
sub property of: topObjectProperty
property disjoint with: isCreationLocationOf
property disjoint with: playsIn
property disjoint with: hasClassificationSystem
property disjoint with: isFictionalLocationDepictedIn
property disjoint with: hasCreated
property disjoint with: isProvidedBy
property disjoint with: bottomObjectProperty
type: ObjectProperty
property disjoint with: hasLocationCoordinateSystem
comment: Corresponds to 'keyword' in the Ontology for Media Resources.
domain: MediaResource

hasAccessConditions
property disjoint with: provides
property disjoint with: bottomObjectProperty
property disjoint with: playsIn
type: ObjectProperty
sub property of: topObjectProperty
property disjoint with: isFictionalLocationDepictedIn
property disjoint with: hasClassificationSystem
property disjoint with: isTargetAudienceOf
property disjoint with: hasCopyrightOver
property disjoint with: hasMember
property disjoint with: hasRatingSystem
sub property of: hasPolicy
property disjoint with: hasCreated
property disjoint with: hasLocationCoordinateSystem
property disjoint with: hasContributedTo
property disjoint with: isCreationLocationOf
property disjoint with: hasPublished
property disjoint with: isRatingOf
property disjoint with: hasClassification
property disjoint with: isProvidedBy
property disjoint with: isLocationRelatedTo
comment: Corresponds to 'policy' in the Ontology for Media Resources with a 'policy.type' "access conditions".

hasLanguage
property disjoint with: isFictionalLocationDepictedIn
property disjoint with: hasClassificationSystem
property disjoint with: isLocationRelatedTo
type: ObjectProperty
property disjoint with: hasLocationCoordinateSystem
property disjoint with: bottomObjectProperty
property disjoint with: isCreationLocationOf
property disjoint with: isRatingOf
property disjoint with: isProvidedBy
property disjoint with: hasClassification
sub property of: topObjectProperty
property disjoint with: hasContributedTo
property disjoint with: playsIn
property disjoint with: hasRatingSystem
property disjoint with: provides
property disjoint with: hasCreated
property disjoint with: isTargetAudienceOf
property disjoint with: hasCopyrightOver
property disjoint with: hasMember
property disjoint with: hasPublished
comment: Corresponds to 'language' in the Ontology for Media Resources. The language used in the resource. A controlled vocabulary such as defined in BCP 47 SHOULD be used. This property can also be used to identify the presence of sign language (RFC 5646). By inheritance, the hasLanguage property applies indifferently at the media resource / fragment / track levels. Best practice recommends to use to best possible level of granularity fo describe the usage of language within a media resource including at fragment and track levels.
domain: MediaResource

copyright
property disjoint with: collectionName
property disjoint with: ratingScaleMin
type: DatatypeProperty
property disjoint with: bottomDataProperty
property disjoint with: locationAltitude
property disjoint with: locationLongitude
property disjoint with: ratingValue
property disjoint with: ratingScaleMax
property disjoint with: locationName
property disjoint with: locationLatitude
sub property of: topDataProperty
comment: Corresponds to 'copyright.copyright' in the Ontology for Media Resources.
domain: MediaResource

DCMI Namespace for the Dublin Core Metadata Element Set, Version 1.1
modified: 2008-01-14
publisher: The Dublin Core Metadata Initiative
type: Thing
comment: To comment on this schema, please contact dcmifb@dublincore.org.

title
property disjoint with: collectionName
property disjoint with: bottomDataProperty
property disjoint with: locationLongitude
sub property of: topDataProperty
property disjoint with: locationAltitude
property disjoint with: locationLatitude
property disjoint with: locationName
property disjoint with: ratingValue
type: DatatypeProperty
property disjoint with: ratingScaleMax
property disjoint with: ratingScaleMin
comment: Corresponds to 'title.title' in the Ontology for Media Resources. Subproperties can be used to distinguish different values of 'title.type'.
domain: MediaResource

hasPermissions
property disjoint with: isRatingOf
sub property of: hasPolicy
property disjoint with: bottomObjectProperty
property disjoint with: isFictionalLocationDepictedIn
property disjoint with: isProvidedBy
property disjoint with: provides
property disjoint with: hasRatingSystem
property disjoint with: hasClassificationSystem
property disjoint with: hasCopyrightOver
property disjoint with: hasContributedTo
sub property of: topObjectProperty
property disjoint with: isLocationRelatedTo
property disjoint with: hasMember
property disjoint with: hasClassification
property disjoint with: playsIn
property disjoint with: hasCreated
type: ObjectProperty
property disjoint with: isCreationLocationOf
property disjoint with: hasPublished
property disjoint with: isTargetAudienceOf
property disjoint with: hasLocationCoordinateSystem
comment: Corresponds to 'policy' in the Ontology for Media Resources with a 'policy.type' meaning "permissions".

Description
has version: description-006
modified: 2008-01-14
note: A second property with the same name as this property has been declared in the dcterms: namespace (http://purl.org/dc/terms/). See the Introduction to the document "DCMI Metadata Terms" (http://dublincore.org/documents/dcmi-terms/) for an explanation.
type: ObjectProperty
sub property of: topObjectProperty
type: Thing
issued: 1999-07-02
description: Description may include but is not limited to: an abstract, a table of contents, a graphical representation, or a free-text account of the resource.
property disjoint with: bottomObjectProperty
type: Property
comment: An account of the resource.

isCopyrightedBy
property disjoint with: bottomObjectProperty
property disjoint with: isProvidedBy
property disjoint with: isRelatedTo
property disjoint with: hasRelatedImage
property disjoint with: isSigningOf
property disjoint with: hasCaptioning
property disjoint with: hasRatingSystem
property disjoint with: hasFragment
property disjoint with: isFragmentOf
property disjoint with: hasTargetAudience
property disjoint with: isImageRelatedTo
property disjoint with: isCreationLocationOf
inverse of: hasCopyrightOver
sub property of: topObjectProperty
property disjoint with: playsIn
property disjoint with: hasClassification
property disjoint with: isTargetAudienceOf
property disjoint with: hasCreated
property disjoint with: hasContributedTo
property disjoint with: isChapterOf
property disjoint with: hasClassificationSystem
property disjoint with: isCaptioningOf
property disjoint with: provides
property disjoint with: hasNamedFragment
property disjoint with: depictsFictionalLocation
type: ObjectProperty
property disjoint with: hasSigning
property disjoint with: hasRelatedLocation
property disjoint with: isSourceOf
property disjoint with: hasAudioDescription
property disjoint with: hasCopyrightOver
property disjoint with: isTrackOf
property disjoint with: isLocationRelatedTo
property disjoint with: hasTrack
property disjoint with: hasLocationCoordinateSystem
property disjoint with: isRatingOf
property disjoint with: hasSubtitling
property disjoint with: isNamedFragmentOf
property disjoint with: hasChapter
property disjoint with: hasMember
property disjoint with: isFictionalLocationDepictedIn
property disjoint with: isMemberOf
property disjoint with: createdIn
property disjoint with: hasRating
property disjoint with: hasPublished
comment: Corresponds to 'copyright.identifier' in the Ontology for Media Resources.
domain: MediaResource
range: Agent

locationLatitude
property disjoint with: description
property disjoint with: duration
property disjoint with: collectionName
property disjoint with: numberOfTracks
property disjoint with: ratingValue
property disjoint with: averageBitRate
property disjoint with: title
property disjoint with: locator
property disjoint with: bottomDataProperty
property disjoint with: copyright
property disjoint with: frameWidth
property disjoint with: ratingScaleMax
property disjoint with: recordDate
property disjoint with: editDate
property disjoint with: ratingScaleMin
property disjoint with: mainOriginalTitle
property disjoint with: alternativeTitle
property disjoint with: releaseDate
type: DatatypeProperty
property disjoint with: frameHeight
property disjoint with: fragmentName
property disjoint with: frameRate
property disjoint with: trackName
sub property of: topDataProperty
property disjoint with: frameSizeUnit
property disjoint with: date
property disjoint with: creationDate
property disjoint with: samplingRate
comment: Corresponds to 'location.latitude' in the Ontology for Media Resources.
domain: Location
range: decimal

ratingScaleMax
property disjoint with: frameHeight
property disjoint with: mainOriginalTitle
property disjoint with: editDate
property disjoint with: frameRate
property disjoint with: title
property disjoint with: locationLongitude
property disjoint with: copyright
property disjoint with: frameSizeUnit
property disjoint with: bottomDataProperty
property disjoint with: locationLatitude
property disjoint with: releaseDate
type: DatatypeProperty
property disjoint with: averageBitRate
sub property of: topDataProperty
property disjoint with: creationDate
property disjoint with: trackName
property disjoint with: alternativeTitle
property disjoint with: locationAltitude
property disjoint with: locator
property disjoint with: collectionName
property disjoint with: locationName
property disjoint with: description
property disjoint with: duration
property disjoint with: recordDate
property disjoint with: frameWidth
property disjoint with: fragmentName
property disjoint with: numberOfTracks
property disjoint with: samplingRate
property disjoint with: date
comment: Corresponds to 'rating.max' in the Ontology for Media Resources.
domain: Rating
range: decimal

Publisher
description: Examples of a Publisher include a person, an organization, or a service. Typically, the name of a Publisher should be used to indicate the entity.
type: Thing
issued: 1999-07-02
type: ObjectProperty
has version: publisher-006
note: A second property with the same name as this property has been declared in the dcterms: namespace (http://purl.org/dc/terms/). See the Introduction to the document "DCMI Metadata Terms" (http://dublincore.org/documents/dcmi-terms/) for an explanation.
modified: 2008-01-14
sub property of: topObjectProperty
property disjoint with: bottomObjectProperty
type: Property
comment: An entity responsible for making the resource available.

Source
issued: 1999-07-02
modified: 2008-01-14
property disjoint with: bottomObjectProperty
type: Thing
description: The described resource may be derived from the related resource in whole or in part. Recommended best practice is to identify the related resource by means of a string conforming to a formal identification system.
sub property of: topObjectProperty
note: A second property with the same name as this property has been declared in the dcterms: namespace (http://purl.org/dc/terms/). See the Introduction to the document "DCMI Metadata Terms" (http://dublincore.org/documents/dcmi-terms/) for an explanation.
has version: source-006
type: ObjectProperty
type: Property
comment: A related resource from which the described resource is derived.

Creator
type: ObjectProperty
has version: creator-006
property disjoint with: bottomObjectProperty
description: Examples of a Creator include a person, an organization, or a service. Typically, the name of a Creator should be used to indicate the entity.
issued: 1999-07-02
note: A second property with the same name as this property has been declared in the dcterms: namespace (http://purl.org/dc/terms/). See the Introduction to the document "DCMI Metadata Terms" (http://dublincore.org/documents/dcmi-terms/) for an explanation.
type: Thing
sub property of: topObjectProperty
modified: 2008-01-14
type: Property
comment: An entity primarily responsible for making the resource.

date
property disjoint with: ratingScaleMax
sub property of: topDataProperty
property disjoint with: bottomDataProperty
property disjoint with: collectionName
property disjoint with: ratingValue
property disjoint with: locationName
property disjoint with: locationAltitude
property disjoint with: locationLatitude
type: DatatypeProperty
property disjoint with: ratingScaleMin
property disjoint with: locationLongitude
comment: Corresponds to date.date in the ontology for Media Resources. Subproperties can be used to distinguish different values of 'date.type'. The recommended range is 'xsd:dateTime' (for compliance with OWL2-QL and OWL2-RL) but other time-related datatypes may be used (e.g. 'xsd:gYear', 'xsd:date'...).
domain: MediaResource

isProvidedBy
property disjoint with: isNamedFragmentOf
property disjoint with: isTrackOf
property disjoint with: hasSubtitling
property disjoint with: provides
property disjoint with: hasContributedTo
property disjoint with: hasCreator
property disjoint with: bottomObjectProperty
property disjoint with: isTargetAudienceOf
property disjoint with: hasRelatedResource
property disjoint with: hasCaptioning
property disjoint with: hasRelatedImage
property disjoint with: hasGenre
property disjoint with: hasPublished
property disjoint with: depictsFictionalLocation
property disjoint with: isRelatedTo
property disjoint with: hasAudioDescription
property disjoint with: hasTargetAudience
inverse of: provides
property disjoint with: playsIn
property disjoint with: hasCopyrightOver
property disjoint with: features
property disjoint with: createdIn
property disjoint with: isFragmentOf
sub property of: topObjectProperty
property disjoint with: hasSource
property disjoint with: hasPublisher
property disjoint with: hasMember
property disjoint with: hasPermissions
property disjoint with: hasContributor
property disjoint with: hasRating
property disjoint with: hasClassificationSystem
type: ObjectProperty
property disjoint with: hasChapter
property disjoint with: hasKeyword
property disjoint with: isLocationRelatedTo
property disjoint with: hasAccessConditions
property disjoint with: hasTrack
property disjoint with: isCaptioningOf
property disjoint with: hasRelatedLocation
property disjoint with: isFictionalLocationDepictedIn
property disjoint with: hasCompression
property disjoint with: hasLanguage
property disjoint with: hasCreated
property disjoint with: hasLocationCoordinateSystem
property disjoint with: hasPolicy
property disjoint with: isMemberOf
property disjoint with: isSourceOf
property disjoint with: isChapterOf
property disjoint with: isSigningOf
property disjoint with: isRatingOf
property disjoint with: hasClassification
property disjoint with: hasSigning
property disjoint with: isImageRelatedTo
property disjoint with: hasFormat
property disjoint with: isCreationLocationOf
property disjoint with: hasNamedFragment
property disjoint with: isCopyrightedBy
property disjoint with: hasFragment
comment: Corresponds to 'rating.identifier' in the Ontology for Media Resources.
domain: Rating
range: Agent

hasGenre
sub property of: topObjectProperty
property disjoint with: hasCopyrightOver
property disjoint with: provides
property disjoint with: hasRatingSystem
property disjoint with: hasClassification
property disjoint with: hasMember
property disjoint with: isProvidedBy
type: ObjectProperty
property disjoint with: isFictionalLocationDepictedIn
property disjoint with: hasContributedTo
property disjoint with: isCreationLocationOf
property disjoint with: hasCreated
property disjoint with: isRatingOf
property disjoint with: playsIn
property disjoint with: hasPublished
property disjoint with: bottomObjectProperty
property disjoint with: hasLocationCoordinateSystem
property disjoint with: isLocationRelatedTo
property disjoint with: hasClassificationSystem
property disjoint with: isTargetAudienceOf
comment: Corresponds to 'genre' in the Ontology for Media Resources.
domain: MediaResource

hasSubtitling
sub property of: hasCaptioning
type: ObjectProperty
property disjoint with: hasClassificationSystem
property disjoint with: isRatingOf
property disjoint with: hasClassification
property disjoint with: isFictionalLocationDepictedIn
property disjoint with: isCreationLocationOf
property disjoint with: bottomObjectProperty
property disjoint with: isTargetAudienceOf
property disjoint with: hasCopyrightOver
property disjoint with: hasRatingSystem
property disjoint with: hasLocationCoordinateSystem
property disjoint with: hasContributor
sub property of: hasFragment
property disjoint with: hasContributedTo
property disjoint with: playsIn
property disjoint with: isCopyrightedBy
property disjoint with: createdIn
property disjoint with: features
property disjoint with: hasRelatedLocation
property disjoint with: hasTargetAudience
property disjoint with: provides
property disjoint with: hasCreator
property disjoint with: hasMember
property disjoint with: hasCreated
property disjoint with: isLocationRelatedTo
property disjoint with: isProvidedBy
property disjoint with: isMemberOf
property disjoint with: hasPublished
property disjoint with: hasPublisher
property disjoint with: depictsFictionalLocation
sub property of: topObjectProperty
property disjoint with: hasRating
comment: Corresponds to 'fragment' in the Ontology for Media Resources with a 'fragment.role' meaning "subtitling".

hasRating
property disjoint with: features
property disjoint with: isFictionalLocationDepictedIn
property disjoint with: isSourceOf
property disjoint with: isSigningOf
inverse of: isRatingOf
property disjoint with: hasTargetAudience
property disjoint with: hasContributedTo
sub property of: topObjectProperty
property disjoint with: isLocationRelatedTo
property disjoint with: isMemberOf
property disjoint with: hasLocationCoordinateSystem
property disjoint with: hasNamedFragment
property disjoint with: isTargetAudienceOf
property disjoint with: hasChapter
property disjoint with: hasRatingSystem
property disjoint with: hasCreator
property disjoint with: hasSigning
property disjoint with: hasContributor
property disjoint with: depictsFictionalLocation
property disjoint with: isCaptioningOf
property disjoint with: hasPublisher
property disjoint with: hasTrack
property disjoint with: isProvidedBy
property disjoint with: hasClassification
property disjoint with: isCopyrightedBy
property disjoint with: hasCreated
property disjoint with: hasMember
property disjoint with: hasAudioDescription
property disjoint with: hasCopyrightOver
property disjoint with: bottomObjectProperty
property disjoint with: provides
property disjoint with: isRatingOf
property disjoint with: hasRelatedLocation
property disjoint with: playsIn
property disjoint with: isRelatedTo
property disjoint with: hasRelatedImage
property disjoint with: hasSubtitling
property disjoint with: isChapterOf
property disjoint with: hasClassificationSystem
property disjoint with: isCreationLocationOf
property disjoint with: isImageRelatedTo
property disjoint with: isNamedFragmentOf
property disjoint with: isTrackOf
property disjoint with: createdIn
property disjoint with: hasFragment
property disjoint with: hasCaptioning
property disjoint with: isFragmentOf
property disjoint with: hasPublished
type: ObjectProperty
comment: Corresponds to 'rating' in the Ontology for Media Resources.
domain: MediaResource
range: Rating

hasClassification
property disjoint with: hasRelatedLocation
property disjoint with: isLocationRelatedTo
property disjoint with: hasCreated
property disjoint with: hasRating
property disjoint with: hasPermissions
property disjoint with: hasTrack
property disjoint with: isMemberOf
property disjoint with: bottomObjectProperty
property disjoint with: hasRelatedImage
property disjoint with: hasPublished
property disjoint with: hasChapter
property disjoint with: hasSource
property disjoint with: hasSubtitling
sub property of: topObjectProperty
property disjoint with: isCopyrightedBy
property disjoint with: hasCompression
property disjoint with: hasFormat
property disjoint with: hasSigning
property disjoint with: isSigningOf
property disjoint with: hasLanguage
type: ObjectProperty
property disjoint with: hasPolicy
property disjoint with: isNamedFragmentOf
property disjoint with: hasCaptioning
property disjoint with: hasMember
property disjoint with: isCaptioningOf
property disjoint with: hasPublisher
property disjoint with: hasNamedFragment
property disjoint with: isTrackOf
property disjoint with: features
property disjoint with: hasContributedTo
property disjoint with: isFragmentOf
property disjoint with: hasRatingSystem
property disjoint with: hasAudioDescription
property disjoint with: hasFragment
property disjoint with: hasKeyword
property disjoint with: isCreationLocationOf
property disjoint with: isFictionalLocationDepictedIn
property disjoint with: hasCopyrightOver
property disjoint with: hasRelatedResource
property disjoint with: hasLocationCoordinateSystem
property disjoint with: hasCreator
property disjoint with: hasGenre
property disjoint with: createdIn
property disjoint with: hasTargetAudience
property disjoint with: isProvidedBy
property disjoint with: depictsFictionalLocation
property disjoint with: hasContributor
property disjoint with: provides
property disjoint with: hasAccessConditions
property disjoint with: isChapterOf
property disjoint with: playsIn
property disjoint with: isImageRelatedTo
property disjoint with: isRatingOf
comment: Corresponds to 'targetAudience.classification' in the Ontology for Media Resources. This property is used to provide a value characterising the target audience.
domain: TargetAudience

fragmentName
property disjoint with: locationLongitude
property disjoint with: ratingScaleMax
property disjoint with: bottomDataProperty
type: DatatypeProperty
property disjoint with: locationLatitude
property disjoint with: ratingScaleMin
property disjoint with: ratingValue
property disjoint with: collectionName
property disjoint with: locationAltitude
sub property of: topDataProperty
property disjoint with: locationName
comment: Corresponds to 'namedFragment.label' in the Ontology for Media Resources.
domain: MediaFragment

Collection
disjoint with: MediaResource
subclass of: http://lodlaundromat.org/.well-known/genid/6498517e3d480e4884df0dc5fd2da7bd#8
type: Class
disjoint with: Image
disjoint with: Track
disjoint with: Rating
disjoint with: Nothing
disjoint with: Person
disjoint with: http://lodlaundromat.org/.well-known/genid/6498517e3d480e4884df0dc5fd2da7bd#5
disjoint with: VideoTrack
disjoint with: Location
disjoint with: Organisation
disjoint with: DataTrack
subclass of: Thing
disjoint with: AudioTrack
disjoint with: MediaFragment
disjoint with: Agent
disjoint with: http://lodlaundromat.org/.well-known/genid/6498517e3d480e4884df0dc5fd2da7bd#1
disjoint with: TargetAudience
subclass of: http://lodlaundromat.org/.well-known/genid/6498517e3d480e4884df0dc5fd2da7bd#4
comment: Any group of media resource e.g. a series.

hasChapter
property disjoint with: hasContributor
property disjoint with: isCreationLocationOf
property disjoint with: hasCopyrightOver
property disjoint with: isProvidedBy
property disjoint with: playsIn
sub property of: topObjectProperty
property disjoint with: provides
property disjoint with: isFictionalLocationDepictedIn
property disjoint with: hasPublished
type: ObjectProperty
property disjoint with: hasRelatedLocation
property disjoint with: features
property disjoint with: hasCreator
property disjoint with: hasCreated
property disjoint with: hasMember
property disjoint with: hasContributedTo
property disjoint with: isTargetAudienceOf
property disjoint with: isMemberOf
property disjoint with: isCopyrightedBy
property disjoint with: hasRating
property disjoint with: isLocationRelatedTo
property disjoint with: hasRatingSystem
property disjoint with: depictsFictionalLocation
property disjoint with: hasPublisher
property disjoint with: createdIn
sub property of: hasFragment
property disjoint with: bottomObjectProperty
property disjoint with: isRatingOf
inverse of: isChapterOf
property disjoint with: hasClassificationSystem
property disjoint with: hasClassification
property disjoint with: hasTargetAudience
property disjoint with: hasLocationCoordinateSystem
comment: Corresponds to 'fragment' in the Ontology for Media Resources with a 'fragment.role' meaning "chapter".

ratingScaleMin
property disjoint with: samplingRate
property disjoint with: editDate
property disjoint with: frameHeight
property disjoint with: fragmentName
property disjoint with: releaseDate
property disjoint with: bottomDataProperty
property disjoint with: frameRate
property disjoint with: locationAltitude
property disjoint with: copyright
property disjoint with: creationDate
property disjoint with: date
property disjoint with: locationName
property disjoint with: frameWidth
property disjoint with: duration
property disjoint with: recordDate
property disjoint with: trackName
property disjoint with: alternativeTitle
property disjoint with: locationLatitude
property disjoint with: collectionName
property disjoint with: description
type: DatatypeProperty
property disjoint with: numberOfTracks
property disjoint with: frameSizeUnit
sub property of: topDataProperty
property disjoint with: title
property disjoint with: mainOriginalTitle
property disjoint with: locationLongitude
property disjoint with: averageBitRate
property disjoint with: locator
comment: Corresponds to 'rating.min' in the Ontology for Media Resources.
domain: Rating
range: decimal

releaseDate
property disjoint with: ratingValue
sub property of: topDataProperty
property disjoint with: locationLongitude
property disjoint with: locationLatitude
property disjoint with: bottomDataProperty
property disjoint with: locationAltitude
property disjoint with: locationName
sub property of: date
property disjoint with: ratingScaleMax
property disjoint with: collectionName
type: DatatypeProperty
property disjoint with: ratingScaleMin
comment: Corresponds to 'date.date' in the Ontology for Media Resources with a 'date.type' meaning "releaseDate".

hasRelatedImage
property disjoint with: depictsFictionalLocation
property disjoint with: hasPublisher
property disjoint with: isRatingOf
property disjoint with: hasClassification
type: ObjectProperty
property disjoint with: provides
property disjoint with: isTargetAudienceOf
property disjoint with: isLocationRelatedTo
property disjoint with: hasContributedTo
sub property of: topObjectProperty
property disjoint with: createdIn
property disjoint with: hasCreated
property disjoint with: hasRatingSystem
inverse of: isImageRelatedTo
property disjoint with: hasTargetAudience
property disjoint with: hasRelatedLocation
property disjoint with: hasPublished
property disjoint with: isCopyrightedBy
property disjoint with: hasCreator
property disjoint with: isFictionalLocationDepictedIn
property disjoint with: hasContributor
property disjoint with: playsIn
sub property of: hasRelatedResource
property disjoint with: isMemberOf
property disjoint with: hasClassificationSystem
property disjoint with: isProvidedBy
property disjoint with: hasMember
property disjoint with: hasLocationCoordinateSystem
property disjoint with: hasRating
property disjoint with: isCreationLocationOf
property disjoint with: features
property disjoint with: bottomObjectProperty
property disjoint with: hasCopyrightOver
comment: Corresponds to 'relation' and in the Ontology for Media Resources with a 'relation.type' meaning "related image".
range: Image

hasPublisher
property disjoint with: hasTargetAudience
inverse of: hasPublished
property disjoint with: hasCaptioning
property disjoint with: isImageRelatedTo
property disjoint with: isFragmentOf
property disjoint with: isChapterOf
property disjoint with: isTargetAudienceOf
property disjoint with: hasAudioDescription
property disjoint with: hasFragment
property disjoint with: isSourceOf
property disjoint with: hasLocationCoordinateSystem
property disjoint with: hasClassificationSystem
property disjoint with: hasSubtitling
property disjoint with: provides
sub property of: hasContributor
property disjoint with: hasCreated
property disjoint with: bottomObjectProperty
property disjoint with: hasClassification
property disjoint with: isProvidedBy
property disjoint with: isCreationLocationOf
property disjoint with: isMemberOf
property disjoint with: depictsFictionalLocation
property disjoint with: isCaptioningOf
sub property of: topObjectProperty
property disjoint with: hasNamedFragment
property disjoint with: hasRelatedLocation
property disjoint with: hasRating
property disjoint with: hasRatingSystem
property disjoint with: isRatingOf
property disjoint with: isFictionalLocationDepictedIn
property disjoint with: isLocationRelatedTo
property disjoint with: hasCopyrightOver
property disjoint with: createdIn
property disjoint with: hasTrack
property disjoint with: hasRelatedImage
property disjoint with: hasChapter
property disjoint with: hasContributedTo
property disjoint with: hasMember
property disjoint with: hasPublished
property disjoint with: isNamedFragmentOf
type: ObjectProperty
property disjoint with: hasSigning
property disjoint with: isSigningOf
property disjoint with: playsIn
property disjoint with: isRelatedTo
property disjoint with: isTrackOf
comment: Corresponds to 'publisher' in the Ontology for Media Resources.

hasRelatedResource
property disjoint with: isTargetAudienceOf
property disjoint with: hasMember
property disjoint with: hasCreated
property disjoint with: hasCopyrightOver
property disjoint with: hasClassification
property disjoint with: bottomObjectProperty
inverse of: isRelatedTo
type: ObjectProperty
property disjoint with: hasContributedTo
property disjoint with: isLocationRelatedTo
property disjoint with: provides
property disjoint with: hasPublished
property disjoint with: hasLocationCoordinateSystem
property disjoint with: playsIn
property disjoint with: isFictionalLocationDepictedIn
property disjoint with: isProvidedBy
property disjoint with: hasRatingSystem
property disjoint with: hasClassificationSystem
property disjoint with: isCreationLocationOf
sub property of: topObjectProperty
property disjoint with: isRatingOf
comment: Corresponds to 'relation' and in the Ontology for Media Resources. Subproperties can be used to distinguish different values of 'relation.type'.
domain: MediaResource

hasAudioDescription
property disjoint with: isCopyrightedBy
property disjoint with: isFictionalLocationDepictedIn
property disjoint with: createdIn
type: ObjectProperty
property disjoint with: hasCreated
property disjoint with: isRatingOf
property disjoint with: hasPublished
property disjoint with: hasCreator
property disjoint with: isMemberOf
property disjoint with: hasClassificationSystem
property disjoint with: hasLocationCoordinateSystem
property disjoint with: hasClassification
property disjoint with: isProvidedBy
property disjoint with: depictsFictionalLocation
sub property of: hasCaptioning
property disjoint with: features
property disjoint with: hasMember
property disjoint with: hasTargetAudience
property disjoint with: hasRating
property disjoint with: playsIn
sub property of: hasFragment
property disjoint with: provides
property disjoint with: isTargetAudienceOf
property disjoint with: hasContributor
property disjoint with: hasPublisher
property disjoint with: isLocationRelatedTo
property disjoint with: hasCopyrightOver
property disjoint with: isCreationLocationOf
property disjoint with: hasContributedTo
property disjoint with: hasRatingSystem
sub property of: topObjectProperty
property disjoint with: bottomObjectProperty
property disjoint with: hasRelatedLocation
comment: Corresponds to 'fragment' in the Ontology for Media Resources with a 'fragment.role' meaning "audio-description".

TargetAudience
disjoint with: MediaResource
disjoint with: Image
disjoint with: Track
disjoint with: Rating
disjoint with: http://lodlaundromat.org/.well-known/genid/6498517e3d480e4884df0dc5fd2da7bd#1
disjoint with: VideoTrack
disjoint with: AudioTrack
disjoint with: DataTrack
disjoint with: Person
type: Class
disjoint with: Collection
subclass of: http://lodlaundromat.org/.well-known/genid/6498517e3d480e4884df0dc5fd2da7bd#4
subclass of: http://lodlaundromat.org/.well-known/genid/6498517e3d480e4884df0dc5fd2da7bd#8
disjoint with: Agent
disjoint with: Nothing
subclass of: Thing
disjoint with: Location
disjoint with: MediaFragment
disjoint with: http://lodlaundromat.org/.well-known/genid/6498517e3d480e4884df0dc5fd2da7bd#5
disjoint with: Organisation
comment: Information about The target audience (target region, target audience category but also parental guidance recommendation) for which a media resource is intended.

MediaResource
disjoint with: Location
disjoint with: Person
subclass of: Thing
disjoint with: Collection
disjoint with: Rating
disjoint with: Agent
disjoint with: Nothing
disjoint with: Organisation
disjoint with: TargetAudience
type: Class
comment: An image or an audiovisual media resource, which can be composed of one or more fragment / track.

creationDate
property disjoint with: ratingScaleMax
property disjoint with: collectionName
sub property of: topDataProperty
property disjoint with: bottomDataProperty
property disjoint with: locationLongitude
property disjoint with: locationName
type: DatatypeProperty
property disjoint with: locationLatitude
property disjoint with: ratingScaleMin
property disjoint with: ratingValue
sub property of: date
property disjoint with: locationAltitude
comment: Corresponds to 'date.date' in the Ontology for Media Resources with a 'date.type' meaning "creationDate".

locationLongitude
property disjoint with: date
property disjoint with: recordDate
sub property of: topDataProperty
property disjoint with: alternativeTitle
property disjoint with: duration
property disjoint with: mainOriginalTitle
property disjoint with: description
property disjoint with: ratingValue
property disjoint with: locator
property disjoint with: editDate
property disjoint with: collectionName
property disjoint with: releaseDate
property disjoint with: creationDate
property disjoint with: averageBitRate
property disjoint with: fragmentName
property disjoint with: numberOfTracks
property disjoint with: frameSizeUnit
type: DatatypeProperty
property disjoint with: frameWidth
property disjoint with: copyright
property disjoint with: samplingRate
property disjoint with: bottomDataProperty
property disjoint with: trackName
property disjoint with: title
property disjoint with: ratingScaleMax
property disjoint with: ratingScaleMin
property disjoint with: frameRate
property disjoint with: frameHeight
comment: Corresponds to 'location.longitude' in the Ontology for Media Resources.
domain: Location
range: decimal

hasLocationCoordinateSystem
property disjoint with: isTargetAudienceOf
property disjoint with: hasRelatedResource
property disjoint with: bottomObjectProperty
property disjoint with: hasLanguage
property disjoint with: isTrackOf
property disjoint with: hasContributedTo
property disjoint with: hasRelatedImage
sub property of: topObjectProperty
property disjoint with: hasPermissions
property disjoint with: hasCreator
property disjoint with: features
property disjoint with: provides
property disjoint with: isImageRelatedTo
property disjoint with: isMemberOf
property disjoint with: hasFormat
property disjoint with: hasTrack
property disjoint with: hasClassificationSystem
property disjoint with: hasRating
property disjoint with: hasPublisher
property disjoint with: playsIn
property disjoint with: hasContributor
property disjoint with: hasMember
property disjoint with: hasNamedFragment
property disjoint with: hasGenre
property disjoint with: hasCaptioning
property disjoint with: hasCopyrightOver
property disjoint with: isNamedFragmentOf
property disjoint with: hasRelatedLocation
property disjoint with: hasKeyword
property disjoint with: hasPolicy
property disjoint with: isFragmentOf
property disjoint with: isProvidedBy
type: ObjectProperty
property disjoint with: isRatingOf
property disjoint with: hasCreated
property disjoint with: isSigningOf
property disjoint with: hasSubtitling
property disjoint with: createdIn
property disjoint with: depictsFictionalLocation
property disjoint with: hasAudioDescription
property disjoint with: hasFragment
property disjoint with: isCopyrightedBy
property disjoint with: hasChapter
property disjoint with: hasTargetAudience
property disjoint with: hasCompression
property disjoint with: isChapterOf
property disjoint with: hasClassification
property disjoint with: hasRatingSystem
property disjoint with: hasSource
property disjoint with: hasAccessConditions
property disjoint with: hasPublished
property disjoint with: isCaptioningOf
property disjoint with: hasSigning
comment: Corresponds to 'location.coordinateSystem' in the Ontology for Media Resources.
domain: Location

locator
property disjoint with: locationLongitude
property disjoint with: samplingRate
property disjoint with: numberOfTracks
property disjoint with: frameWidth
property disjoint with: locationName
property disjoint with: frameHeight
property disjoint with: locationAltitude
property disjoint with: averageBitRate
type: DatatypeProperty
property disjoint with: ratingValue
property disjoint with: collectionName
property disjoint with: frameRate
property disjoint with: ratingScaleMax
sub property of: topDataProperty
property disjoint with: ratingScaleMin
property disjoint with: bottomDataProperty
property disjoint with: locationLatitude
property disjoint with: duration
comment: Corresponds to 'locator' in the Ontology for Media Resources.
domain: MediaResource
range: anyURI

MediaFragment
disjoint with: Person
disjoint with: Organisation
disjoint with: Agent
disjoint with: Collection
disjoint with: Rating
disjoint with: Nothing
type: Class
disjoint with: Location
subclass of: MediaResource
disjoint with: TargetAudience
subclass of: Thing
comment: A media fragment (spatial, temporal, track...) composing a media resource. In other ontologies fragment is sometimes referred to as a 'part' or 'segment'.

Relation
property disjoint with: bottomObjectProperty
type: Thing
type: ObjectProperty
issued: 1999-07-02
sub property of: topObjectProperty
has version: relation-006
modified: 2008-01-14
description: Recommended best practice is to identify the related resource by means of a string conforming to a formal identification system.
note: A second property with the same name as this property has been declared in the dcterms: namespace (http://purl.org/dc/terms/). See the Introduction to the document "DCMI Metadata Terms" (http://dublincore.org/documents/dcmi-terms/) for an explanation.
type: Property
comment: A related resource.

hasFragment
property disjoint with: isMemberOf
property disjoint with: isTargetAudienceOf
property disjoint with: isLocationRelatedTo
property disjoint with: hasRatingSystem
type: ObjectProperty
property disjoint with: hasContributedTo
property disjoint with: bottomObjectProperty
property disjoint with: isRatingOf
property disjoint with: hasLocationCoordinateSystem
property disjoint with: hasTargetAudience
property disjoint with: provides
property disjoint with: hasPublisher
property disjoint with: hasCreated
property disjoint with: hasMember
property disjoint with: hasContributor
property disjoint with: isCreationLocationOf
property disjoint with: isFictionalLocationDepictedIn
property disjoint with: depictsFictionalLocation
property disjoint with: hasRelatedLocation
property disjoint with: hasRating
property disjoint with: hasCopyrightOver
property disjoint with: features
property disjoint with: hasCreator
property disjoint with: hasPublished
property disjoint with: hasClassification
property disjoint with: hasClassificationSystem
property disjoint with: isProvidedBy
property disjoint with: playsIn
inverse of: isFragmentOf
property disjoint with: createdIn
property disjoint with: isCopyrightedBy
sub property of: topObjectProperty
comment: Corresponds to 'fragment' in the Ontology for Media Resources. Subproperties can be used to distinguish different values of 'fragment.role'.
domain: MediaResource
range: MediaFragment

frameHeight
property disjoint with: locationName
property disjoint with: bottomDataProperty
property disjoint with: ratingScaleMin
property disjoint with: collectionName
type: DatatypeProperty
property disjoint with: ratingScaleMax
property disjoint with: locationAltitude
property disjoint with: locator
property disjoint with: locationLatitude
property disjoint with: ratingValue
sub property of: topDataProperty
property disjoint with: locationLongitude
comment: Corresponds to 'frameSize.height' in the Ontology for Media Resources, measured in frameSizeUnit.
domain: MediaResource
range: integer

hasSource
property disjoint with: provides
property disjoint with: hasRatingSystem
property disjoint with: hasContributedTo
inverse of: isSourceOf
property disjoint with: hasLocationCoordinateSystem
type: ObjectProperty
property disjoint with: bottomObjectProperty
property disjoint with: playsIn
property disjoint with: isProvidedBy
sub property of: hasRelatedResource
property disjoint with: isFictionalLocationDepictedIn
property disjoint with: hasClassificationSystem
property disjoint with: hasMember
property disjoint with: isCreationLocationOf
property disjoint with: hasPublished
sub property of: topObjectProperty
property disjoint with: hasCreated
property disjoint with: hasClassification
property disjoint with: isRatingOf
property disjoint with: isTargetAudienceOf
property disjoint with: isLocationRelatedTo
property disjoint with: hasCopyrightOver
comment: Corresponds to 'relation' and in the Ontology for Media Resources with a 'relation.type' meaning "source".

samplingRate
property disjoint with: ratingScaleMax
type: DatatypeProperty
property disjoint with: ratingScaleMin
property disjoint with: locationLongitude
property disjoint with: locationAltitude
property disjoint with: locator
sub property of: topDataProperty
property disjoint with: bottomDataProperty
property disjoint with: locationName
property disjoint with: collectionName
property disjoint with: ratingValue
property disjoint with: locationLatitude
comment: Corresponds to 'samplingRate' in the Ontology for Media Resources, in samples per second.
domain: MediaResource
range: decimal

frameWidth
property disjoint with: ratingScaleMax
type: DatatypeProperty
property disjoint with: locationName
property disjoint with: collectionName
property disjoint with: locationAltitude
sub property of: topDataProperty
property disjoint with: locationLatitude
property disjoint with: locationLongitude
property disjoint with: ratingScaleMin
property disjoint with: bottomDataProperty
property disjoint with: locator
property disjoint with: ratingValue
comment: Corresponds to 'frameSize.width' in the Ontology for Media Resources measured in frameSizeUnit.
domain: MediaResource
range: integer

Image
type: Class
disjoint with: http://lodlaundromat.org/.well-known/genid/6498517e3d480e4884df0dc5fd2da7bd#5
disjoint with: http://lodlaundromat.org/.well-known/genid/6498517e3d480e4884df0dc5fd2da7bd#8
disjoint with: http://lodlaundromat.org/.well-known/genid/6498517e3d480e4884df0dc5fd2da7bd#1
disjoint with: http://lodlaundromat.org/.well-known/genid/6498517e3d480e4884df0dc5fd2da7bd#4
disjoint with: Rating
disjoint with: Organisation
disjoint with: TargetAudience
complement of: http://lodlaundromat.org/.well-known/genid/6498517e3d480e4884df0dc5fd2da7bd#8
subclass of: Thing
subclass of: MediaResource
complement of: http://lodlaundromat.org/.well-known/genid/6498517e3d480e4884df0dc5fd2da7bd#4
disjoint with: Collection
disjoint with: Location
disjoint with: Agent
disjoint with: Nothing
disjoint with: Person
comment: A still image / thumbnail / key frame related to the media resource or being the media resource itself.

hasCompression
sub property of: topObjectProperty
property disjoint with: hasContributedTo
property disjoint with: isRatingOf
property disjoint with: hasRatingSystem
property disjoint with: provides
property disjoint with: isFictionalLocationDepictedIn
property disjoint with: isCreationLocationOf
property disjoint with: hasClassificationSystem
property disjoint with: bottomObjectProperty
property disjoint with: hasMember
property disjoint with: isLocationRelatedTo
property disjoint with: hasClassification
property disjoint with: playsIn
property disjoint with: hasCopyrightOver
property disjoint with: hasPublished
type: ObjectProperty
property disjoint with: hasCreated
property disjoint with: isProvidedBy
property disjoint with: hasLocationCoordinateSystem
property disjoint with: isTargetAudienceOf
comment: Corresponds to 'compression' in the Ontology for Media Resources.
domain: MediaResource

Rating
disjoint with: Image
subclass of: http://lodlaundromat.org/.well-known/genid/6498517e3d480e4884df0dc5fd2da7bd#4
disjoint with: Collection
disjoint with: Nothing
disjoint with: AudioTrack
disjoint with: Location
disjoint with: Person
disjoint with: MediaResource
subclass of: http://lodlaundromat.org/.well-known/genid/6498517e3d480e4884df0dc5fd2da7bd#8
disjoint with: Agent
disjoint with: http://lodlaundromat.org/.well-known/genid/6498517e3d480e4884df0dc5fd2da7bd#5
disjoint with: TargetAudience
disjoint with: Track
disjoint with: http://lodlaundromat.org/.well-known/genid/6498517e3d480e4884df0dc5fd2da7bd#1
disjoint with: DataTrack
disjoint with: Organisation
type: Class
disjoint with: VideoTrack
subclass of: Thing
disjoint with: MediaFragment
comment: Information about the rating given to a media resource.

averageBitRate
property disjoint with: locator
property disjoint with: ratingValue
property disjoint with: ratingScaleMax
type: DatatypeProperty
property disjoint with: bottomDataProperty
property disjoint with: ratingScaleMin
sub property of: topDataProperty
property disjoint with: locationLongitude
property disjoint with: locationAltitude
property disjoint with: locationLatitude
property disjoint with: collectionName
property disjoint with: locationName
comment: Corresponds to 'averageBitRate' in the Ontology for Media Resources, expressed in kilobits/second.
domain: http://lodlaundromat.org/.well-known/genid/6498517e3d480e4884df0dc5fd2da7bd#1
range: decimal

Date
note: A second property with the same name as this property has been declared in the dcterms: namespace (http://purl.org/dc/terms/). See the Introduction to the document "DCMI Metadata Terms" (http://dublincore.org/documents/dcmi-terms/) for an explanation.
description: Date may be used to express temporal information at any level of granularity. Recommended best practice is to use an encoding scheme, such as the W3CDTF profile of ISO 8601 [W3CDTF].
issued: 1999-07-02
modified: 2008-01-14
has version: date-006
type: Thing
type: AnnotationProperty
comment: A point or period of time associated with an event in the lifecycle of the resource.
type: Property

hasRelatedLocation
property disjoint with: hasCreated
property disjoint with: isProvidedBy
property disjoint with: playsIn
property disjoint with: hasSigning
property disjoint with: isCaptioningOf
property disjoint with: isLocationRelatedTo
property disjoint with: hasContributedTo
property disjoint with: hasRating
property disjoint with: isFictionalLocationDepictedIn
property disjoint with: hasCaptioning
property disjoint with: hasTrack
type: ObjectProperty
property disjoint with: isChapterOf
property disjoint with: hasPublisher
property disjoint with: isSigningOf
property disjoint with: isNamedFragmentOf
property disjoint with: hasClassificationSystem
property disjoint with: isRatingOf
inverse of: isLocationRelatedTo
property disjoint with: hasRatingSystem
property disjoint with: hasSubtitling
property disjoint with: hasCopyrightOver
property disjoint with: hasCreator
property disjoint with: hasMember
property disjoint with: hasAudioDescription
property disjoint with: isFragmentOf
property disjoint with: hasFragment
property disjoint with: hasRelatedImage
property disjoint with: hasClassification
property disjoint with: isImageRelatedTo
property disjoint with: isCreationLocationOf
property disjoint with: hasNamedFragment
property disjoint with: isRelatedTo
property disjoint with: bottomObjectProperty
property disjoint with: isTargetAudienceOf
property disjoint with: hasChapter
sub property of: topObjectProperty
property disjoint with: provides
property disjoint with: hasTargetAudience
property disjoint with: hasContributor
property disjoint with: isCopyrightedBy
property disjoint with: isSourceOf
property disjoint with: hasLocationCoordinateSystem
property disjoint with: isMemberOf
property disjoint with: isTrackOf
property disjoint with: hasPublished
property disjoint with: features
comment: Corresponds to 'location' in the Ontology for Media Resources. Subproperties are provided to specify, when possible, the relation between the media resource and the location.
domain: MediaResource
range: Location

hasTargetAudience
property disjoint with: isNamedFragmentOf
property disjoint with: hasAudioDescription
property disjoint with: isTrackOf
property disjoint with: hasPublished
property disjoint with: hasClassificationSystem
property disjoint with: isSourceOf
property disjoint with: provides
property disjoint with: hasCopyrightOver
property disjoint with: isTargetAudienceOf
property disjoint with: createdIn
property disjoint with: hasMember
property disjoint with: isFictionalLocationDepictedIn
property disjoint with: features
property disjoint with: hasCreated
property disjoint with: isCaptioningOf
property disjoint with: hasLocationCoordinateSystem
property disjoint with: hasContributor
property disjoint with: hasPublisher
property disjoint with: hasContributedTo
property disjoint with: hasFragment
property disjoint with: hasCaptioning
property disjoint with: hasNamedFragment
property disjoint with: depictsFictionalLocation
property disjoint with: playsIn
property disjoint with: hasSigning
property disjoint with: isSigningOf
property disjoint with: isImageRelatedTo
property disjoint with: hasChapter
property disjoint with: isRelatedTo
inverse of: isTargetAudienceOf
property disjoint with: hasCreator
property disjoint with: hasTrack
property disjoint with: isRatingOf
sub property of: topObjectProperty
type: ObjectProperty
property disjoint with: isCopyrightedBy
property disjoint with: hasRatingSystem
property disjoint with: isLocationRelatedTo
property disjoint with: hasRating
property disjoint with: isFragmentOf
property disjoint with: hasClassification
property disjoint with: hasSubtitling
property disjoint with: isProvidedBy
property disjoint with: isCreationLocationOf
property disjoint with: isMemberOf
property disjoint with: hasRelatedImage
property disjoint with: bottomObjectProperty
property disjoint with: isChapterOf
property disjoint with: hasRelatedLocation
comment: Corresponds to 'targetAudience' in the Ontology for Media Resources.
domain: MediaResource
range: TargetAudience

locationAltitude
property disjoint with: ratingScaleMax
property disjoint with: frameWidth
property disjoint with: editDate
property disjoint with: creationDate
property disjoint with: title
property disjoint with: bottomDataProperty
property disjoint with: ratingValue
type: DatatypeProperty
property disjoint with: frameRate
property disjoint with: samplingRate
property disjoint with: trackName
property disjoint with: duration
property disjoint with: mainOriginalTitle
property disjoint with: frameSizeUnit
property disjoint with: releaseDate
property disjoint with: description
property disjoint with: fragmentName
property disjoint with: numberOfTracks
property disjoint with: recordDate
property disjoint with: copyright
sub property of: topDataProperty
property disjoint with: alternativeTitle
property disjoint with: frameHeight
property disjoint with: collectionName
property disjoint with: averageBitRate
property disjoint with: locator
property disjoint with: ratingScaleMin
property disjoint with: date
comment: Corresponds to 'location.altitude' in the Ontology for Media Resources.
domain: Location
range: decimal

collectionName
property disjoint with: alternativeTitle
property disjoint with: title
property disjoint with: ratingScaleMax
property disjoint with: creationDate
property disjoint with: frameSizeUnit
property disjoint with: fragmentName
property disjoint with: trackName
property disjoint with: recordDate
type: DatatypeProperty
property disjoint with: releaseDate
property disjoint with: date
property disjoint with: ratingScaleMin
property disjoint with: bottomDataProperty
property disjoint with: editDate
property disjoint with: samplingRate
property disjoint with: averageBitRate
property disjoint with: locationLongitude
property disjoint with: locationAltitude
property disjoint with: locator
property disjoint with: copyright
property disjoint with: locationLatitude
sub property of: topDataProperty
property disjoint with: mainOriginalTitle
property disjoint with: frameRate
property disjoint with: locationName
property disjoint with: ratingValue
property disjoint with: description
property disjoint with: frameHeight
property disjoint with: numberOfTracks
property disjoint with: frameWidth
property disjoint with: duration
comment: The name by which a collection (e.g. series) is known.
domain: Collection

features
property disjoint with: hasFragment
property disjoint with: isTargetAudienceOf
property disjoint with: isProvidedBy
property disjoint with: hasSubtitling
property disjoint with: provides
property disjoint with: isLocationRelatedTo
property disjoint with: isFragmentOf
property disjoint with: hasRelatedLocation
property disjoint with: hasCreated
property disjoint with: hasTargetAudience
property disjoint with: hasRating
property disjoint with: isCaptioningOf
property disjoint with: hasCaptioning
property disjoint with: hasChapter
property disjoint with: hasPublished
property disjoint with: isRatingOf
property disjoint with: createdIn
property disjoint with: hasClassificationSystem
property disjoint with: hasRatingSystem
property disjoint with: playsIn
property disjoint with: hasLocationCoordinateSystem
property disjoint with: isImageRelatedTo
inverse of: playsIn
property disjoint with: hasClassification
sub property of: hasContributor
property disjoint with: isChapterOf
property disjoint with: isSourceOf
property disjoint with: hasSigning
property disjoint with: hasContributedTo
sub property of: topObjectProperty
property disjoint with: isMemberOf
type: ObjectProperty
property disjoint with: isSigningOf
property disjoint with: hasAudioDescription
property disjoint with: isRelatedTo
property disjoint with: hasMember
property disjoint with: hasTrack
property disjoint with: isFictionalLocationDepictedIn
property disjoint with: depictsFictionalLocation
property disjoint with: bottomObjectProperty
property disjoint with: isCreationLocationOf
property disjoint with: hasCopyrightOver
property disjoint with: isNamedFragmentOf
property disjoint with: isTrackOf
property disjoint with: hasNamedFragment
property disjoint with: hasRelatedImage
comment: Corresponds to 'contributor.contributor' in the Ontology for Media Resources with a 'contributor.role' meaning "actor".
range: Person

Person
subclass of: Thing
disjoint with: Collection
disjoint with: Image
type: Class
disjoint with: Organisation
disjoint with: Track
disjoint with: http://lodlaundromat.org/.well-known/genid/6498517e3d480e4884df0dc5fd2da7bd#5
disjoint with: AudioTrack
disjoint with: http://lodlaundromat.org/.well-known/genid/6498517e3d480e4884df0dc5fd2da7bd#1
disjoint with: VideoTrack
disjoint with: MediaResource
subclass of: http://lodlaundromat.org/.well-known/genid/6498517e3d480e4884df0dc5fd2da7bd#8
disjoint with: Rating
disjoint with: Location
disjoint with: TargetAudience
disjoint with: DataTrack
disjoint with: Nothing
disjoint with: MediaFragment
subclass of: http://lodlaundromat.org/.well-known/genid/6498517e3d480e4884df0dc5fd2da7bd#4
subclass of: Agent
comment: A physical person.

editDate
sub property of: date
type: DatatypeProperty
property disjoint with: ratingScaleMin
property disjoint with: locationLatitude
sub property of: topDataProperty
property disjoint with: locationLongitude
property disjoint with: collectionName
property disjoint with: ratingValue
property disjoint with: locationName
property disjoint with: locationAltitude
property disjoint with: bottomDataProperty
property disjoint with: ratingScaleMax
comment: Corresponds to 'date.date' in the Ontology for Media Resources with a 'date.type' meaning "editDate".

createdIn
property disjoint with: hasSubtitling
property disjoint with: isCreationLocationOf
property disjoint with: hasTargetAudience
type: ObjectProperty
property disjoint with: hasSigning
property disjoint with: isRatingOf
property disjoint with: isLocationRelatedTo
property disjoint with: hasCaptioning
property disjoint with: hasCopyrightOver
property disjoint with: hasClassification
property disjoint with: isRelatedTo
property disjoint with: isNamedFragmentOf
property disjoint with: isImageRelatedTo
property disjoint with: hasCreated
property disjoint with: playsIn
property disjoint with: isFictionalLocationDepictedIn
property disjoint with: provides
property disjoint with: bottomObjectProperty
property disjoint with: isSigningOf
property disjoint with: hasNamedFragment
property disjoint with: hasCreator
property disjoint with: isChapterOf
sub property of: topObjectProperty
inverse of: isCreationLocationOf
property disjoint with: hasChapter
property disjoint with: hasPublished
property disjoint with: hasLocationCoordinateSystem
property disjoint with: hasRatingSystem
property disjoint with: isProvidedBy
property disjoint with: hasRating
property disjoint with: isCopyrightedBy
property disjoint with: hasRelatedImage
property disjoint with: features
property disjoint with: isCaptioningOf
property disjoint with: hasPublisher
property disjoint with: hasAudioDescription
property disjoint with: hasFragment
property disjoint with: isTargetAudienceOf
property disjoint with: isSourceOf
property disjoint with: hasMember
property disjoint with: hasTrack
property disjoint with: isTrackOf
property disjoint with: hasContributor
property disjoint with: hasClassificationSystem
property disjoint with: isFragmentOf
property disjoint with: hasContributedTo
property disjoint with: isMemberOf
sub property of: hasRelatedLocation
comment: A subproperty of 'hasRelatedLocation" used to specify where material shooting took place.

alternativeTitle
sub property of: title
property disjoint with: ratingScaleMin
property disjoint with: locationLatitude
property disjoint with: locationName
property disjoint with: ratingScaleMax
property disjoint with: bottomDataProperty
property disjoint with: locationAltitude
property disjoint with: ratingValue
type: DatatypeProperty
sub property of: topDataProperty
property disjoint with: locationLongitude
property disjoint with: collectionName
comment: Corresponds to 'title.title' in the Ontology for Media Resources with a 'title.type' meaning "alternative".

Organisation
disjoint with: MediaFragment
disjoint with: Person
disjoint with: MediaResource
disjoint with: AudioTrack
disjoint with: Location
disjoint with: Rating
type: Class
disjoint with: Collection
disjoint with: http://lodlaundromat.org/.well-known/genid/6498517e3d480e4884df0dc5fd2da7bd#1
subclass of: Agent
disjoint with: Track
subclass of: Thing
subclass of: http://lodlaundromat.org/.well-known/genid/6498517e3d480e4884df0dc5fd2da7bd#4
disjoint with: VideoTrack
disjoint with: DataTrack
disjoint with: Image
disjoint with: Nothing
disjoint with: http://lodlaundromat.org/.well-known/genid/6498517e3d480e4884df0dc5fd2da7bd#5
subclass of: http://lodlaundromat.org/.well-known/genid/6498517e3d480e4884df0dc5fd2da7bd#8
disjoint with: TargetAudience
comment: An organisation or moral agent.

numberOfTracks
property disjoint with: locator
property disjoint with: bottomDataProperty
type: DatatypeProperty
property disjoint with: locationName
property disjoint with: ratingScaleMin
property disjoint with: locationLongitude
property disjoint with: locationLatitude
property disjoint with: ratingScaleMax
property disjoint with: collectionName
sub property of: topDataProperty
property disjoint with: ratingValue
property disjoint with: locationAltitude
comment: Corresponds to 'numTracks.number' in the Ontology for Media Resources. Subproperties can be used to distinguish different values of 'numTracks.type'.
domain: MediaResource
range: integer

hasClassificationSystem
property disjoint with: hasFormat
property disjoint with: hasTrack
property disjoint with: hasChapter
property disjoint with: hasSigning
property disjoint with: isLocationRelatedTo
property disjoint with: hasCompression
property disjoint with: isFictionalLocationDepictedIn
property disjoint with: hasLanguage
property disjoint with: hasRelatedLocation
property disjoint with: hasFragment
property disjoint with: hasSubtitling
property disjoint with: hasPermissions
property disjoint with: isTrackOf
property disjoint with: playsIn
property disjoint with: hasGenre
property disjoint with: bottomObjectProperty
property disjoint with: hasCreator
property disjoint with: hasPublisher
property disjoint with: provides
property disjoint with: createdIn
property disjoint with: features
property disjoint with: isProvidedBy
property disjoint with: hasRatingSystem
property disjoint with: hasCopyrightOver
property disjoint with: hasContributor
property disjoint with: isChapterOf
property disjoint with: hasMember
property disjoint with: isSigningOf
property disjoint with: hasNamedFragment
property disjoint with: hasRelatedImage
property disjoint with: hasPublished
property disjoint with: isRatingOf
property disjoint with: isCaptioningOf
property disjoint with: hasRelatedResource
property disjoint with: isNamedFragmentOf
property disjoint with: depictsFictionalLocation
property disjoint with: hasCaptioning
property disjoint with: hasCreated
property disjoint with: isMemberOf
property disjoint with: hasPolicy
property disjoint with: hasAccessConditions
property disjoint with: hasAudioDescription
property disjoint with: isCopyrightedBy
property disjoint with: hasContributedTo
property disjoint with: hasTargetAudience
property disjoint with: hasLocationCoordinateSystem
property disjoint with: isFragmentOf
type: ObjectProperty
sub property of: topObjectProperty
property disjoint with: hasKeyword
property disjoint with: hasSource
property disjoint with: isImageRelatedTo
property disjoint with: hasRating
property disjoint with: isCreationLocationOf
comment: Corresponds to 'targetAudience.identifier' in the Ontology for Media Resources. This is used to identify the reference sheme against which the target audience has been characterised.
domain: TargetAudience

description
property disjoint with: locationName
property disjoint with: locationLatitude
property disjoint with: locationAltitude
sub property of: topDataProperty
property disjoint with: locationLongitude
type: DatatypeProperty
property disjoint with: ratingScaleMax
property disjoint with: collectionName
property disjoint with: ratingScaleMin
property disjoint with: bottomDataProperty
property disjoint with: ratingValue
comment: Corresponds to 'description' in the Ontology for Media Resources. This can be specialised by using sub-properties e.g. 'summary' or 'script'.
domain: MediaResource

Contributor
type: Thing
type: ObjectProperty
issued: 1999-07-02
property disjoint with: bottomObjectProperty
description: Examples of a Contributor include a person, an organization, or a service. Typically, the name of a Contributor should be used to indicate the entity.
sub property of: topObjectProperty
note: A second property with the same name as this property has been declared in the dcterms: namespace (http://purl.org/dc/terms/). See the Introduction to the document "DCMI Metadata Terms" (http://dublincore.org/documents/dcmi-terms/) for an explanation.
modified: 2008-01-14
has version: contributor-006
type: Property
comment: An entity responsible for making contributions to the resource.

Coverage
description: Spatial topic and spatial applicability may be a named place or a location specified by its geographic coordinates. Temporal topic may be a named period, date, or date range. A jurisdiction may be a named administrative entity or a geographic place to which the resource applies. Recommended best practice is to use a controlled vocabulary such as the Thesaurus of Geographic Names [TGN]. Where appropriate, named places or time periods can be used in preference to numeric identifiers such as sets of coordinates or date ranges.
type: Thing
issued: 1999-07-02
property disjoint with: bottomObjectProperty
type: ObjectProperty
has version: coverage-006
note: A second property with the same name as this property has been declared in the dcterms: namespace (http://purl.org/dc/terms/). See the Introduction to the document "DCMI Metadata Terms" (http://dublincore.org/documents/dcmi-terms/) for an explanation.
modified: 2008-01-14
sub property of: topObjectProperty
type: Property
comment: The spatial or temporal topic of the resource, the spatial applicability of the resource, or the jurisdiction under which the resource is relevant.

DataTrack
disjoint with: VideoTrack
type: Class
subclass of: Thing
disjoint with: AudioTrack
subclass of: Track
disjoint with: Agent
disjoint with: Rating
disjoint with: Organisation
disjoint with: TargetAudience
disjoint with: Nothing
subclass of: MediaResource
disjoint with: Location
subclass of: MediaFragment
disjoint with: Person
disjoint with: Collection
comment: Ancillary data track e.g. captioning in addition to video and audio tracks. Specialisation is made through the use of appropriate object properties.

hasSigning
property disjoint with: hasPublished
property disjoint with: hasContributor
property disjoint with: hasCreated
property disjoint with: playsIn
property disjoint with: features
inverse of: isSigningOf
property disjoint with: createdIn
property disjoint with: isLocationRelatedTo
property disjoint with: isFictionalLocationDepictedIn
property disjoint with: isTargetAudienceOf
property disjoint with: hasPublisher
property disjoint with: hasCopyrightOver
property disjoint with: hasClassificationSystem
type: ObjectProperty
property disjoint with: bottomObjectProperty
sub property of: hasFragment
property disjoint with: hasTargetAudience
property disjoint with: provides
property disjoint with: hasLocationCoordinateSystem
sub property of: topObjectProperty
property disjoint with: hasCreator
property disjoint with: hasRatingSystem
property disjoint with: hasClassification
property disjoint with: hasContributedTo
property disjoint with: isCreationLocationOf
property disjoint with: hasRelatedLocation
property disjoint with: isRatingOf
property disjoint with: isCopyrightedBy
property disjoint with: depictsFictionalLocation
property disjoint with: hasMember
property disjoint with: hasRating
property disjoint with: isProvidedBy
property disjoint with: isMemberOf
comment: Corresponds to 'fragment' in the Ontology for Media Resources with a 'fragment.role' meaning "signing". This property can for example point to a spatial fragment or a VideoTrack. The sign language of the captioning track can be expressed by attaching a 'hasLanguage' property to the specific track.

Rights
modified: 2008-01-14
type: Thing
property disjoint with: bottomObjectProperty
has version: rights-006
description: Typically, rights information includes a statement about various property rights associated with the resource, including intellectual property rights.
sub property of: topObjectProperty
note: A second property with the same name as this property has been declared in the dcterms: namespace (http://purl.org/dc/terms/). See the Introduction to the document "DCMI Metadata Terms" (http://dublincore.org/documents/dcmi-terms/) for an explanation.
type: ObjectProperty
issued: 1999-07-02
type: Property
comment: Information about rights held in and over the resource.

Title
note: A second property with the same name as this property has been declared in the dcterms: namespace (http://purl.org/dc/terms/). See the Introduction to the document "DCMI Metadata Terms" (http://dublincore.org/documents/dcmi-terms/) for an explanation.
type: Thing
sub property of: topObjectProperty
type: ObjectProperty
issued: 1999-07-02
property disjoint with: bottomObjectProperty
modified: 2008-01-14
has version: title-006
type: Property
comment: A name given to the resource.

Location
subclass of: http://lodlaundromat.org/.well-known/genid/6498517e3d480e4884df0dc5fd2da7bd#4
disjoint with: TargetAudience
disjoint with: Nothing
subclass of: Thing
disjoint with: http://lodlaundromat.org/.well-known/genid/6498517e3d480e4884df0dc5fd2da7bd#5
disjoint with: Agent
disjoint with: VideoTrack
disjoint with: Rating
subclass of: http://lodlaundromat.org/.well-known/genid/6498517e3d480e4884df0dc5fd2da7bd#8
disjoint with: AudioTrack
disjoint with: Track
disjoint with: MediaFragment
type: Class
disjoint with: http://lodlaundromat.org/.well-known/genid/6498517e3d480e4884df0dc5fd2da7bd#1
disjoint with: Organisation
disjoint with: DataTrack
disjoint with: Person
disjoint with: Collection
disjoint with: Image
disjoint with: MediaResource
comment: A location related to the media resource, e.g. depicted in the resource (possibly fictional) or where the resource was created (shooting location), etc.

trackName
property disjoint with: locationName
sub property of: topDataProperty
property disjoint with: collectionName
property disjoint with: bottomDataProperty
sub property of: fragmentName
property disjoint with: locationAltitude
property disjoint with: ratingValue
property disjoint with: ratingScaleMin
property disjoint with: ratingScaleMax
type: DatatypeProperty
property disjoint with: locationLongitude
property disjoint with: locationLatitude
comment: Corresponds to 'fragment.name' in the Ontology for Media Resources, for Track fragments.
domain: Track

Track
disjoint with: Location
disjoint with: Collection
disjoint with: TargetAudience
disjoint with: Person
subclass of: MediaFragment
subclass of: MediaResource
type: Class
disjoint with: Rating
disjoint with: Nothing
disjoint with: Agent
subclass of: Thing
disjoint with: Organisation
comment: A specialisation of MediaFragment for audiovisual content.

ma-ont
date: 2013-03-20
type: Ontology
comment: Created by Tobias Buerger, Jean Pierre Evain and Pierre-Antoine Champin with the RDFS Taskforce within the W3C Media Annotation Working Group.
comment: THE CONTENT OF THIS MA-ONT.RDF AND DERIVED MA-ONT.TTL FILES PREVAIL OVER THE SPECIFICATION.
imports: dcelements.rdf
version info: R36