has used device
sub property of: has context
range: Thing
domain: Thing
type: Property
type: ObjectProperty
comment: A device that is related to an event, e.g. a MP3 player to a play back event of a music track.
sub property of: factor
sub property of: has device
term status: unstable
domain: Resource
range: Resource

has included association
range: Thing
domain: Thing
type: ObjectProperty
comment: This property could be used to compose association statements or to reuse them, e.g. to make them likeable in a specific context.
domain: Association
range: Association
inverse of: is included association of
term status: testing
type: Property
range: Resource
domain: Resource

has used application
sub property of: has context
range: Thing
domain: Thing
type: Property
type: ObjectProperty
comment: An application that is related to an event, e.g. a iTunes to a play back event of a music track.
sub property of: factor
sub property of: has application
term status: unstable
domain: Resource
range: Resource

Likeable Association
subclass of: Resource
subclass of: Thing
type: Class
comment: A likeable association. That means this association type is intended to be used for voting (ao:likeminded), feedbacking (rev:Feedback), reviewing (e.g. rev:rating) an association statement (related by ao:included_association) in the context of something.
subclass of: Association
subclass of: Review
term status: testing

has time
sub property of: date
type: Property
comment: A time, which is associated to an individual, e.g. morning, afternoon, evening.
sub property of: has context
equivalent property: date
term status: testing
domain: Thing
domain: Resource

is likeminded of
range: Association
domain: Agent
inverse of: has likeminded
range: Thing
domain: Thing
type: ObjectProperty
type: Property
range: Resource
domain: Resource

has likeminded
range: Thing
domain: Thing
type: ObjectProperty
comment: Associates likeminded people to an association, which they like/ agree with.
domain: Association
range: Agent
inverse of: is likeminded of
term status: testing
type: Property
range: Resource
domain: Resource

is included association of
range: Thing
domain: Thing
range: Association
domain: Association
inverse of: has included association
type: ObjectProperty
type: Property
range: Resource
domain: Resource

The Association Ontology
version info: 0.4
creator: me
imports: terms
imports: rev
creator: http://tobyinkster.co.uk/#i
imports: http://purl.org/dc/elements/1.1/
imports: ns
imports: similarity
date: 2010-09-13T12:59:52Z
description: The Association Ontology specification provides basic properties for describing specific associations to something, e.g. a context, an occasion, a genre or a mood, and enables furthermore, a mechanism to like/rate and feedback these associations in context to something on/ for the Semantic Web. This document contains a RDF description of the Association Ontology.
type: Ontology
imports: http://xmlns.com/foaf/0.1/
imports: event.owl
has context: 2010-09-13T12:59:52Z
has time: 2010-09-13T12:59:52Z
type: Thing

has device
type: Property
comment: A device, which is associated with an individual, e.g. a CD player with a CD it's currently playing back.
sub property of: has context
term status: testing
domain: Thing
domain: Resource

has activity
type: Property
comment: An activity, which is associated to an individual, e.g. dancing, sleeping, driving.
sub property of: has context
term status: testing
domain: Thing
domain: Resource

has mood
type: Property
comment: A mood that should be created by something.
domain: Thing
sub property of: subject
term status: unstable
domain: Resource

has application
type: Property
comment: An application, which is associated to an individual, e.g. a music player to a music track it's currently playing back.
sub property of: has context
term status: testing
domain: Thing
domain: Resource

has location
type: Property
comment: A location, which is associated to an individual, e.g. my house, my country, my current whereabouts.
sub property of: has context
term status: testing
domain: Thing
domain: Resource

has context
type: Property
comment: A property to associate any environmental context to an individual, e.g. a location, a time or an activity. Hence, this property is intended that sub properties should be created from it.
domain: Thing
term status: testing
domain: Resource

has occassion
type: Property
comment: An occasion for which something was created.
domain: Thing
sub property of: subject
term status: unstable
domain: Resource

has genre
type: Property
comment: An genre of something.
domain: Thing
sub property of: subject
term status: unstable
domain: Resource