hasComment
range: Thing
domain: Thing
type: Property
type: ObjectProperty
range: Comment
domain: Review
comment: Used to associate a review with a comment on the review
term status: deprecated
more info: proposed by iterating.com
domain: Resource
range: Resource
type: Thing

Scale
subclass of: Resource
subclass of: Thing
type: Class
comment: A concept for describing scales for weights.
subclass of: Dimension
term status: unstable
type: Thing

Preferred Namespace Uri
type: Property
type: AnnotationProperty
comment: The preferred namespace URI to use when using terms from this vocabulary in an XML document.
type: Thing

Review
subclass of: Resource
subclass of: Thing
type: Class
comment: A review of an work
term status: stable
more info: core term
type: Thing

has Review
range: Thing
domain: Thing
type: Property
type: ObjectProperty
comment: Associates a work with a a review
domain: Resource
range: Review
term status: stable
more info: core term
range: Resource
type: Thing

has scale
range: Thing
domain: Thing
term status: unstable
range: Scale
domain: Weight
type: FunctionalProperty
type: Property
type: ObjectProperty
comment: A scale for the weighting of some relation.
sub property of: dimension
domain: http://lodlaundromat.org/.well-known/genid/5a65cfc5316dff2a5eb56144b02fedcb#1
domain: Resource
domain: Item
range: Resource
range: Dimension
type: Thing

http://lodlaundromat.org/.well-known/genid/5a65cfc5316dff2a5eb56144b02fedcb#1
type: Class
subclass of: Weight
subclass of: Thing
subclass of: Resource
type: Restriction
cardinality: 1
on property: has weight value
subclass of: Item
type: Thing
equivalent class: Weight

Weight
subclass of: Thing
subclass of: http://lodlaundromat.org/.well-known/genid/5a65cfc5316dff2a5eb56144b02fedcb#1
subclass of: Resource
type: Class
comment: A weight class to enable timestamped (etc.) weights.
subclass of: Item
equivalent class: http://lodlaundromat.org/.well-known/genid/5a65cfc5316dff2a5eb56144b02fedcb#1
term status: testing
type: Thing

Feedback
subclass of: Resource
subclass of: Thing
type: Class
term status: testing
term status: deprecated
comment: Feedback on the review. Expresses whether the review was useful or not
more info: proposed by iterating.com
type: Thing

reviewer
range: Thing
domain: Thing
type: Property
type: ObjectProperty
comment: The person that has written the review
domain: Review
range: Person
term status: stable
more info: core term
domain: Resource
range: Resource
type: Thing

has weight
range: Thing
type: Property
type: ObjectProperty
comment: The weight on some relation, e.g. a interest in a topic, or of an interest that is valid for a specific period of time or was raised up in a specific period of time.
domain: Thing
range: Weight
sub property of: factor
term status: unstable
domain: Resource
range: Resource
range: http://lodlaundromat.org/.well-known/genid/5a65cfc5316dff2a5eb56144b02fedcb#1
range: Item
type: Thing

commenter
range: Thing
domain: Thing
type: Property
domain: Feedback
comment: The commenter on the review
more info: proposed by iterating.com
domain: Comment
range: Agent
type: ObjectProperty
term status: deprecated
domain: Resource
range: Resource
type: Thing

Preferred Namespace Prefix
type: Property
type: AnnotationProperty
comment: The preferred namespace prefix to use when using terms from this vocabulary in an XML document.
type: Thing

Comment
subclass of: Resource
subclass of: Thing
type: Class
comment: A comment on a review
term status: deprecated
more info: proposed by iterating.com
type: Thing

hasFeedback
range: Thing
domain: Thing
type: Property
type: ObjectProperty
comment: Associates a review with a feedback on the review
range: Feedback
domain: Review
term status: deprecated
more info: proposed by iterating.com
domain: Resource
range: Resource
type: Thing

Identifier
description: Recommended best practice is to identify the resource by means of a string conforming to a formal identification system.
has version: identifier-006
issued: 1999-07-02
modified: 2008-01-14
type: Property
comment: An unambiguous reference to the resource within a given context.
note: A second property with the same name as this property has been declared in the dcterms: namespace (http://purl.org/dc/terms/). See the Introduction to the document "DCMI Metadata Terms" (http://dublincore.org/documents/dcmi-terms/) for an explanation.
type: Thing

SemWeb Vocab Status ontology
creator: Libby Miller
Preferred Namespace Prefix: vs
comment: This vocabulary was created in the FOAF project, based on experience with FOAF, Dublin Core and other early RDF vocabularies. Deployment experience shows that changing namespace URIs is expensive and unrewarding, so this vocabulary provides terms to support in-place evolution of structured data vocabularies. By indicating status at the level of terms rather than vocabularies, dictionary-style, fine grained improvements become easier. Different organizations and parties can agree or disagree on the status of a vocabulary term; however the status published alongside the term may deserve special attention. Future work could include patterns for citing announcements and decisions, or using SKOS to decentralise the extension of the basic status levels.
issued: 2003-06-01
Contributor: Pierre-Yves Vandenbussche
type: Ontology
creator: Dan Brickley
creator: Leigh Dodds
modified: 2011-12-12
description: An RDF vocabulary for relating SW vocabulary terms to their status.
Preferred Namespace Uri: http://www.w3.org/2003/06/sw-vocab-status/ns#
type: Thing

text
type: Property
type: DatatypeProperty
comment: The text of the review
term status: stable
more info: core term
type: Thing

title
sub property of: Title
type: Property
range: Literal
domain: Review
comment: The title of the review
term status: deprecated
more info: proposed by iterating.com
type: DatatypeProperty
domain: Thing
domain: Resource
range: Thing
range: Resource
type: Thing

RDF Review Vocabulary
type: Ontology
type: Thing
description: Vocabulary for expressing reviews and ratings using the Resource Description Framework. It is compatible with hReview and conforms to OWL Lite
date: 2007-11-08
profile transformation: hreview2rdfxml.xsl
user docs: http://vocab.org/review/html
Preferred Namespace Prefix: rev

max Rating
type: Property
comment: A numeric value
description: Maximum value for rating property
term status: stable
more info: Introduced by request of Revyu.com
type: Thing

Type
description: Recommended best practice is to use a controlled vocabulary such as the DCMI Type Vocabulary [DCMITYPE]. To describe the file format, physical medium, or dimensions of the resource, use the Format element.
has version: type-006
issued: 1999-07-02
modified: 2008-01-14
type: Property
comment: The nature or genre of the resource.
note: A second property with the same name as this property has been declared in the dcterms: namespace (http://purl.org/dc/terms/). See the Introduction to the document "DCMI Metadata Terms" (http://dublincore.org/documents/dcmi-terms/) for an explanation.
type: Thing

Subject
description: Typically, the subject will be represented using keywords, key phrases, or classification codes. Recommended best practice is to use a controlled vocabulary.
has version: subject-007
issued: 1999-07-02
modified: 2012-06-14
type: Property
comment: The topic of the resource.
note: A second property with the same name as this property has been declared in the dcterms: namespace (http://purl.org/dc/terms/). See the Introduction to the document "DCMI Metadata Terms" (http://dublincore.org/documents/dcmi-terms/) for an explanation.
type: Thing

more info
type: AnnotationProperty
type: Property
comment: more information about the status etc of a term, typically human oriented
term status: unstable
type: Thing

Language
issued: 1999-07-02
note: A second property with the same name as this property has been declared in the dcterms: namespace (http://purl.org/dc/terms/). See the Introduction to the document "DCMI Metadata Terms" (http://dublincore.org/documents/dcmi-terms/) for an explanation.
has version: language-007
description: Recommended best practice is to use a controlled vocabulary such as RFC 4646 [RFC4646].
type: Property
comment: A language of the resource.
modified: 2008-01-14
type: Thing

HTML
type: Text
type: Document
Format: text/html

Format
description: Examples of dimensions include size and duration. Recommended best practice is to use a controlled vocabulary such as the list of Internet Media Types [MIME].
has version: format-007
issued: 1999-07-02
modified: 2008-01-14
type: Property
comment: The file format, physical medium, or dimensions of the resource.
note: A second property with the same name as this property has been declared in the dcterms: namespace (http://purl.org/dc/terms/). See the Introduction to the document "DCMI Metadata Terms" (http://dublincore.org/documents/dcmi-terms/) for an explanation.
type: Thing

has min weight
comment: A minimum weight of a scale.
type: Property
range: decimal
sub property of: min Rating
term status: unstable
type: DatatypeProperty
domain: Scale
sub property of: min
type: FunctionalProperty
domain: Dimension
domain: Thing
domain: Resource
range: Thing
range: Resource
type: Thing

Weighting Ontology
Preferred Namespace Prefix: wo
imports: scovo
imports: SemWeb Vocab Status ontology
imports: rev
imports: event.owl
imports: VANN: A vocabulary for annotating vocabulary descriptions
creator: me
imports: Dublin Core Metadata Element Set, Version 1.1
description: A vocabulary for describing weightings and their referenced scales.
type: Ontology
date: 2010-09-14T10:40:52Z
version info: 0.1
type: Thing

Ian Davis
type: Person
type: Thing

Usage Note
type: AnnotationProperty
comment: A reference to a resource that provides information on how this resource is to be used.
sub property of: seeAlso
type: Property
type: Thing

Dublin Core Metadata Element Set, Version 1.1
modified: 2012-06-14
publisher: DCMI
type: Ontology
type: Thing

positiveVotes
type: Property
type: DatatypeProperty
range: Literal
domain: Review
comment: Number of positive usefulness votes (integer)
term status: deprecated
more info: proposed by iterating.com
domain: Thing
domain: Resource
range: Thing
range: Resource
type: Thing

Description
modified: 2008-01-14
has version: description-006
note: A second property with the same name as this property has been declared in the dcterms: namespace (http://purl.org/dc/terms/). See the Introduction to the document "DCMI Metadata Terms" (http://dublincore.org/documents/dcmi-terms/) for an explanation.
comment: An account of the resource.
type: Property
issued: 1999-07-02
type: DatatypeProperty
description: Description may include but is not limited to: an abstract, a table of contents, a graphical representation, or a free-text account of the resource.
type: Thing

Publisher
description: Examples of a Publisher include a person, an organization, or a service. Typically, the name of a Publisher should be used to indicate the entity.
has version: publisher-006
issued: 1999-07-02
modified: 2008-01-14
type: Property
comment: An entity responsible for making the resource available.
note: A second property with the same name as this property has been declared in the dcterms: namespace (http://purl.org/dc/terms/). See the Introduction to the document "DCMI Metadata Terms" (http://dublincore.org/documents/dcmi-terms/) for an explanation.
type: Thing

Source
description: The described resource may be derived from the related resource in whole or in part. Recommended best practice is to identify the related resource by means of a string conforming to a formal identification system.
has version: source-006
issued: 1999-07-02
modified: 2008-01-14
type: Property
comment: A related resource from which the described resource is derived.
note: A second property with the same name as this property has been declared in the dcterms: namespace (http://purl.org/dc/terms/). See the Introduction to the document "DCMI Metadata Terms" (http://dublincore.org/documents/dcmi-terms/) for an explanation.
type: Thing

Turtle
type: Text
type: Document
Format: text/plain

Creator
description: Examples of a Creator include a person, an organization, or a service. Typically, the name of a Creator should be used to indicate the entity.
has version: creator-006
issued: 1999-07-02
modified: 2008-01-14
type: Property
comment: An entity primarily responsible for making the resource.
note: A second property with the same name as this property has been declared in the dcterms: namespace (http://purl.org/dc/terms/). See the Introduction to the document "DCMI Metadata Terms" (http://dublincore.org/documents/dcmi-terms/) for an explanation.
type: Thing

Changes
type: AnnotationProperty
comment: A reference to a resource that describes changes between this version of a vocabulary and the previous.
sub property of: seeAlso
type: Property
type: Thing

min Rating
type: Property
comment: A numeric value
description: Minimum value for rating property
term status: stable
more info: Introduced by request of Revyu.com
type: Thing

Example
type: AnnotationProperty
comment: A reference to a resource that provides an example of how this resource can be used.
sub property of: seeAlso
type: Property
type: Thing

term status
type: AnnotationProperty
type: Property
comment: the status of a vocabulary term, expressed as a short symbolic string; known values include 'unstable','testing', 'stable' and 'archaic'
term status: unstable
type: Thing

totalVotes
type: Property
type: DatatypeProperty
comment: Number of usefulness votes (integer)
range: Literal
domain: Review
term status: deprecated
more info: proposed by iterating.com
domain: Thing
domain: Resource
range: Thing
range: Resource
type: Thing

has max weight
term status: unstable
range: decimal
sub property of: max Rating
domain: Scale
type: Property
sub property of: max
type: FunctionalProperty
type: DatatypeProperty
comment: A maximum weight of a scale.
domain: Dimension
domain: Thing
domain: Resource
range: Thing
range: Resource
type: Thing

Relation
description: Recommended best practice is to identify the related resource by means of a string conforming to a formal identification system.
has version: relation-006
issued: 1999-07-02
modified: 2008-01-14
type: Property
comment: A related resource.
note: A second property with the same name as this property has been declared in the dcterms: namespace (http://purl.org/dc/terms/). See the Introduction to the document "DCMI Metadata Terms" (http://dublincore.org/documents/dcmi-terms/) for an explanation.
type: Thing

type
type: Property
type: DatatypeProperty
comment: The type of media of a work under review
term status: deprecated
more info: core term
type: Thing

VANN: A vocabulary for annotating vocabulary descriptions
type: Ontology
description: This document describes a vocabulary for annotating descriptions of vocabularies with examples and usage notes.
rights: Copyright © 2005 Ian Davis
replaces: vann-vocab-20040305
creator: Ian Davis
Preferred Namespace Prefix: vann
date: 2010-06-07
type: Thing

rating
type: Property
type: DatatypeProperty
comment: A numeric value
term status: stable
more info: core term
type: Thing

JSON
type: Text
type: Document
Format: application/json

Date
type: DatatypeProperty
has version: date-006
modified: 2008-01-14
description: Date may be used to express temporal information at any level of granularity. Recommended best practice is to use an encoding scheme, such as the W3CDTF profile of ISO 8601 [W3CDTF].
comment: A point or period of time associated with an event in the lifecycle of the resource.
note: A second property with the same name as this property has been declared in the dcterms: namespace (http://purl.org/dc/terms/). See the Introduction to the document "DCMI Metadata Terms" (http://dublincore.org/documents/dcmi-terms/) for an explanation.
issued: 1999-07-02
type: Property
type: Thing

JSON
type: Text
type: Document
Format: application/json

Term Group
type: AnnotationProperty
comment: A group of related terms in a vocabulary.

user docs
type: Property
comment: human-oriented documentation, examples etc for use of this term
term status: unstable
type: Thing

Contributor
description: Examples of a Contributor include a person, an organization, or a service. Typically, the name of a Contributor should be used to indicate the entity.
has version: contributor-006
issued: 1999-07-02
modified: 2008-01-14
type: Property
comment: An entity responsible for making contributions to the resource.
note: A second property with the same name as this property has been declared in the dcterms: namespace (http://purl.org/dc/terms/). See the Introduction to the document "DCMI Metadata Terms" (http://dublincore.org/documents/dcmi-terms/) for an explanation.
type: Thing

Coverage
description: Spatial topic and spatial applicability may be a named place or a location specified by its geographic coordinates. Temporal topic may be a named period, date, or date range. A jurisdiction may be a named administrative entity or a geographic place to which the resource applies. Recommended best practice is to use a controlled vocabulary such as the Thesaurus of Geographic Names [TGN]. Where appropriate, named places or time periods can be used in preference to numeric identifiers such as sets of coordinates or date ranges.
has version: coverage-006
issued: 1999-07-02
modified: 2008-01-14
type: Property
comment: The spatial or temporal topic of the resource, the spatial applicability of the resource, or the jurisdiction under which the resource is relevant.
note: A second property with the same name as this property has been declared in the dcterms: namespace (http://purl.org/dc/terms/). See the Introduction to the document "DCMI Metadata Terms" (http://dublincore.org/documents/dcmi-terms/) for an explanation.
type: Thing

Turtle
type: Text
type: Document
Format: text/plain

HTML
type: Text
type: Document
Format: text/html

has weight value
type: Property
type: DatatypeProperty
type: FunctionalProperty
comment: The specific value of a weight.
domain: Weight
range: decimal
term status: testing
type: Thing
domain: http://lodlaundromat.org/.well-known/genid/5a65cfc5316dff2a5eb56144b02fedcb#1
domain: Thing
domain: Resource
domain: Item
range: Thing
range: Resource

Rights
description: Typically, rights information includes a statement about various property rights associated with the resource, including intellectual property rights.
has version: rights-006
issued: 1999-07-02
modified: 2008-01-14
type: Property
comment: Information about rights held in and over the resource.
note: A second property with the same name as this property has been declared in the dcterms: namespace (http://purl.org/dc/terms/). See the Introduction to the document "DCMI Metadata Terms" (http://dublincore.org/documents/dcmi-terms/) for an explanation.
type: Thing

Title
type: DatatypeProperty
has version: title-006
issued: 1999-07-02
modified: 2008-01-14
type: Property
comment: A name given to the resource.
note: A second property with the same name as this property has been declared in the dcterms: namespace (http://purl.org/dc/terms/). See the Introduction to the document "DCMI Metadata Terms" (http://dublincore.org/documents/dcmi-terms/) for an explanation.
type: Thing

has step size
type: Property
type: DatatypeProperty
type: FunctionalProperty
comment: A predefined step size for weight of a specific scale.
domain: Scale
range: decimal
term status: unstable
domain: Dimension
domain: Thing
domain: Resource
range: Thing
range: Resource
type: Thing