era rank
type: Thing
sub property of: topObjectProperty
property disjoint with: bottomObjectProperty
type: ObjectProperty
comment: The term 'era' in this context is generic. Geochronologic elements of all ranks are included, so the rank is given as a separate property.
domain: Geochronologic Era
range: Geochronologic Era Rank

geologic description
type: Thing
sub property of: topDataProperty
property disjoint with: bottomDataProperty
type: DatatypeProperty
domain: Stratigraphic Section

stratotype
type: Thing
sub property of: topObjectProperty
property disjoint with: bottomObjectProperty
type: ObjectProperty
comment: the characteristic point or section corresponding with a geochronologic concept
domain: http://lodlaundromat.org/.well-known/genid/559210f90d4a6eec694a60a98f95a150#35
range: http://lodlaundromat.org/.well-known/genid/559210f90d4a6eec694a60a98f95a150#38

geologic setting
type: Thing
sub property of: topDataProperty
property disjoint with: bottomDataProperty
type: DatatypeProperty
domain: Stratigraphic Section

geologic manifestation
type: Thing
sub property of: topObjectProperty
property disjoint with: bottomObjectProperty
inverse of: correlating boundary or era
type: ObjectProperty
comment: This property points from a geochronologic element to a geologic feature
domain: http://lodlaundromat.org/.well-known/genid/559210f90d4a6eec694a60a98f95a150#25

geochronologic boundary
type: Thing
sub property of: topObjectProperty
property disjoint with: bottomObjectProperty
type: ObjectProperty
comment: geochronologic boundary corresponding with this point
domain: Stratigraphic Point
range: Geochronologic Boundary

Geochronologic Era Rank
type: Thing
disjoint with: Nothing
subclass of: Thing
type: Class

geochronologic era
type: Thing
sub property of: topObjectProperty
property disjoint with: bottomObjectProperty
type: ObjectProperty
comment: geochronologic era corresponding with this section
domain: Stratigraphic Section
range: Geochronologic Era

Stratigraphic Section
type: Thing
disjoint with: Nothing
subclass of: http://lodlaundromat.org/.well-known/genid/559210f90d4a6eec694a60a98f95a150#38
subclass of: SamplingCurve
subclass of: Thing
type: Class
subclass of: http://lodlaundromat.org/.well-known/genid/559210f90d4a6eec694a60a98f95a150#17
subclass of: http://lodlaundromat.org/.well-known/genid/559210f90d4a6eec694a60a98f95a150#18

Stratigraphic Point
type: Class
type: Thing
subclass of: http://lodlaundromat.org/.well-known/genid/559210f90d4a6eec694a60a98f95a150#38
subclass of: Thing
subclass of: SamplingPoint
disjoint with: Nothing
subclass of: http://lodlaundromat.org/.well-known/genid/559210f90d4a6eec694a60a98f95a150#22
subclass of: http://lodlaundromat.org/.well-known/genid/559210f90d4a6eec694a60a98f95a150#28
subclass of: http://lodlaundromat.org/.well-known/genid/559210f90d4a6eec694a60a98f95a150#32
subclass of: http://lodlaundromat.org/.well-known/genid/559210f90d4a6eec694a60a98f95a150#14
subclass of: http://lodlaundromat.org/.well-known/genid/559210f90d4a6eec694a60a98f95a150#15
subclass of: http://lodlaundromat.org/.well-known/genid/559210f90d4a6eec694a60a98f95a150#16

Geologic Timescale model
has part: dataquality
has part: correlating boundary or era
contributor: Stephen M RICHARD
description: This is an RDF/OWL representation of the GeoSciML Geologic Timescale model, which has been adapted from the model described in Cox, S.J.D, & Richard, S.M. (2005) A formal model for the geologic timescale and GSSP, compatible with geospatial information transfer standards, Geosphere, Geological Society of America 1/3, 119–137.
created: 2011-01-01
has part: geologic manifestation
has part: Stratigraphic Section
has part: geochronologic era
has part: geologic setting
has part: Numeric Era Boundary
has part: stratigraphic event
type: Thing
preferred namespace prefix: gts
has part: Era code
source: Cox, S.J.D, & Richard, S.M. (2005) A formal model for the geologic timescale and GSSP, compatible with geospatial information transfer standards, Geosphere, Geological Society of America 1/3, 119–137.
license: http://creativecommons.org/licenses/by/3.0/
has part: stratotype
modified: 2013-11-14
has part: Geochronologic Boundary
has part: geologic description
has part: Geochronologic Era Rank
has part: Geochronologic Era
has part: correlation event
has part: geochronologic boundary
has part: era rank
has part: Geologic Timescale
creator: Simon J D COX
preferred namespace uri: http://resource.geosciml.org/ontology/timescale/gts#
has part: Stratigraphic Event
has part: status
type: Vocabulary
has part: ratified
has part: boundary level
has part: Stratigraphic Point
rights: Copyright © 2012-2013 CSIRO, AzGS
imports: rank
imports: sampling
imports: thors
version IRI: gts.rdf
imports: temporal
type: Ontology
prior version: gts-30.rdf

correlating boundary or era
type: Thing
sub property of: topObjectProperty
property disjoint with: bottomObjectProperty
inverse of: geologic manifestation
type: ObjectProperty
comment: This property points from a geologic feature or event to a geochronologic element
range: http://lodlaundromat.org/.well-known/genid/559210f90d4a6eec694a60a98f95a150#19

boundary level
type: Thing
sub property of: topDataProperty
property disjoint with: bottomDataProperty
type: DatatypeProperty
comment: the level within the section of the point characterizing the boundary
domain: Stratigraphic Point

stratigraphic event
type: Thing
sub property of: topObjectProperty
property disjoint with: bottomObjectProperty
type: ObjectProperty
comment: stratigraphic event corresponding with this boundary or point
domain: http://lodlaundromat.org/.well-known/genid/559210f90d4a6eec694a60a98f95a150#22
range: Stratigraphic Event

status
type: Thing
sub property of: topDataProperty
property disjoint with: bottomDataProperty
type: DatatypeProperty
comment: formal ICS status of this boundary and point
domain: http://lodlaundromat.org/.well-known/genid/559210f90d4a6eec694a60a98f95a150#32

Geochronologic Boundary
subclass of: EraBoundary
disjoint with: Nothing
subclass of: http://lodlaundromat.org/.well-known/genid/559210f90d4a6eec694a60a98f95a150#28
type: Class
subclass of: http://lodlaundromat.org/.well-known/genid/559210f90d4a6eec694a60a98f95a150#25
subclass of: http://lodlaundromat.org/.well-known/genid/559210f90d4a6eec694a60a98f95a150#19
subclass of: http://lodlaundromat.org/.well-known/genid/559210f90d4a6eec694a60a98f95a150#10
type: Thing
subclass of: http://lodlaundromat.org/.well-known/genid/559210f90d4a6eec694a60a98f95a150#22
disjoint with: Numeric Era Boundary
subclass of: http://lodlaundromat.org/.well-known/genid/559210f90d4a6eec694a60a98f95a150#35
subclass of: Thing
subclass of: http://lodlaundromat.org/.well-known/genid/559210f90d4a6eec694a60a98f95a150#4

Geochronologic Era
disjoint with: Nothing
type: Thing
type: Class
subclass of: http://lodlaundromat.org/.well-known/genid/559210f90d4a6eec694a60a98f95a150#35
subclass of: http://lodlaundromat.org/.well-known/genid/559210f90d4a6eec694a60a98f95a150#25
subclass of: http://lodlaundromat.org/.well-known/genid/559210f90d4a6eec694a60a98f95a150#19
subclass of: Era
subclass of: Thing
subclass of: http://lodlaundromat.org/.well-known/genid/559210f90d4a6eec694a60a98f95a150#5
subclass of: http://lodlaundromat.org/.well-known/genid/559210f90d4a6eec694a60a98f95a150#6
subclass of: http://lodlaundromat.org/.well-known/genid/559210f90d4a6eec694a60a98f95a150#7

Era code
type: Thing
type: Datatype
equivalent class: http://lodlaundromat.org/.well-known/genid/559210f90d4a6eec694a60a98f95a150#1

ratified
type: Thing
sub property of: topDataProperty
property disjoint with: bottomDataProperty
property disjoint with: correlation event
type: DatatypeProperty
comment: 'true' if ratified by ICS
domain: http://lodlaundromat.org/.well-known/genid/559210f90d4a6eec694a60a98f95a150#28
range: boolean

Geologic Timescale
type: Thing
disjoint with: Nothing
subclass of: ReferenceSystem
subclass of: Thing
type: Class
subclass of: http://lodlaundromat.org/.well-known/genid/559210f90d4a6eec694a60a98f95a150#8
subclass of: http://lodlaundromat.org/.well-known/genid/559210f90d4a6eec694a60a98f95a150#9

Stratigraphic Event
type: Thing
disjoint with: Nothing
subclass of: Thing
type: Class
comment: A subclass of Geologic Event (placeholder)

correlation event
type: Thing
sub property of: topDataProperty
property disjoint with: bottomDataProperty
property disjoint with: ratified
type: DatatypeProperty
comment: the stratigraphic event that is intended to be represented by this stratigraphic point
domain: Stratigraphic Point
range: string

Numeric Era Boundary
type: Thing
subclass of: Thing
type: Class
subclass of: http://lodlaundromat.org/.well-known/genid/559210f90d4a6eec694a60a98f95a150#32
disjoint with: Nothing
disjoint with: Geochronologic Boundary
subclass of: http://lodlaundromat.org/.well-known/genid/559210f90d4a6eec694a60a98f95a150#28
subclass of: http://lodlaundromat.org/.well-known/genid/559210f90d4a6eec694a60a98f95a150#10
subclass of: EraBoundary
subclass of: http://lodlaundromat.org/.well-known/genid/559210f90d4a6eec694a60a98f95a150#13

http://lodlaundromat.org/.well-known/genid/559210f90d4a6eec694a60a98f95a150#16
type: Restriction
max cardinality: 1
on property: ratified

http://lodlaundromat.org/.well-known/genid/559210f90d4a6eec694a60a98f95a150#15
type: Restriction
cardinality: 1
on property: status

http://lodlaundromat.org/.well-known/genid/559210f90d4a6eec694a60a98f95a150#14
type: Restriction
cardinality: 1
on property: correlation event

http://lodlaundromat.org/.well-known/genid/559210f90d4a6eec694a60a98f95a150#13
type: Restriction
cardinality: 1
on property: status

http://lodlaundromat.org/.well-known/genid/559210f90d4a6eec694a60a98f95a150#2
pattern: a[12](.[1-9])*

Medium.name

http://lodlaundromat.org/.well-known/genid/559210f90d4a6eec694a60a98f95a150#18
type: Restriction
cardinality: 1
on property: geologic setting

http://lodlaundromat.org/.well-known/genid/559210f90d4a6eec694a60a98f95a150#17
type: Restriction
cardinality: 1
on property: geologic description

http://lodlaundromat.org/.well-known/genid/559210f90d4a6eec694a60a98f95a150#6
type: Restriction
cardinality: 1
on property: era rank