financial entity
disjoint with: Nothing
subclass of: Thing
type: Class
comment: An entity primarily to do with money.

is donated by
property disjoint with: publications
property disjoint with: depiction
property disjoint with: workInfoHomepage
sub property of: topObjectProperty
property disjoint with: img
property disjoint with: mbox
property disjoint with: bottomObjectProperty
inverse of: donates
property disjoint with: isPrimaryTopicOf
property disjoint with: phone
property disjoint with: thumbnail
property disjoint with: tipjar
property disjoint with: interest
property disjoint with: homepage
property disjoint with: workplaceHomepage
property disjoint with: has curriculum vitae
property disjoint with: weblog
property disjoint with: logo
property disjoint with: schoolHomepage
property disjoint with: pastProject
property disjoint with: made
type: ObjectProperty
property disjoint with: currentProject
property disjoint with: page
description: Domain constraints have been removed from this object property to permit it to be used in unforeseen ways.
comment: An object property linking a gift to the benefactor who provided it.
range: (foaf) Agent

annual turnover
disjoint with: Nothing
subclass of: financial entity
subclass of: Thing
type: Class
comment: The anual financial turnover of an organization (in a specified currency).

has milestone
sub property of: topDataProperty
property disjoint with: bottomDataProperty
property disjoint with: has birth date
type: DatatypeProperty
comment: A data property that permits one to define a significant event (a 'milestone') in the progress of a project.

admission application
disjoint with: Nothing
subclass of: application
subclass of: Thing
type: Class
comment: The activity of applying for admission to some group or institution, for example a learned society or a university.

stipend
disjoint with: Nothing
subclass of: financial entity
subclass of: funding
subclass of: Thing
subclass of: http://lodlaundromat.org/.well-known/genid/5432219778cf6f0499743510fcfcf875#7
subclass of: http://lodlaundromat.org/.well-known/genid/5432219778cf6f0499743510fcfcf875#1
type: Class
comment: A sum of money allotted on a regular basis, usually for some specific purpose.

data repository
disjoint with: Nothing
subclass of: infrastructure entity
subclass of: facility
subclass of: repository
subclass of: Thing
type: Class
description: May also be described as a data archive, or as a database.
comment: A facility in which digital data are deposited for long-term preservation and (optional) publication.

service costs
type: financial entity
type: budget category
type: Thing
type: NamedIndividual
comment: A budget category to cover the costs of services used by a project, for example a DNA sequencing service, or an equipment maintenance service.

has serial number
sub property of: identifier
sub property of: topDataProperty
property disjoint with: bottomDataProperty
property disjoint with: has birth date
type: DatatypeProperty
comment: A data property linking something, for example a piece of equipment, to its serial number.

has cost
sub property of: topDataProperty
property disjoint with: bottomDataProperty
property disjoint with: has birth date
type: DatatypeProperty
comment: A data property enabling the cost of something that can be paid for to be defined.

has expiry date
property disjoint with: bottomDataProperty
type: FunctionalProperty
property disjoint with: has invoice date
property disjoint with: has birth date
type: DatatypeProperty
property disjoint with: has award date
sub property of: topDataProperty
property disjoint with: birthday
comment: A data property linking something, for example a drug, to its expiry date, beyond which the manufacture recommends that it should not be used.
range: dateTime
sub property of: date

tender
disjoint with: Nothing
subclass of: financial entity
subclass of: Thing
type: Class
comment: Sealed bid or offer document submitted in response to a request for tenders, containing detailed information on costs, requirements and terms associated with a potential contract. (Adapted from http://www.businessdictionary.com/definition/tender.html).

host institution
subclass of: (foaf) Organization
subclass of: http://lodlaundromat.org/.well-known/genid/9d396f826af70bb26e6c953fbd3fce0b#6
subclass of: (foaf) Agent
type: Class
subclass of: http://lodlaundromat.org/.well-known/genid/9d396f826af70bb26e6c953fbd3fce0b#1
subclass of: http://lodlaundromat.org/.well-known/genid/9d396f826af70bb26e6c953fbd3fce0b#9
disjoint with: (foaf) Person
subclass of: Thing
disjoint with: http://lodlaundromat.org/.well-known/genid/9d396f826af70bb26e6c953fbd3fce0b#5
disjoint with: http://lodlaundromat.org/.well-known/genid/9d396f826af70bb26e6c953fbd3fce0b#17
subclass of: http://lodlaundromat.org/.well-known/genid/9d396f826af70bb26e6c953fbd3fce0b#13
disjoint with: (foaf) Project
disjoint with: (foaf) Image
subclass of: http://lodlaundromat.org/.well-known/genid/9d396f826af70bb26e6c953fbd3fce0b#18
disjoint with: research group
subclass of: http://lodlaundromat.org/.well-known/genid/5432219778cf6f0499743510fcfcf875#1
disjoint with: Nothing
subclass of: http://lodlaundromat.org/.well-known/genid/5432219778cf6f0499743510fcfcf875#4
disjoint with: http://lodlaundromat.org/.well-known/genid/9d396f826af70bb26e6c953fbd3fce0b#10
disjoint with: http://lodlaundromat.org/.well-known/genid/9d396f826af70bb26e6c953fbd3fce0b#16
subclass of: http://lodlaundromat.org/.well-known/genid/9d396f826af70bb26e6c953fbd3fce0b#23
disjoint with: http://lodlaundromat.org/.well-known/genid/9d396f826af70bb26e6c953fbd3fce0b#22
disjoint with: (foaf) Group
disjoint with: (foaf) PersonalProfileDocument
disjoint with: (foaf) Document
disjoint with: (foaf) OnlineAccount
subclass of: http://lodlaundromat.org/.well-known/genid/5432219778cf6f0499743510fcfcf875#7
comment: An institution that acts as a host, for example of a project or a person.

not-for-profit organization
subclass of: http://lodlaundromat.org/.well-known/genid/5432219778cf6f0499743510fcfcf875#4
subclass of: http://lodlaundromat.org/.well-known/genid/9d396f826af70bb26e6c953fbd3fce0b#23
disjoint with: (foaf) Image
disjoint with: (foaf) PersonalProfileDocument
subclass of: http://lodlaundromat.org/.well-known/genid/5432219778cf6f0499743510fcfcf875#1
disjoint with: (foaf) Project
disjoint with: http://lodlaundromat.org/.well-known/genid/9d396f826af70bb26e6c953fbd3fce0b#5
disjoint with: (foaf) Person
subclass of: Thing
subclass of: (foaf) Agent
subclass of: http://lodlaundromat.org/.well-known/genid/9d396f826af70bb26e6c953fbd3fce0b#6
type: Class
disjoint with: (foaf) Document
disjoint with: (foaf) Group
subclass of: http://lodlaundromat.org/.well-known/genid/9d396f826af70bb26e6c953fbd3fce0b#1
disjoint with: research group
subclass of: http://lodlaundromat.org/.well-known/genid/9d396f826af70bb26e6c953fbd3fce0b#18
disjoint with: http://lodlaundromat.org/.well-known/genid/9d396f826af70bb26e6c953fbd3fce0b#10
disjoint with: http://lodlaundromat.org/.well-known/genid/9d396f826af70bb26e6c953fbd3fce0b#17
subclass of: http://lodlaundromat.org/.well-known/genid/9d396f826af70bb26e6c953fbd3fce0b#13
subclass of: http://lodlaundromat.org/.well-known/genid/5432219778cf6f0499743510fcfcf875#7
subclass of: http://lodlaundromat.org/.well-known/genid/9d396f826af70bb26e6c953fbd3fce0b#9
disjoint with: http://lodlaundromat.org/.well-known/genid/9d396f826af70bb26e6c953fbd3fce0b#22
disjoint with: Nothing
disjoint with: (foaf) OnlineAccount
disjoint with: http://lodlaundromat.org/.well-known/genid/9d396f826af70bb26e6c953fbd3fce0b#16
subclass of: (foaf) Organization
comment: An organization that does not primarily exist to make profit, for example a charity or charitable foundation, a learned society, or a standards body such as the World Wide Web Consortium.

has postal address
sub property of: topDataProperty
sub property of: has information
property disjoint with: bottomDataProperty
property disjoint with: has project identifier
property disjoint with: sha1
property disjoint with: has birth date
type: DatatypeProperty
comment: A data property identifying a postal address for an agent.

is owned by
property disjoint with: bottomObjectProperty
property disjoint with: depiction
property disjoint with: homepage
property disjoint with: img
property disjoint with: isPrimaryTopicOf
property disjoint with: workInfoHomepage
property disjoint with: tipjar
property disjoint with: currentProject
property disjoint with: pastProject
property disjoint with: logo
type: ObjectProperty
property disjoint with: interest
property disjoint with: has curriculum vitae
property disjoint with: workplaceHomepage
property disjoint with: schoolHomepage
property disjoint with: made
property disjoint with: thumbnail
property disjoint with: publications
sub property of: topObjectProperty
property disjoint with: page
property disjoint with: weblog
property disjoint with: phone
inverse of: owns
property disjoint with: mbox
comment: An object property linking an entity to the agent that owns it.
range: (foaf) Agent

is employed by
inverse of: employs
property disjoint with: maker
property disjoint with: pastProject
property disjoint with: primaryTopic
property disjoint with: homepage
property disjoint with: mbox
property disjoint with: isPrimaryTopicOf
property disjoint with: workInfoHomepage
property disjoint with: topic
property disjoint with: thumbnail
property disjoint with: bottomObjectProperty
property disjoint with: img
type: ObjectProperty
property disjoint with: currentProject
property disjoint with: depicts
property disjoint with: depiction
property disjoint with: logo
property disjoint with: made
property disjoint with: page
property disjoint with: phone
property disjoint with: tipjar
property disjoint with: interest
property disjoint with: weblog
property disjoint with: has curriculum vitae
property disjoint with: publications
sub property of: topObjectProperty
property disjoint with: workplaceHomepage
property disjoint with: schoolHomepage
description: This property should not be used for the other meaning of 'employ', meaning to use something, e.g. 'Great skill is employed by master craftsmen . . .'/
comment: An object property relating an employed agent, typically a person or an organization, to an employing agent.
domain: (foaf) Agent
range: (foaf) Agent

employs
property disjoint with: pastProject
property disjoint with: tipjar
property disjoint with: bottomObjectProperty
type: ObjectProperty
property disjoint with: homepage
property disjoint with: thumbnail
property disjoint with: phone
property disjoint with: page
sub property of: topObjectProperty
property disjoint with: currentProject
property disjoint with: workInfoHomepage
property disjoint with: publications
property disjoint with: topic
property disjoint with: made
property disjoint with: schoolHomepage
inverse of: is employed by
property disjoint with: depicts
property disjoint with: workplaceHomepage
property disjoint with: interest
property disjoint with: has curriculum vitae
property disjoint with: primaryTopic
property disjoint with: weblog
property disjoint with: depiction
property disjoint with: img
property disjoint with: mbox
property disjoint with: logo
property disjoint with: maker
property disjoint with: isPrimaryTopicOf
description: This property should not be used for the other meaning of 'employ', meaning to use something, e.g. 'He employed great skill . . .'/
comment: An object property relating an employing agent to an employed agent, for example a person or an organization, who is typically employed to undertaking specified work in exchange for payment.
domain: (foaf) Agent
range: (foaf) Agent

service contract fee
disjoint with: Nothing
subclass of: fee
subclass of: financial entity
subclass of: Thing
type: Class
comment: A fee paid periodically, typically annually, to obtain access when required to a service such as an equipment maintenance contract."

family name initial
property disjoint with: sha1
property disjoint with: has birth date
sub property of: topDataProperty
sub property of: has information
type: DatatypeProperty
property disjoint with: has organizational information
sub property of: has contact information
sub property of: initials
property disjoint with: has headcount
property disjoint with: has project identifier
property disjoint with: bottomDataProperty
property disjoint with: has funder identifer
comment: A data property permitting specification of the initial(s) of a person's family name.

has expertise
sub property of: topDataProperty
sub property of: has information
property disjoint with: bottomDataProperty
property disjoint with: has project identifier
property disjoint with: sha1
property disjoint with: has birth date
type: DatatypeProperty
comment: A data property identifying the area(s) of expertise and skills posessed by an individual or an organization.

has value
sub property of: topDataProperty
property disjoint with: bottomDataProperty
property disjoint with: has birth date
type: DatatypeProperty
comment: A data property enabling one to specify the monetary value of a financial entity such as a grant, a gift or a budget category. Use in conjuction with frapo:hasCurrency.

has country
sub property of: topDataProperty
property disjoint with: bottomDataProperty
property disjoint with: has birth date
type: DatatypeProperty
comment: A data property specifying a country, for example as the location of an event.

(foaf) OnlineAccount
disjoint with: (foaf) Agent
subclass of: Thing
disjoint with: company
subclass of: http://lodlaundromat.org/.well-known/genid/9d396f826af70bb26e6c953fbd3fce0b#6
disjoint with: (foaf) Group
disjoint with: registration authority
disjoint with: (foaf) Document
disjoint with: http://lodlaundromat.org/.well-known/genid/9d396f826af70bb26e6c953fbd3fce0b#18
disjoint with: (foaf) Person
disjoint with: registration agency
disjoint with: funding agency
disjoint with: university
disjoint with: http://lodlaundromat.org/.well-known/genid/9d396f826af70bb26e6c953fbd3fce0b#1
disjoint with: college
disjoint with: research institute
disjoint with: (foaf) PersonalProfileDocument
disjoint with: supplier
disjoint with: vendor
disjoint with: http://lodlaundromat.org/.well-known/genid/9d396f826af70bb26e6c953fbd3fce0b#9
subclass of: http://lodlaundromat.org/.well-known/genid/9d396f826af70bb26e6c953fbd3fce0b#17
disjoint with: small to medium enterprise
disjoint with: owner
disjoint with: spin-off company
subclass of: http://lodlaundromat.org/.well-known/genid/9d396f826af70bb26e6c953fbd3fce0b#23
disjoint with: research group
subclass of: http://lodlaundromat.org/.well-known/genid/9d396f826af70bb26e6c953fbd3fce0b#10
disjoint with: Nothing
disjoint with: (foaf) Project
disjoint with: purchaser
disjoint with: faculty
disjoint with: http://lodlaundromat.org/.well-known/genid/9d396f826af70bb26e6c953fbd3fce0b#13
disjoint with: division
disjoint with: (foaf) Organization
disjoint with: http://lodlaundromat.org/.well-known/genid/9d396f826af70bb26e6c953fbd3fce0b#22
subclass of: http://lodlaundromat.org/.well-known/genid/9d396f826af70bb26e6c953fbd3fce0b#16
disjoint with: (foaf) Image
disjoint with: host institution
disjoint with: department
disjoint with: computational agent
disjoint with: http://lodlaundromat.org/.well-known/genid/9d396f826af70bb26e6c953fbd3fce0b#5
disjoint with: not-for-profit organization
disjoint with: manufacturer
type: Class
disjoint with: government organization
nsterm status: unstable
comment: An online account.

status
disjoint with: Nothing
subclass of: Thing
type: Class
comment: The status of something such as an application, an investigation or a project.

building costs
type: financial entity
type: budget category
type: Thing
type: NamedIndividual
comment: A budget category to cover the costs of constructing, renovating or modifying a physical building.

is funded by
sub property of: topObjectProperty
sub property of: is supported by
property disjoint with: bottomObjectProperty
inverse of: funds
type: ObjectProperty
comment: An object property linking something to the funding that funds it (i.e. that finances or pays for it), or to the funding agency providing that funding. This flexibility is given because of alternative usages of the English word 'funds'. [See also frapo:isAwardedBy and frapo:hasFundingAgency and frapo:isSupportedBy.]

spin-off company
disjoint with: http://lodlaundromat.org/.well-known/genid/9d396f826af70bb26e6c953fbd3fce0b#10
disjoint with: (foaf) Group
disjoint with: (foaf) PersonalProfileDocument
disjoint with: (foaf) Image
subclass of: company
subclass of: http://lodlaundromat.org/.well-known/genid/9d396f826af70bb26e6c953fbd3fce0b#1
disjoint with: research group
disjoint with: http://lodlaundromat.org/.well-known/genid/9d396f826af70bb26e6c953fbd3fce0b#22
subclass of: (foaf) Agent
subclass of: http://lodlaundromat.org/.well-known/genid/5432219778cf6f0499743510fcfcf875#4
disjoint with: (foaf) Document
subclass of: http://lodlaundromat.org/.well-known/genid/9d396f826af70bb26e6c953fbd3fce0b#13
subclass of: http://lodlaundromat.org/.well-known/genid/9d396f826af70bb26e6c953fbd3fce0b#6
disjoint with: (foaf) Person
disjoint with: (foaf) Project
subclass of: (foaf) Organization
disjoint with: http://lodlaundromat.org/.well-known/genid/9d396f826af70bb26e6c953fbd3fce0b#16
subclass of: http://lodlaundromat.org/.well-known/genid/9d396f826af70bb26e6c953fbd3fce0b#18
disjoint with: http://lodlaundromat.org/.well-known/genid/9d396f826af70bb26e6c953fbd3fce0b#17
subclass of: Thing
subclass of: http://lodlaundromat.org/.well-known/genid/5432219778cf6f0499743510fcfcf875#1
disjoint with: (foaf) OnlineAccount
disjoint with: http://lodlaundromat.org/.well-known/genid/9d396f826af70bb26e6c953fbd3fce0b#5
subclass of: http://lodlaundromat.org/.well-known/genid/9d396f826af70bb26e6c953fbd3fce0b#9
subclass of: http://lodlaundromat.org/.well-known/genid/5432219778cf6f0499743510fcfcf875#7
type: Class
subclass of: http://lodlaundromat.org/.well-known/genid/9d396f826af70bb26e6c953fbd3fce0b#23
disjoint with: Nothing
comment: A company that has been established by a university or research institute to mature and market the results of research conducted at that research institution.

has currency code
sub property of: topDataProperty
sub property of: has code
property disjoint with: bottomDataProperty
property disjoint with: has birth date
type: DatatypeProperty
comment: A data property specifying the three-letter currency code used to identify a currency, as defined by ISO 4217 (e.g. EUR or GBP) (see http://en.wikipedia.org/wiki/ISO_4217). Not to be confused with the symbol used with numbers to denote an amount of money in a particular currency (e.g.€500; £3.40)

bursary
disjoint with: Nothing
subclass of: financial entity
subclass of: funding
subclass of: Thing
subclass of: http://lodlaundromat.org/.well-known/genid/5432219778cf6f0499743510fcfcf875#7
subclass of: http://lodlaundromat.org/.well-known/genid/5432219778cf6f0499743510fcfcf875#1
type: Class
comment: An amount of money given to a person by an organization, for example by a university to a university student in need to enable that student to continue his/her studies.

funds
sub property of: topObjectProperty
sub property of: supports
property disjoint with: bottomObjectProperty
inverse of: is funded by
type: ObjectProperty
comment: An object property that links a grant to something that it funds (i.e. that it finances or pays for), or that links an agent providing funding to something that it funds. This flexibility is given because of alternative usages of the English word 'funds'. [See also frapo:awards and frapo:supports.]

has completion date
sub property of: topDataProperty
property disjoint with: has invoice date
property disjoint with: bottomDataProperty
property disjoint with: has award date
property disjoint with: birthday
type: DatatypeProperty
type: FunctionalProperty
property disjoint with: has birth date
comment: A data property linking something such as a building or a contract to its date of completion.
range: dateTime
sub property of: date

purchaser
disjoint with: (foaf) Project
subclass of: http://lodlaundromat.org/.well-known/genid/9d396f826af70bb26e6c953fbd3fce0b#6
disjoint with: http://lodlaundromat.org/.well-known/genid/9d396f826af70bb26e6c953fbd3fce0b#10
subclass of: Thing
subclass of: http://lodlaundromat.org/.well-known/genid/5432219778cf6f0499743510fcfcf875#7
type: Class
disjoint with: Nothing
subclass of: http://lodlaundromat.org/.well-known/genid/9d396f826af70bb26e6c953fbd3fce0b#18
disjoint with: http://lodlaundromat.org/.well-known/genid/9d396f826af70bb26e6c953fbd3fce0b#22
disjoint with: http://lodlaundromat.org/.well-known/genid/9d396f826af70bb26e6c953fbd3fce0b#17
subclass of: http://lodlaundromat.org/.well-known/genid/5432219778cf6f0499743510fcfcf875#1
subclass of: http://lodlaundromat.org/.well-known/genid/9d396f826af70bb26e6c953fbd3fce0b#1
disjoint with: (foaf) Document
disjoint with: http://lodlaundromat.org/.well-known/genid/9d396f826af70bb26e6c953fbd3fce0b#16
disjoint with: http://lodlaundromat.org/.well-known/genid/9d396f826af70bb26e6c953fbd3fce0b#5
subclass of: http://lodlaundromat.org/.well-known/genid/9d396f826af70bb26e6c953fbd3fce0b#13
subclass of: http://lodlaundromat.org/.well-known/genid/9d396f826af70bb26e6c953fbd3fce0b#9
subclass of: http://lodlaundromat.org/.well-known/genid/5432219778cf6f0499743510fcfcf875#4
subclass of: http://lodlaundromat.org/.well-known/genid/9d396f826af70bb26e6c953fbd3fce0b#23
subclass of: (foaf) Agent
disjoint with: (foaf) OnlineAccount
disjoint with: (foaf) PersonalProfileDocument
disjoint with: (foaf) Image
comment: An agent who purchases something from a supplier.

library
disjoint with: Nothing
subclass of: infrastructure entity
subclass of: facility
subclass of: repository
subclass of: Thing
type: Class
comment: A facility in which printed documents (for example books and journals) are deposited for long-term preservation and access.

contract
disjoint with: Nothing
subclass of: financial entity
subclass of: Thing
type: Class
comment: A legally binding agreement between parties.

unfunded
type: Thing
type: status
type: NamedIndividual
comment: The status of something such as an investigation or a project as being unfunded.

investigation
disjoint with: Nothing
subclass of: endeavour
subclass of: Thing
type: Class
description: Equivalent class in ISA-RDF: 'Investigation'.
comment: An investigation is an endeavour that involves research, enabled by a project. The investigation relate to the scholarly and practical aspects of conducting the research itself, including the hypotheses being investigated, the experiments being undertaken, the data being gathered and analysed, the interpretations being drawn from the data, and the results obtained. In contrast, the project that enables it encompasses the administrative aspects of undertaking the endeavour, including the funding obtained, the people employed, and the management of the project in terms of deadlines and deliverables.

document repository
disjoint with: Nothing
subclass of: infrastructure entity
subclass of: facility
subclass of: repository
subclass of: Thing
type: Class
description: May also be described as a document archive, or a digital library.
comment: A facility in which digital documents are deposited for long-term preservation and (optional) publication.

has application deadline
type: DatatypeProperty
property disjoint with: has award date
sub property of: topDataProperty
property disjoint with: has invoice date
property disjoint with: birthday
property disjoint with: has birth date
type: FunctionalProperty
property disjoint with: bottomDataProperty
description: owl:equivalentProperty fabio:hasApplicationDeadline .
type: AnnotationProperty
comment: The date by which an application, for example a job application, a fellowship application or a grant application, has to be submitted if it is to be considered for acceptance or funding.
domain: application
range: dateTime
sub property of: date

has fax number
sub property of: topDataProperty
sub property of: has information
property disjoint with: bottomDataProperty
property disjoint with: has project identifier
property disjoint with: sha1
property disjoint with: has birth date
type: DatatypeProperty
comment: A data property identifying a Fax number for an agent.

has acronym
sub property of: topDataProperty
property disjoint with: bottomDataProperty
property disjoint with: has birth date
type: DatatypeProperty
comment: A data property linking an entity to an acronym used to identify it, based on its full name or title. For example, this ontology has the full name 'Funding, Research Administration and Projects Ontology' and the acronym 'FRAPO'.

publishing costs
type: financial entity
type: budget category
type: Thing
type: NamedIndividual
comment: A budget category to cover the cost of publishing outpots from a project, for example author fees for journal articles in an open access journal.

submits
sub property of: topObjectProperty
property disjoint with: primaryTopic
inverse of: is submitted by
type: ObjectProperty
property disjoint with: depicts
property disjoint with: bottomObjectProperty
property disjoint with: topic
property disjoint with: thumbnail
property disjoint with: maker
comment: An object property linking an agent to an entity that is submitted to some third party, for example a grant application submitted to a funding agency, a manuscript submitted to a publisher, a quotation submitted by a vendor, or a dataset submitted by a researcher to a data repository.
domain: (foaf) Agent

specifies expenditure
sub property of: topObjectProperty
property disjoint with: bottomObjectProperty
type: ObjectProperty
description: Range constraints have been removed from this object property to permit it to be used in unforeseen ways.
comment: An object property relating an agent or a budget to the expenditure specified by that agent or budget.
domain: http://lodlaundromat.org/.well-known/genid/5432219778cf6f0499743510fcfcf875#4

studentship
subclass of: http://lodlaundromat.org/.well-known/genid/5432219778cf6f0499743510fcfcf875#7
subclass of: financial entity
type: Class
subclass of: http://lodlaundromat.org/.well-known/genid/5432219778cf6f0499743510fcfcf875#1
disjoint with: Nothing
subclass of: stipend
subclass of: Thing
subclass of: funding
comment: A financial grant to a student to enable him/her to undertake advanced academic study.

has invoice date
property disjoint with: has purchase date
property disjoint with: has creation date
property disjoint with: has temporal duration
property disjoint with: has registration deadline
property disjoint with: has completion date
property disjoint with: has data of manufacture
type: DatatypeProperty
property disjoint with: has birth date
property disjoint with: has quotation date
property disjoint with: has end date
property disjoint with: has dispatch date
property disjoint with: has decision date
type: FunctionalProperty
property disjoint with: has start date
sub property of: topDataProperty
property disjoint with: bottomDataProperty
property disjoint with: has application deadline
property disjoint with: has delivery date
property disjoint with: has expiry date
type: AnnotationProperty
comment: A data property linking an invoice to its date.
domain: invoice
range: date
sub property of: date

is supplied by
type: ObjectProperty
property disjoint with: schoolHomepage
property disjoint with: isPrimaryTopicOf
property disjoint with: depiction
property disjoint with: page
property disjoint with: has curriculum vitae
sub property of: topObjectProperty
property disjoint with: tipjar
property disjoint with: bottomObjectProperty
property disjoint with: homepage
property disjoint with: phone
property disjoint with: currentProject
property disjoint with: thumbnail
inverse of: supplies
property disjoint with: workInfoHomepage
property disjoint with: logo
property disjoint with: workplaceHomepage
property disjoint with: publications
property disjoint with: img
property disjoint with: interest
property disjoint with: weblog
property disjoint with: mbox
property disjoint with: pastProject
property disjoint with: made
comment: An object property relating an entity that is supplied, or an agent to whom an entity is supplied, to the supplier.
range: supplier

has quotation date
sub property of: topDataProperty
property disjoint with: has award date
property disjoint with: bottomDataProperty
property disjoint with: has invoice date
property disjoint with: has birth date
property disjoint with: birthday
type: DatatypeProperty
comment: A data property linking a quotation to its date.
range: dateTime
sub property of: date

contributions in kind
type: financial entity
type: budget category
type: Thing
type: NamedIndividual
comment: A budget category to categorize the financial worth of contributions in kind (e.g. staff effort, access to facilities, sharing of know-how) given to a project by an agent, for example by the host institution or by a commerical partner in an academic project.

has contact information
property disjoint with: has organizational information
type: DatatypeProperty
sub property of: has information
property disjoint with: sha1
property disjoint with: has birth date
property disjoint with: has funder identifer
property disjoint with: has headcount
sub property of: topDataProperty
property disjoint with: has project identifier
property disjoint with: bottomDataProperty
comment: A data property linking a person to information about that person.
domain: (foaf) Person

supports
sub property of: topObjectProperty
property disjoint with: bottomObjectProperty
inverse of: is supported by
type: ObjectProperty
description: This property is not intended for use to describe mechanical or physical support, as in 'The plinth supports the statue'.
comment: An object property linking an agent to something that the agent supports by financial or other means.
domain: http://lodlaundromat.org/.well-known/genid/5432219778cf6f0499743510fcfcf875#7

investment
disjoint with: Nothing
subclass of: financial entity
subclass of: Thing
type: Class
comment: An investment of money, generally in stocks and shares, or in property, for the purpose of safeguarding the capital and yielding an income.

registration authority
disjoint with: http://lodlaundromat.org/.well-known/genid/9d396f826af70bb26e6c953fbd3fce0b#16
type: Class
subclass of: http://lodlaundromat.org/.well-known/genid/5432219778cf6f0499743510fcfcf875#1
disjoint with: http://lodlaundromat.org/.well-known/genid/9d396f826af70bb26e6c953fbd3fce0b#17
subclass of: (foaf) Agent
subclass of: http://lodlaundromat.org/.well-known/genid/5432219778cf6f0499743510fcfcf875#7
subclass of: Thing
subclass of: http://lodlaundromat.org/.well-known/genid/9d396f826af70bb26e6c953fbd3fce0b#13
disjoint with: http://lodlaundromat.org/.well-known/genid/9d396f826af70bb26e6c953fbd3fce0b#10
subclass of: http://lodlaundromat.org/.well-known/genid/9d396f826af70bb26e6c953fbd3fce0b#6
disjoint with: (foaf) Person
subclass of: (foaf) Organization
subclass of: http://lodlaundromat.org/.well-known/genid/5432219778cf6f0499743510fcfcf875#4
disjoint with: (foaf) PersonalProfileDocument
disjoint with: Nothing
subclass of: http://lodlaundromat.org/.well-known/genid/9d396f826af70bb26e6c953fbd3fce0b#9
disjoint with: (foaf) Project
disjoint with: http://lodlaundromat.org/.well-known/genid/9d396f826af70bb26e6c953fbd3fce0b#5
disjoint with: (foaf) Image
disjoint with: (foaf) Group
disjoint with: research group
disjoint with: (foaf) OnlineAccount
subclass of: http://lodlaundromat.org/.well-known/genid/9d396f826af70bb26e6c953fbd3fce0b#1
disjoint with: http://lodlaundromat.org/.well-known/genid/9d396f826af70bb26e6c953fbd3fce0b#22
subclass of: http://lodlaundromat.org/.well-known/genid/9d396f826af70bb26e6c953fbd3fce0b#18
disjoint with: (foaf) Document
subclass of: http://lodlaundromat.org/.well-known/genid/9d396f826af70bb26e6c953fbd3fce0b#23
comment: An agency with responsibility for registering and maintaining international standards, internet domain names, patents, controlled vocabularies and other similar entities required for reliable international cooperatative activities.

endeavour
disjoint with: Nothing
subclass of: Thing
type: Class
comment: In FRAPO, an endeavour is an activity such as a research investigation that is enabled by a project. An endeavour relate to the academic and practical aspects of undertaking that endeavour - thus for a research investigation the research itself, including the hypotheses being investigated, the experiments being undertaken, the data being gathered and analysed, the interpretations being drawn from the data, and the results obtained. In contrast, the project relates to the administrative aspects of undertaking an endeavour, including the funding obtained, the people employed, and the management of the project in terms of deadlines and deliverables.

material output
disjoint with: Nothing
subclass of: infrastructure entity
subclass of: output
subclass of: Thing
subclass of: equipment
type: Class
comment: A material or physical output created or produced as a result of a project or an endeavour such as a research investigation. Examples include a building constructed as a result of a building project, and research outputs such as a cell line, a mouse mutant or a new form of microscope.

is awarded by
property disjoint with: bottomObjectProperty
property disjoint with: interest
property disjoint with: thumbnail
type: FunctionalProperty
property disjoint with: tipjar
property disjoint with: has curriculum vitae
property disjoint with: made
property disjoint with: schoolHomepage
property disjoint with: workplaceHomepage
property disjoint with: weblog
property disjoint with: depiction
property disjoint with: img
property disjoint with: logo
property disjoint with: page
sub property of: topObjectProperty
property disjoint with: mbox
type: ObjectProperty
property disjoint with: workInfoHomepage
inverse of: awards
property disjoint with: phone
property disjoint with: publications
property disjoint with: isPrimaryTopicOf
property disjoint with: pastProject
property disjoint with: homepage
property disjoint with: currentProject
description: Domain constraints have been removed from this object property to permit it to be used in unforeseen ways.
comment: An object property linking something awarded to the agent making the award, for example linking a grant to a funding agency, a degree to a university, or a prize to the awarding organization.
range: (foaf) Agent

funding
disjoint with: Nothing
subclass of: financial entity
subclass of: Thing
subclass of: http://lodlaundromat.org/.well-known/genid/5432219778cf6f0499743510fcfcf875#7
subclass of: http://lodlaundromat.org/.well-known/genid/5432219778cf6f0499743510fcfcf875#1
type: Class
comment: An amount of money available to finance some project or activity.

indirect costs
type: financial entity
type: budget category
type: Thing
type: NamedIndividual
comment: A budget category to cover the indirect costs of running a project, for example heating and lighting, and the employment of non-project staff including administrators, accountants and cleaners.

given name initial
property disjoint with: has headcount
property disjoint with: has organizational information
property disjoint with: sha1
sub property of: has contact information
property disjoint with: bottomDataProperty
property disjoint with: has birth date
sub property of: has information
sub property of: topDataProperty
property disjoint with: has funder identifer
sub property of: initials
type: DatatypeProperty
property disjoint with: has project identifier
comment: A data property permitting specification of the initial(s) of a person's given name(s).

has headcount
property disjoint with: has name suffix
property disjoint with: has birth date
property disjoint with: initials
sub property of: has information
property disjoint with: has job title
property disjoint with: nick
property disjoint with: plan
property disjoint with: aimChatID
property disjoint with: has ORCID
property disjoint with: has degrees
property disjoint with: has qualification
property disjoint with: given name initial
property disjoint with: has alternate name
property disjoint with: birthday
type: DatatypeProperty
property disjoint with: has project identifier
property disjoint with: sha1
property disjoint with: family name initial
property disjoint with: has familiar suffix
property disjoint with: bottomDataProperty
property disjoint with: has contact information
property disjoint with: myersBriggs
sub property of: topDataProperty
property disjoint with: jabberID
property disjoint with: yahooChatID
sub property of: has organizational information
property disjoint with: geekcode
property disjoint with: name
property disjoint with: has personal identifier
property disjoint with: post-nominals
property disjoint with: title
comment: A data property specifying the number of people employed by an organization.

has dispatch date
sub property of: topDataProperty
property disjoint with: has award date
property disjoint with: bottomDataProperty
property disjoint with: has invoice date
property disjoint with: has birth date
property disjoint with: birthday
type: DatatypeProperty
comment: The date on which something, for example an item of equipment, is dispatched by the supplier.
range: dateTime
sub property of: date

has code
sub property of: topDataProperty
property disjoint with: bottomDataProperty
property disjoint with: has birth date
type: DatatypeProperty
comment: A data property defining a code.

budget category
disjoint with: Nothing
subclass of: financial entity
subclass of: Thing
type: Class
comment: A category of expenditure within a budget, determining what the allocated money can be spent on, for example salaries, equipment, travel.

fee
disjoint with: Nothing
subclass of: financial entity
subclass of: Thing
type: Class
comment: An amount of money paid for something that is not purchased.

identifier
sub property of: topDataProperty
property disjoint with: bottomDataProperty
property disjoint with: has birth date
type: DatatypeProperty
comment: A unique and unambiguous reference to the resource within a given context. Recommended best practice is to identify the resource by means of a string conforming to a formal identification system.

has creation date
property disjoint with: birthday
property disjoint with: bottomDataProperty
property disjoint with: has birth date
type: DatatypeProperty
property disjoint with: has invoice date
type: FunctionalProperty
property disjoint with: has award date
sub property of: topDataProperty
comment: A data property linking something to its date of creation.
range: dateTime
sub property of: date

employment contract
disjoint with: Nothing
subclass of: contract
subclass of: financial entity
subclass of: Thing
type: Class
comment: A contract of employment between a person and an organization.

rejected
type: Thing
type: status
type: NamedIndividual
comment: The status of something such as an application as having been rejected.

account statement
disjoint with: Nothing
subclass of: financial entity
subclass of: Thing
type: Class
comment: A statement of income and expenditure for an account, typically presented as dated income receipts and outgoings against categories in a budget for that account.

has familiar suffix
type: DatatypeProperty
property disjoint with: sha1
sub property of: has name suffix
property disjoint with: has project identifier
property disjoint with: bottomDataProperty
sub property of: topDataProperty
property disjoint with: has headcount
property disjoint with: has birth date
sub property of: has information
property disjoint with: has organizational information
sub property of: has contact information
property disjoint with: has funder identifer
comment: The letters that may be displayed after a person's name to indicate familial status, e.g. Sn., Jn., III, 3rd.

expenditure
disjoint with: Nothing
subclass of: budget information
subclass of: financial entity
subclass of: Thing
type: Class
comment: Money going out of an account, because of expenditure on various entities. May be associated with a particular budget category.

consultancy agreement
disjoint with: Nothing
subclass of: contract
subclass of: financial entity
subclass of: Thing
type: Class
comment: A contract between an employer and a consultant, detailing the terms of the consultancy.

purchases
inverse of: was purchased by
property disjoint with: topic
type: ObjectProperty
property disjoint with: maker
property disjoint with: depicts
property disjoint with: primaryTopic
property disjoint with: thumbnail
sub property of: topObjectProperty
property disjoint with: bottomObjectProperty
description: Range constraints have been removed from this object property to permit it to be used in unforeseen ways.
comment: An object property relating a purchaser to a purchased entity.
domain: (foaf) Agent

available funds
disjoint with: Nothing
subclass of: budget information
subclass of: financial entity
subclass of: Thing
type: Class
comment: The amount available to spend in a budget category, equalling the income minus the expenditure to date plus future expenditure commitments.

service contract
disjoint with: Nothing
subclass of: contract
subclass of: financial entity
subclass of: Thing
type: Class
comment: A contract for the provision of a service such as a cleaning service, or for the regular servicing, maintenance and repair of some item of equipment or infrastructure.

subscription
disjoint with: Nothing
subclass of: fee
subclass of: financial entity
subclass of: Thing
type: Class
comment: Payment, commonly made annually, to obtain access to something on a periodic or continuing basis, such as a journal.

research institute
disjoint with: http://lodlaundromat.org/.well-known/genid/9d396f826af70bb26e6c953fbd3fce0b#22
disjoint with: (foaf) Person
disjoint with: (foaf) Project
disjoint with: (foaf) PersonalProfileDocument
subclass of: (foaf) Organization
subclass of: http://lodlaundromat.org/.well-known/genid/5432219778cf6f0499743510fcfcf875#4
disjoint with: research group
disjoint with: http://lodlaundromat.org/.well-known/genid/9d396f826af70bb26e6c953fbd3fce0b#10
subclass of: http://lodlaundromat.org/.well-known/genid/9d396f826af70bb26e6c953fbd3fce0b#9
disjoint with: http://lodlaundromat.org/.well-known/genid/9d396f826af70bb26e6c953fbd3fce0b#5
subclass of: http://lodlaundromat.org/.well-known/genid/9d396f826af70bb26e6c953fbd3fce0b#18
subclass of: http://lodlaundromat.org/.well-known/genid/5432219778cf6f0499743510fcfcf875#7
disjoint with: http://lodlaundromat.org/.well-known/genid/9d396f826af70bb26e6c953fbd3fce0b#16
disjoint with: (foaf) OnlineAccount
subclass of: http://lodlaundromat.org/.well-known/genid/9d396f826af70bb26e6c953fbd3fce0b#6
disjoint with: (foaf) Image
disjoint with: Nothing
type: Class
subclass of: http://lodlaundromat.org/.well-known/genid/5432219778cf6f0499743510fcfcf875#1
disjoint with: http://lodlaundromat.org/.well-known/genid/9d396f826af70bb26e6c953fbd3fce0b#17
subclass of: http://lodlaundromat.org/.well-known/genid/9d396f826af70bb26e6c953fbd3fce0b#23
subclass of: http://lodlaundromat.org/.well-known/genid/9d396f826af70bb26e6c953fbd3fce0b#13
disjoint with: (foaf) Group
subclass of: http://lodlaundromat.org/.well-known/genid/9d396f826af70bb26e6c953fbd3fce0b#1
subclass of: Thing
subclass of: (foaf) Agent
disjoint with: (foaf) Document
comment: An organization primarily dedicated to undertaking research, that might be part of a university or of a commercial company, or might be independently funded by a research funding agency.

has language code
sub property of: topDataProperty
sub property of: has code
property disjoint with: bottomDataProperty
property disjoint with: has birth date
type: DatatypeProperty
comment: A data property specifying the two-letter or three-letter lower-case code used to identify a language (e.g. fr/fra for French, de/deu for Germany) (see http://en.wikipedia.org/wiki/List_of_ISO_639-1_codes).

funding agency
disjoint with: (foaf) Project
disjoint with: (foaf) PersonalProfileDocument
subclass of: http://lodlaundromat.org/.well-known/genid/9d396f826af70bb26e6c953fbd3fce0b#18
disjoint with: (foaf) Person
subclass of: http://lodlaundromat.org/.well-known/genid/9d396f826af70bb26e6c953fbd3fce0b#9
disjoint with: http://lodlaundromat.org/.well-known/genid/9d396f826af70bb26e6c953fbd3fce0b#17
subclass of: http://lodlaundromat.org/.well-known/genid/9d396f826af70bb26e6c953fbd3fce0b#13
subclass of: http://lodlaundromat.org/.well-known/genid/5432219778cf6f0499743510fcfcf875#1
subclass of: http://lodlaundromat.org/.well-known/genid/9d396f826af70bb26e6c953fbd3fce0b#23
disjoint with: (foaf) Group
disjoint with: http://lodlaundromat.org/.well-known/genid/9d396f826af70bb26e6c953fbd3fce0b#22
disjoint with: research group
subclass of: http://lodlaundromat.org/.well-known/genid/9d396f826af70bb26e6c953fbd3fce0b#6
subclass of: http://lodlaundromat.org/.well-known/genid/9d396f826af70bb26e6c953fbd3fce0b#1
disjoint with: Nothing
disjoint with: (foaf) Image
disjoint with: (foaf) Document
subclass of: (foaf) Agent
disjoint with: (foaf) OnlineAccount
subclass of: http://lodlaundromat.org/.well-known/genid/5432219778cf6f0499743510fcfcf875#7
disjoint with: http://lodlaundromat.org/.well-known/genid/9d396f826af70bb26e6c953fbd3fce0b#5
type: Class
subclass of: Thing
disjoint with: http://lodlaundromat.org/.well-known/genid/9d396f826af70bb26e6c953fbd3fce0b#16
subclass of: http://lodlaundromat.org/.well-known/genid/5432219778cf6f0499743510fcfcf875#4
disjoint with: http://lodlaundromat.org/.well-known/genid/9d396f826af70bb26e6c953fbd3fce0b#10
subclass of: (foaf) Organization
comment: An organization that provides funding for projects, often in the form of grants awarded on the basis of competitive application.

company
subclass of: http://lodlaundromat.org/.well-known/genid/9d396f826af70bb26e6c953fbd3fce0b#9
subclass of: http://lodlaundromat.org/.well-known/genid/9d396f826af70bb26e6c953fbd3fce0b#13
subclass of: http://lodlaundromat.org/.well-known/genid/5432219778cf6f0499743510fcfcf875#4
disjoint with: (foaf) OnlineAccount
subclass of: http://lodlaundromat.org/.well-known/genid/9d396f826af70bb26e6c953fbd3fce0b#6
subclass of: http://lodlaundromat.org/.well-known/genid/9d396f826af70bb26e6c953fbd3fce0b#1
disjoint with: http://lodlaundromat.org/.well-known/genid/9d396f826af70bb26e6c953fbd3fce0b#10
subclass of: Thing
disjoint with: http://lodlaundromat.org/.well-known/genid/9d396f826af70bb26e6c953fbd3fce0b#16
subclass of: http://lodlaundromat.org/.well-known/genid/5432219778cf6f0499743510fcfcf875#1
type: Class
disjoint with: (foaf) Group
subclass of: http://lodlaundromat.org/.well-known/genid/9d396f826af70bb26e6c953fbd3fce0b#23
disjoint with: (foaf) Document
disjoint with: http://lodlaundromat.org/.well-known/genid/9d396f826af70bb26e6c953fbd3fce0b#17
disjoint with: (foaf) Image
disjoint with: (foaf) PersonalProfileDocument
disjoint with: research group
subclass of: http://lodlaundromat.org/.well-known/genid/5432219778cf6f0499743510fcfcf875#7
disjoint with: (foaf) Person
subclass of: http://lodlaundromat.org/.well-known/genid/9d396f826af70bb26e6c953fbd3fce0b#18
disjoint with: (foaf) Project
subclass of: (foaf) Agent
disjoint with: Nothing
disjoint with: http://lodlaundromat.org/.well-known/genid/9d396f826af70bb26e6c953fbd3fce0b#5
subclass of: (foaf) Organization
disjoint with: http://lodlaundromat.org/.well-known/genid/9d396f826af70bb26e6c953fbd3fce0b#22
comment: A commercial company or business run for profit.

has output
sub property of: topObjectProperty
property disjoint with: bottomObjectProperty
inverse of: is output of
type: ObjectProperty
description: Domain and range constraints have been removed from this object property to permit it to be used in unforeseen ways.
comment: An object property linking an activity such as a project or endeavour to something that is created or produced as a result of that activity. Examples include a building created as a result of a building project, and a journal article published to describe the results of a research investigation.

has exchange rate
sub property of: topDataProperty
property disjoint with: bottomDataProperty
property disjoint with: has birth date
type: DatatypeProperty
comment: A data property specifying the currency exchange rate between two specified currencies.

has project identifier
sub property of: topDataProperty
property disjoint with: myersBriggs
property disjoint with: post-nominals
property disjoint with: family name initial
property disjoint with: plan
property disjoint with: name
property disjoint with: has name suffix
property disjoint with: has contact information
property disjoint with: sha1
property disjoint with: has headcount
property disjoint with: given name initial
property disjoint with: has customer number
property disjoint with: has organizational information
property disjoint with: aimChatID
property disjoint with: bottomDataProperty
property disjoint with: has supplier number
property disjoint with: has degrees
property disjoint with: has ORCID
property disjoint with: has birth date
sub property of: identifier
property disjoint with: has postal address line
property disjoint with: yahooChatID
property disjoint with: has alternate name
property disjoint with: geekcode
type: DatatypeProperty
property disjoint with: has job title
property disjoint with: has fax number
property disjoint with: has postal address
property disjoint with: title
property disjoint with: has qualification
property disjoint with: has personal identifier
property disjoint with: has funder identifer
property disjoint with: has expertise
property disjoint with: initials
property disjoint with: has familiar suffix
property disjoint with: birthday
property disjoint with: has phone number
property disjoint with: jabberID
property disjoint with: nick
property disjoint with: has information
type: AnnotationProperty
comment: A data property linking a project to an identifier for that project.
domain: (foaf) Project

has information
sub property of: topDataProperty
property disjoint with: bottomDataProperty
property disjoint with: has project identifier
property disjoint with: sha1
property disjoint with: has birth date
type: DatatypeProperty
comment: A data property linking an agent to information about that agent.
domain: (foaf) Agent

(foaf) Person
disjoint with: (foaf) Group
subclass of: http://lodlaundromat.org/.well-known/genid/5432219778cf6f0499743510fcfcf875#1
disjoint with: faculty
disjoint with: funding agency
disjoint with: (foaf) Document
disjoint with: host institution
disjoint with: Nothing
disjoint with: college
subclass of: http://lodlaundromat.org/.well-known/genid/9d396f826af70bb26e6c953fbd3fce0b#23
subclass of: http://lodlaundromat.org/.well-known/genid/9d396f826af70bb26e6c953fbd3fce0b#13
disjoint with: small to medium enterprise
disjoint with: division
disjoint with: research institute
subclass of: http://lodlaundromat.org/.well-known/genid/5432219778cf6f0499743510fcfcf875#7
subclass of: http://lodlaundromat.org/.well-known/genid/9d396f826af70bb26e6c953fbd3fce0b#18
subclass of: Thing
type: Class
disjoint with: (foaf) Image
disjoint with: department
disjoint with: (foaf) PersonalProfileDocument
disjoint with: (foaf) Organization
subclass of: (foaf) Agent
subclass of: http://lodlaundromat.org/.well-known/genid/9d396f826af70bb26e6c953fbd3fce0b#1
disjoint with: company
disjoint with: http://lodlaundromat.org/.well-known/genid/9d396f826af70bb26e6c953fbd3fce0b#16
disjoint with: http://lodlaundromat.org/.well-known/genid/9d396f826af70bb26e6c953fbd3fce0b#22
subclass of: http://lodlaundromat.org/.well-known/genid/5432219778cf6f0499743510fcfcf875#4
disjoint with: (foaf) Project
subclass of: http://lodlaundromat.org/.well-known/genid/9d396f826af70bb26e6c953fbd3fce0b#6
disjoint with: spin-off company
disjoint with: http://lodlaundromat.org/.well-known/genid/9d396f826af70bb26e6c953fbd3fce0b#10
disjoint with: research group
disjoint with: university
disjoint with: http://lodlaundromat.org/.well-known/genid/9d396f826af70bb26e6c953fbd3fce0b#5
disjoint with: (foaf) OnlineAccount
disjoint with: registration agency
disjoint with: http://lodlaundromat.org/.well-known/genid/9d396f826af70bb26e6c953fbd3fce0b#17
disjoint with: not-for-profit organization
disjoint with: government organization
disjoint with: registration authority
subclass of: http://lodlaundromat.org/.well-known/genid/9d396f826af70bb26e6c953fbd3fce0b#9
nsterm status: stable
comment: A person.

has deliverable
sub property of: topDataProperty
property disjoint with: bottomDataProperty
property disjoint with: has birth date
type: DatatypeProperty
comment: A data property that permits one to define a deliverable of a project.

conference fee
disjoint with: Nothing
subclass of: fee
subclass of: financial entity
subclass of: Thing
type: Class
comment: A fee paid to attend a conference.

donates
property disjoint with: thumbnail
property disjoint with: topic
property disjoint with: bottomObjectProperty
property disjoint with: depicts
inverse of: is donated by
property disjoint with: primaryTopic
sub property of: topObjectProperty
type: ObjectProperty
property disjoint with: maker
description: Range constraints have been removed from this object property to permit it to be used in unforeseen ways.
comment: An object property linking a benefactor to a gift.
domain: (foaf) Agent

non-staff costs
type: financial entity
type: budget category
type: Thing
type: NamedIndividual
comment: A budget category to cover all the costs associated with a project that do not involve the employment of staff by the institution, thus, for example, including consumables purchase, travel costs and consultancy fees, but excluding the salary, estates and indirect costs associated with the allocation of the PI's time to the project and the direct employment of a project manager.

has country code
sub property of: topDataProperty
sub property of: has code
property disjoint with: bottomDataProperty
property disjoint with: has birth date
type: DatatypeProperty
comment: A data property specifying the two-letter or three-letter upper-case country code used to identify a country (e.g. FR/FRA for France, DE/DEU for Germany) (see http://countrycode.org/).

A person who invests in novel enterprises.
type: (foaf) Agent
type: http://lodlaundromat.org/.well-known/genid/5432219778cf6f0499743510fcfcf875#1
type: http://lodlaundromat.org/.well-known/genid/5432219778cf6f0499743510fcfcf875#7
type: http://lodlaundromat.org/.well-known/genid/9d396f826af70bb26e6c953fbd3fce0b#13
type: (foaf) Person
type: http://lodlaundromat.org/.well-known/genid/9d396f826af70bb26e6c953fbd3fce0b#18
type: Thing
type: http://lodlaundromat.org/.well-known/genid/9d396f826af70bb26e6c953fbd3fce0b#9
type: http://lodlaundromat.org/.well-known/genid/9d396f826af70bb26e6c953fbd3fce0b#23
type: http://lodlaundromat.org/.well-known/genid/9d396f826af70bb26e6c953fbd3fce0b#1
type: http://lodlaundromat.org/.well-known/genid/9d396f826af70bb26e6c953fbd3fce0b#6
type: http://lodlaundromat.org/.well-known/genid/5432219778cf6f0499743510fcfcf875#4
type: NamedIndividual
label: entrepreneur

computational service
disjoint with: Nothing
subclass of: infrastructure entity
subclass of: service
subclass of: Thing
type: Class
comment: A service provided by a computer system.

scholarship
disjoint with: Nothing
type: Class
subclass of: stipend
subclass of: funding
subclass of: financial entity
subclass of: http://lodlaundromat.org/.well-known/genid/5432219778cf6f0499743510fcfcf875#1
subclass of: http://lodlaundromat.org/.well-known/genid/5432219778cf6f0499743510fcfcf875#7
subclass of: Thing
comment: A financial grant to a scholar to enable him/her to undertake advanced academic study.

college
subclass of: http://lodlaundromat.org/.well-known/genid/9d396f826af70bb26e6c953fbd3fce0b#13
subclass of: http://lodlaundromat.org/.well-known/genid/9d396f826af70bb26e6c953fbd3fce0b#1
disjoint with: http://lodlaundromat.org/.well-known/genid/9d396f826af70bb26e6c953fbd3fce0b#22
subclass of: http://lodlaundromat.org/.well-known/genid/9d396f826af70bb26e6c953fbd3fce0b#23
subclass of: (foaf) Organization
disjoint with: http://lodlaundromat.org/.well-known/genid/9d396f826af70bb26e6c953fbd3fce0b#17
subclass of: http://lodlaundromat.org/.well-known/genid/9d396f826af70bb26e6c953fbd3fce0b#9
disjoint with: (foaf) Image
disjoint with: http://lodlaundromat.org/.well-known/genid/9d396f826af70bb26e6c953fbd3fce0b#16
subclass of: http://lodlaundromat.org/.well-known/genid/5432219778cf6f0499743510fcfcf875#4
subclass of: http://lodlaundromat.org/.well-known/genid/9d396f826af70bb26e6c953fbd3fce0b#18
disjoint with: (foaf) Project
subclass of: http://lodlaundromat.org/.well-known/genid/9d396f826af70bb26e6c953fbd3fce0b#6
subclass of: (foaf) Agent
type: Class
disjoint with: Nothing
disjoint with: http://lodlaundromat.org/.well-known/genid/9d396f826af70bb26e6c953fbd3fce0b#5
disjoint with: (foaf) OnlineAccount
disjoint with: (foaf) PersonalProfileDocument
disjoint with: (foaf) Document
subclass of: http://lodlaundromat.org/.well-known/genid/5432219778cf6f0499743510fcfcf875#1
subclass of: http://lodlaundromat.org/.well-known/genid/5432219778cf6f0499743510fcfcf875#7
disjoint with: research group
subclass of: Thing
disjoint with: http://lodlaundromat.org/.well-known/genid/9d396f826af70bb26e6c953fbd3fce0b#10
disjoint with: (foaf) Group
disjoint with: (foaf) Person
comment: An academic organization that is either a small degree-giving university, or (in the OxBridge sense) an independent corporation of scholars within a larger university, providing undergraduate tuition and a social environment for its students and fellows.

business angel
type: http://lodlaundromat.org/.well-known/genid/9d396f826af70bb26e6c953fbd3fce0b#6
type: http://lodlaundromat.org/.well-known/genid/9d396f826af70bb26e6c953fbd3fce0b#13
type: http://lodlaundromat.org/.well-known/genid/9d396f826af70bb26e6c953fbd3fce0b#9
type: http://lodlaundromat.org/.well-known/genid/9d396f826af70bb26e6c953fbd3fce0b#1
type: (foaf) Person
type: http://lodlaundromat.org/.well-known/genid/9d396f826af70bb26e6c953fbd3fce0b#23
type: http://lodlaundromat.org/.well-known/genid/5432219778cf6f0499743510fcfcf875#4
type: Thing
type: (foaf) Agent
type: http://lodlaundromat.org/.well-known/genid/5432219778cf6f0499743510fcfcf875#1
type: http://lodlaundromat.org/.well-known/genid/9d396f826af70bb26e6c953fbd3fce0b#18
type: http://lodlaundromat.org/.well-known/genid/5432219778cf6f0499743510fcfcf875#7
type: NamedIndividual
comment: A person willing to invest in start-up companies.

budgeted amount
disjoint with: Nothing
subclass of: budget information
subclass of: financial entity
subclass of: Thing
type: Class
comment: The amount of money originally available to spend in a particular budget category.

(foaf) Project
disjoint with: purchaser
subclass of: http://lodlaundromat.org/.well-known/genid/9d396f826af70bb26e6c953fbd3fce0b#23
disjoint with: vendor
disjoint with: http://lodlaundromat.org/.well-known/genid/9d396f826af70bb26e6c953fbd3fce0b#10
disjoint with: division
disjoint with: (foaf) Document
disjoint with: Nothing
disjoint with: university
disjoint with: research institute
disjoint with: faculty
disjoint with: research group
disjoint with: owner
disjoint with: supplier
disjoint with: (foaf) Organization
subclass of: http://lodlaundromat.org/.well-known/genid/9d396f826af70bb26e6c953fbd3fce0b#5
disjoint with: registration authority
disjoint with: manufacturer
subclass of: http://lodlaundromat.org/.well-known/genid/9d396f826af70bb26e6c953fbd3fce0b#9
disjoint with: college
disjoint with: company
disjoint with: registration agency
disjoint with: (foaf) PersonalProfileDocument
disjoint with: http://lodlaundromat.org/.well-known/genid/9d396f826af70bb26e6c953fbd3fce0b#22
disjoint with: department
disjoint with: small to medium enterprise
disjoint with: (foaf) Image
subclass of: Thing
subclass of: http://lodlaundromat.org/.well-known/genid/9d396f826af70bb26e6c953fbd3fce0b#13
disjoint with: http://lodlaundromat.org/.well-known/genid/9d396f826af70bb26e6c953fbd3fce0b#17
disjoint with: (foaf) Group
subclass of: http://lodlaundromat.org/.well-known/genid/9d396f826af70bb26e6c953fbd3fce0b#16
disjoint with: spin-off company
disjoint with: not-for-profit organization
disjoint with: computational agent
disjoint with: government organization
subclass of: http://lodlaundromat.org/.well-known/genid/9d396f826af70bb26e6c953fbd3fce0b#18
disjoint with: (foaf) OnlineAccount
disjoint with: host institution
disjoint with: (foaf) Person
subclass of: http://lodlaundromat.org/.well-known/genid/9d396f826af70bb26e6c953fbd3fce0b#1
type: Class
disjoint with: funding agency
disjoint with: http://lodlaundromat.org/.well-known/genid/9d396f826af70bb26e6c953fbd3fce0b#6
disjoint with: (foaf) Agent
comment: In FRAPO, a project is an administrative entity that enables an endeavour such as a research investigation. A project relates to the administrative aspects of undertaking an endeavour, including the funding obtained, the people employed, and the management of the project in terms of deadlines and deliverables. In contrast, an endeavour such as a research investigation relate to the academic and practical aspects of undertaking that endeavour - thus for a research investigation: the research itself, including the hypotheses being investigated, the experiments being undertaken, the data being gathered and analysed, the interpretations being drawn from the data, and the results obtained.
nsterm status: unstable
label: project
description: Super-class of cerif:Project.
comment: A project (a collective endeavour of some kind).

sells to
inverse of: purchases from
property disjoint with: currentProject
sub property of: topObjectProperty
property disjoint with: isPrimaryTopicOf
property disjoint with: homepage
property disjoint with: phone
property disjoint with: mbox
property disjoint with: maker
property disjoint with: depicts
property disjoint with: weblog
property disjoint with: schoolHomepage
property disjoint with: workInfoHomepage
property disjoint with: img
property disjoint with: logo
property disjoint with: interest
property disjoint with: page
property disjoint with: primaryTopic
property disjoint with: thumbnail
property disjoint with: has curriculum vitae
property disjoint with: publications
property disjoint with: bottomObjectProperty
property disjoint with: depiction
property disjoint with: pastProject
type: ObjectProperty
property disjoint with: workplaceHomepage
property disjoint with: tipjar
property disjoint with: made
property disjoint with: topic
description: Domain and range constraints on this object property have been relaxed to permit it to be used in unforeseen ways.
comment: An object property relating a supplier to a purchaser to whom an entity is sold.
domain: (foaf) Agent
range: (foaf) Agent

government organization
subclass of: http://lodlaundromat.org/.well-known/genid/5432219778cf6f0499743510fcfcf875#4
disjoint with: (foaf) Project
disjoint with: (foaf) Image
subclass of: http://lodlaundromat.org/.well-known/genid/9d396f826af70bb26e6c953fbd3fce0b#18
disjoint with: http://lodlaundromat.org/.well-known/genid/9d396f826af70bb26e6c953fbd3fce0b#10
subclass of: http://lodlaundromat.org/.well-known/genid/9d396f826af70bb26e6c953fbd3fce0b#13
subclass of: http://lodlaundromat.org/.well-known/genid/9d396f826af70bb26e6c953fbd3fce0b#6
type: Class
disjoint with: Nothing
subclass of: http://lodlaundromat.org/.well-known/genid/9d396f826af70bb26e6c953fbd3fce0b#1
disjoint with: (foaf) Person
disjoint with: (foaf) Group
subclass of: (foaf) Organization
subclass of: http://lodlaundromat.org/.well-known/genid/5432219778cf6f0499743510fcfcf875#1
disjoint with: http://lodlaundromat.org/.well-known/genid/9d396f826af70bb26e6c953fbd3fce0b#17
subclass of: http://lodlaundromat.org/.well-known/genid/5432219778cf6f0499743510fcfcf875#7
subclass of: (foaf) Agent
disjoint with: (foaf) OnlineAccount
disjoint with: http://lodlaundromat.org/.well-known/genid/9d396f826af70bb26e6c953fbd3fce0b#16
disjoint with: (foaf) PersonalProfileDocument
disjoint with: research group
disjoint with: (foaf) Document
subclass of: Thing
subclass of: http://lodlaundromat.org/.well-known/genid/9d396f826af70bb26e6c953fbd3fce0b#9
subclass of: http://lodlaundromat.org/.well-known/genid/9d396f826af70bb26e6c953fbd3fce0b#23
disjoint with: http://lodlaundromat.org/.well-known/genid/9d396f826af70bb26e6c953fbd3fce0b#5
disjoint with: http://lodlaundromat.org/.well-known/genid/9d396f826af70bb26e6c953fbd3fce0b#22
comment: An organization that is part of, or funded by, central or local goverment.

has purchase order number
sub property of: identifier
sub property of: topDataProperty
property disjoint with: bottomDataProperty
property disjoint with: has birth date
type: DatatypeProperty
comment: A data property identifying an official purchase order issued by a purchasing agent to a supplier of goods or services, and used by the supplier to identify the order when delivering goods or submitting an invoice.
domain: purchase order

has decision date
type: DatatypeProperty
property disjoint with: has birth date
property disjoint with: has invoice date
property disjoint with: has award date
property disjoint with: birthday
sub property of: topDataProperty
property disjoint with: bottomDataProperty
type: FunctionalProperty
description: This same data property appears in FaBiO, the FRBR-aligned Bibliographic Ontology (http://purl.org/spar/fabio/).
comment: The date on which a particular action is or will be decided upon, or when an application, such as a grant application, is or will be approved or rejected. [See also frapo:hasAwardDate.]
range: dateTime
sub property of: date

estates costs
type: financial entity
type: budget category
type: Thing
type: NamedIndividual
comment: A budget category to cover the 'overhead' costs of maintaining the premises in which work is undertaken.

research group
subclass of: http://lodlaundromat.org/.well-known/genid/9d396f826af70bb26e6c953fbd3fce0b#23
disjoint with: http://lodlaundromat.org/.well-known/genid/9d396f826af70bb26e6c953fbd3fce0b#10
subclass of: (foaf) Group
disjoint with: (foaf) Person
disjoint with: research institute
disjoint with: company
disjoint with: division
disjoint with: http://lodlaundromat.org/.well-known/genid/9d396f826af70bb26e6c953fbd3fce0b#22
disjoint with: http://lodlaundromat.org/.well-known/genid/9d396f826af70bb26e6c953fbd3fce0b#16
disjoint with: not-for-profit organization
subclass of: http://lodlaundromat.org/.well-known/genid/5432219778cf6f0499743510fcfcf875#1
disjoint with: http://lodlaundromat.org/.well-known/genid/9d396f826af70bb26e6c953fbd3fce0b#5
disjoint with: (foaf) Image
type: Class
disjoint with: registration agency
subclass of: http://lodlaundromat.org/.well-known/genid/9d396f826af70bb26e6c953fbd3fce0b#6
disjoint with: (foaf) Organization
disjoint with: (foaf) PersonalProfileDocument
disjoint with: spin-off company
subclass of: http://lodlaundromat.org/.well-known/genid/5432219778cf6f0499743510fcfcf875#7
disjoint with: small to medium enterprise
subclass of: http://lodlaundromat.org/.well-known/genid/9d396f826af70bb26e6c953fbd3fce0b#18
disjoint with: Nothing
disjoint with: registration authority
disjoint with: funding agency
subclass of: Thing
disjoint with: department
disjoint with: http://lodlaundromat.org/.well-known/genid/9d396f826af70bb26e6c953fbd3fce0b#17
disjoint with: faculty
subclass of: http://lodlaundromat.org/.well-known/genid/9d396f826af70bb26e6c953fbd3fce0b#13
subclass of: (foaf) Agent
disjoint with: host institution
disjoint with: (foaf) Project
subclass of: http://lodlaundromat.org/.well-known/genid/9d396f826af70bb26e6c953fbd3fce0b#9
subclass of: http://lodlaundromat.org/.well-known/genid/5432219778cf6f0499743510fcfcf875#4
subclass of: http://lodlaundromat.org/.well-known/genid/9d396f826af70bb26e6c953fbd3fce0b#1
disjoint with: university
disjoint with: (foaf) OnlineAccount
disjoint with: college
disjoint with: (foaf) Document
disjoint with: government organization
comment: A group of people, usually within a university department or a research institute, and typically under a single group leader, dedicated to working together to undertake research on one or more topics. May also be called a research unit.

has ORCID
property disjoint with: has birth date
property disjoint with: bottomDataProperty
sub property of: identifier
sub property of: has information
sub property of: has contact information
property disjoint with: has funder identifer
sub property of: topDataProperty
sub property of: has personal identifier
type: DatatypeProperty
property disjoint with: sha1
property disjoint with: has project identifier
property disjoint with: has headcount
property disjoint with: has organizational information
description: owl:equivalentProperty <http://purl.org/spar/scoro/hasORCID> .
comment: A data property relating an individual to his/her Open Researcher and Contributor ID (ORCID), an alphanumeric identifier for individual scholars described at http://about.orcid.org/.

is manufactured by
property disjoint with: img
property disjoint with: bottomObjectProperty
property disjoint with: currentProject
property disjoint with: phone
property disjoint with: interest
property disjoint with: thumbnail
property disjoint with: pastProject
property disjoint with: depiction
property disjoint with: schoolHomepage
property disjoint with: workplaceHomepage
inverse of: manufactures
property disjoint with: has curriculum vitae
property disjoint with: made
property disjoint with: page
property disjoint with: isPrimaryTopicOf
property disjoint with: workInfoHomepage
type: ObjectProperty
sub property of: topObjectProperty
property disjoint with: mbox
property disjoint with: tipjar
property disjoint with: publications
property disjoint with: logo
property disjoint with: weblog
property disjoint with: homepage
comment: An object property relating a manufactured entity to its manufacturer.
range: manufacturer

legacy
subclass of: financial entity
disjoint with: Nothing
subclass of: gift
subclass of: http://lodlaundromat.org/.well-known/genid/5432219778cf6f0499743510fcfcf875#1
subclass of: http://lodlaundromat.org/.well-known/genid/5432219778cf6f0499743510fcfcf875#7
subclass of: funding
subclass of: Thing
type: Class
comment: A gift of money or property specified in the will of a person, that is made after that person's death.

deliverable
disjoint with: Nothing
subclass of: infrastructure entity
subclass of: output
subclass of: Thing
subclass of: equipment
type: Class
comment: A class defining a 'deliverable' of a project, i.e. something that the project set out to deliver, or succeeds in delivering.

owns
property disjoint with: bottomObjectProperty
type: ObjectProperty
property disjoint with: thumbnail
sub property of: topObjectProperty
inverse of: is owned by
property disjoint with: primaryTopic
property disjoint with: depicts
property disjoint with: maker
property disjoint with: topic
comment: An object property linking an agent to an entity owned by that agent.
domain: (foaf) Agent

has provenance
sub property of: topDataProperty
property disjoint with: bottomDataProperty
property disjoint with: has birth date
type: DatatypeProperty
comment: A data property that permits the provenance of an entity to be described.

enables
sub property of: topObjectProperty
property disjoint with: bottomObjectProperty
inverse of: is enabled by
type: ObjectProperty
description: Domain and range constraints have been removed from this object property to permit it to be used in unforeseen ways.
comment: An object property relating an entity to another entity that it enables, e.g. linking a project to an endeavour that the project enables.

university
disjoint with: (foaf) Image
subclass of: http://lodlaundromat.org/.well-known/genid/5432219778cf6f0499743510fcfcf875#4
disjoint with: research group
subclass of: http://lodlaundromat.org/.well-known/genid/9d396f826af70bb26e6c953fbd3fce0b#6
type: Class
disjoint with: (foaf) Document
disjoint with: (foaf) OnlineAccount
disjoint with: http://lodlaundromat.org/.well-known/genid/9d396f826af70bb26e6c953fbd3fce0b#17
disjoint with: (foaf) Group
disjoint with: http://lodlaundromat.org/.well-known/genid/9d396f826af70bb26e6c953fbd3fce0b#10
disjoint with: Nothing
subclass of: http://lodlaundromat.org/.well-known/genid/9d396f826af70bb26e6c953fbd3fce0b#1
disjoint with: http://lodlaundromat.org/.well-known/genid/9d396f826af70bb26e6c953fbd3fce0b#16
subclass of: http://lodlaundromat.org/.well-known/genid/5432219778cf6f0499743510fcfcf875#1
disjoint with: (foaf) Person
disjoint with: http://lodlaundromat.org/.well-known/genid/9d396f826af70bb26e6c953fbd3fce0b#5
disjoint with: (foaf) Project
subclass of: http://lodlaundromat.org/.well-known/genid/9d396f826af70bb26e6c953fbd3fce0b#23
subclass of: http://lodlaundromat.org/.well-known/genid/9d396f826af70bb26e6c953fbd3fce0b#9
disjoint with: http://lodlaundromat.org/.well-known/genid/9d396f826af70bb26e6c953fbd3fce0b#22
subclass of: (foaf) Agent
subclass of: (foaf) Organization
subclass of: http://lodlaundromat.org/.well-known/genid/9d396f826af70bb26e6c953fbd3fce0b#18
subclass of: Thing
subclass of: http://lodlaundromat.org/.well-known/genid/9d396f826af70bb26e6c953fbd3fce0b#13
disjoint with: (foaf) PersonalProfileDocument
subclass of: http://lodlaundromat.org/.well-known/genid/5432219778cf6f0499743510fcfcf875#7
comment: A university at which higher education and research is conducted.

has award date
property disjoint with: has dispatch date
property disjoint with: bottomDataProperty
property disjoint with: has temporal duration
property disjoint with: has start date
property disjoint with: has data of manufacture
property disjoint with: has quotation date
property disjoint with: has completion date
sub property of: topDataProperty
property disjoint with: has end date
type: DatatypeProperty
property disjoint with: has registration deadline
property disjoint with: has birth date
property disjoint with: has application deadline
property disjoint with: has delivery date
type: FunctionalProperty
property disjoint with: has creation date
property disjoint with: has purchase date
property disjoint with: has decision date
property disjoint with: has expiry date
comment: The date on which notification is given or received that something, for example a scholarship or a grant, has been awarded. [See also frapo:hasDecisionDate.]
range: date
sub property of: date

has qualification
property disjoint with: has organizational information
property disjoint with: bottomDataProperty
property disjoint with: has birth date
property disjoint with: sha1
property disjoint with: has funder identifer
type: DatatypeProperty
property disjoint with: has project identifier
sub property of: has contact information
property disjoint with: has headcount
sub property of: has information
sub property of: topDataProperty
comment: A data property permitting specification of the qualification held by a person.

has catalog number
sub property of: identifier
sub property of: topDataProperty
property disjoint with: bottomDataProperty
property disjoint with: has birth date
type: DatatypeProperty
comment: A data property linking something to its catalog number.

(foaf) Image
disjoint with: (foaf) Organization
disjoint with: (foaf) Agent
disjoint with: http://lodlaundromat.org/.well-known/genid/9d396f826af70bb26e6c953fbd3fce0b#17
subclass of: http://lodlaundromat.org/.well-known/genid/9d396f826af70bb26e6c953fbd3fce0b#10
disjoint with: Nothing
disjoint with: spin-off company
disjoint with: computational agent
disjoint with: http://lodlaundromat.org/.well-known/genid/9d396f826af70bb26e6c953fbd3fce0b#6
subclass of: (foaf) Document
disjoint with: host institution
subclass of: http://lodlaundromat.org/.well-known/genid/9d396f826af70bb26e6c953fbd3fce0b#16
disjoint with: research institute
disjoint with: registration agency
disjoint with: college
disjoint with: (foaf) Group
disjoint with: manufacturer
disjoint with: university
subclass of: http://lodlaundromat.org/.well-known/genid/9d396f826af70bb26e6c953fbd3fce0b#5
subclass of: http://lodlaundromat.org/.well-known/genid/9d396f826af70bb26e6c953fbd3fce0b#1
disjoint with: owner
disjoint with: vendor
disjoint with: (foaf) OnlineAccount
disjoint with: supplier
disjoint with: not-for-profit organization
disjoint with: (foaf) Project
disjoint with: http://lodlaundromat.org/.well-known/genid/9d396f826af70bb26e6c953fbd3fce0b#13
disjoint with: registration authority
disjoint with: faculty
disjoint with: department
disjoint with: small to medium enterprise
disjoint with: http://lodlaundromat.org/.well-known/genid/9d396f826af70bb26e6c953fbd3fce0b#22
disjoint with: purchaser
subclass of: Thing
type: Class
subclass of: http://lodlaundromat.org/.well-known/genid/9d396f826af70bb26e6c953fbd3fce0b#23
disjoint with: funding agency
disjoint with: (foaf) Person
disjoint with: (foaf) PersonalProfileDocument
disjoint with: division
disjoint with: http://lodlaundromat.org/.well-known/genid/9d396f826af70bb26e6c953fbd3fce0b#9
disjoint with: company
disjoint with: research group
subclass of: http://lodlaundromat.org/.well-known/genid/9d396f826af70bb26e6c953fbd3fce0b#18
disjoint with: government organization
nsterm status: testing
comment: An image.

funded
type: Thing
type: status
type: NamedIndividual
comment: The status of something such as an investigation or a project as being funded.

collaborates with
property disjoint with: pastProject
sub property of: topObjectProperty
property disjoint with: interest
property disjoint with: thumbnail
property disjoint with: made
property disjoint with: publications
property disjoint with: depicts
property disjoint with: workInfoHomepage
property disjoint with: schoolHomepage
type: SymmetricProperty
property disjoint with: maker
property disjoint with: depiction
property disjoint with: homepage
property disjoint with: bottomObjectProperty
property disjoint with: logo
property disjoint with: weblog
property disjoint with: topic
type: ObjectProperty
property disjoint with: workplaceHomepage
property disjoint with: isPrimaryTopicOf
property disjoint with: tipjar
property disjoint with: mbox
property disjoint with: img
property disjoint with: page
property disjoint with: currentProject
property disjoint with: has curriculum vitae
property disjoint with: primaryTopic
property disjoint with: phone
comment: An object property linking agents, for example different organizations, or people typically from different groups or organizations, that work together on a common task, project or endeavour, or towards a common goal.
domain: (foaf) Agent
range: (foaf) Agent

initials
sub property of: topDataProperty
property disjoint with: bottomDataProperty
type: DatatypeProperty
sub property of: has contact information
sub property of: has information
property disjoint with: has project identifier
property disjoint with: has birth date
property disjoint with: has funder identifer
property disjoint with: has organizational information
property disjoint with: sha1
property disjoint with: has headcount
comment: A data property permitting specification of the initial(s) of a person's name.

purchase
disjoint with: Nothing
subclass of: financial entity
subclass of: Thing
type: Class
comment: The payment for obtaining something, for example property, goods or services.

is applied for by
property disjoint with: publications
property disjoint with: isPrimaryTopicOf
type: ObjectProperty
property disjoint with: interest
property disjoint with: phone
property disjoint with: weblog
property disjoint with: bottomObjectProperty
property disjoint with: depiction
sub property of: topObjectProperty
property disjoint with: mbox
property disjoint with: made
property disjoint with: homepage
property disjoint with: workInfoHomepage
property disjoint with: workplaceHomepage
property disjoint with: pastProject
property disjoint with: logo
property disjoint with: thumbnail
inverse of: applies for
property disjoint with: has curriculum vitae
property disjoint with: img
property disjoint with: currentProject
property disjoint with: tipjar
property disjoint with: schoolHomepage
property disjoint with: page
comment: An object property linking something applied for to the agent making the application.
range: (foaf) Agent

owns IPR of
property disjoint with: primaryTopic
property disjoint with: maker
type: ObjectProperty
property disjoint with: topic
property disjoint with: bottomObjectProperty
inverse of: has IPR owner
property disjoint with: depicts
property disjoint with: thumbnail
sub property of: owns
sub property of: topObjectProperty
comment: An object property linking an agent who owns IPR arising from or relating to an entity to that entity.
domain: (foaf) Agent

manufactures
property disjoint with: primaryTopic
property disjoint with: bottomObjectProperty
property disjoint with: topic
property disjoint with: thumbnail
property disjoint with: depicts
inverse of: is manufactured by
type: ObjectProperty
sub property of: topObjectProperty
property disjoint with: maker
comment: An object property relating a manufacturer to a manufactured entity.
domain: manufacturer

has delivery date
sub property of: topDataProperty
property disjoint with: has award date
property disjoint with: bottomDataProperty
property disjoint with: has invoice date
property disjoint with: has birth date
property disjoint with: birthday
type: DatatypeProperty
comment: The date on which something is delivered, or is due to be delivered.
range: dateTime
sub property of: date

awards
property disjoint with: bottomObjectProperty
property disjoint with: depicts
type: InverseFunctionalProperty
property disjoint with: maker
type: ObjectProperty
inverse of: is awarded by
property disjoint with: primaryTopic
sub property of: topObjectProperty
property disjoint with: topic
property disjoint with: thumbnail
comment: An object property linking an agent to something the agent awards, for example linking a funding agency to a grant, a university to a degree, or an organization to a prize.
domain: (foaf) Agent

(foaf) Document
disjoint with: owner
disjoint with: (foaf) Group
disjoint with: Nothing
type: Class
disjoint with: department
disjoint with: http://lodlaundromat.org/.well-known/genid/9d396f826af70bb26e6c953fbd3fce0b#22
disjoint with: http://lodlaundromat.org/.well-known/genid/9d396f826af70bb26e6c953fbd3fce0b#13
disjoint with: research group
disjoint with: government organization
disjoint with: (foaf) Project
disjoint with: registration agency
disjoint with: http://lodlaundromat.org/.well-known/genid/9d396f826af70bb26e6c953fbd3fce0b#9
disjoint with: registration authority
disjoint with: http://lodlaundromat.org/.well-known/genid/9d396f826af70bb26e6c953fbd3fce0b#6
disjoint with: http://lodlaundromat.org/.well-known/genid/9d396f826af70bb26e6c953fbd3fce0b#17
disjoint with: funding agency
subclass of: Thing
disjoint with: college
disjoint with: university
subclass of: http://lodlaundromat.org/.well-known/genid/9d396f826af70bb26e6c953fbd3fce0b#18
disjoint with: host institution
disjoint with: not-for-profit organization
subclass of: http://lodlaundromat.org/.well-known/genid/9d396f826af70bb26e6c953fbd3fce0b#23
disjoint with: computational agent
disjoint with: manufacturer
disjoint with: (foaf) Agent
disjoint with: supplier
disjoint with: (foaf) Person
subclass of: http://lodlaundromat.org/.well-known/genid/9d396f826af70bb26e6c953fbd3fce0b#5
subclass of: http://lodlaundromat.org/.well-known/genid/9d396f826af70bb26e6c953fbd3fce0b#10
disjoint with: purchaser
subclass of: http://lodlaundromat.org/.well-known/genid/9d396f826af70bb26e6c953fbd3fce0b#16
disjoint with: (foaf) OnlineAccount
disjoint with: small to medium enterprise
disjoint with: spin-off company
disjoint with: division
disjoint with: company
disjoint with: research institute
disjoint with: (foaf) Organization
disjoint with: vendor
disjoint with: faculty
subclass of: http://lodlaundromat.org/.well-known/genid/9d396f826af70bb26e6c953fbd3fce0b#1
comment: A document.
description: Ontology terms and definitions for many documents relevant to FRAPO are given as 'Expression' classes in FaBiO, the FRBR-aligned Bibliographic Ontology, e.g. fabio:CallForApplications, fabio:DataManagementPlan, fabio:GrantApplicationDocument, fabio:ProjectPlan. Others are given as sub-classes of this class.
nsterm status: testing

has call identifier
sub property of: identifier
sub property of: topDataProperty
property disjoint with: bottomDataProperty
property disjoint with: has birth date
type: DatatypeProperty
comment: A data property specifying the identifying number of a call for applications issued by a funding agency.

account
disjoint with: Nothing
subclass of: financial entity
subclass of: Thing
type: Class
comment: A mechanism for administering money, typically owned by an agent and dedicated to a particular purpose, for example the equipment account of a university department, to be used only for the purchase or maintenance of items of equipment.

computational agent
disjoint with: http://lodlaundromat.org/.well-known/genid/9d396f826af70bb26e6c953fbd3fce0b#17
subclass of: http://lodlaundromat.org/.well-known/genid/9d396f826af70bb26e6c953fbd3fce0b#13
type: Class
subclass of: http://lodlaundromat.org/.well-known/genid/9d396f826af70bb26e6c953fbd3fce0b#9
disjoint with: (foaf) Image
subclass of: Thing
subclass of: http://lodlaundromat.org/.well-known/genid/5432219778cf6f0499743510fcfcf875#1
disjoint with: (foaf) PersonalProfileDocument
subclass of: http://lodlaundromat.org/.well-known/genid/9d396f826af70bb26e6c953fbd3fce0b#23
subclass of: http://lodlaundromat.org/.well-known/genid/9d396f826af70bb26e6c953fbd3fce0b#6
disjoint with: (foaf) OnlineAccount
disjoint with: http://lodlaundromat.org/.well-known/genid/9d396f826af70bb26e6c953fbd3fce0b#22
subclass of: http://lodlaundromat.org/.well-known/genid/9d396f826af70bb26e6c953fbd3fce0b#18
disjoint with: Nothing
disjoint with: http://lodlaundromat.org/.well-known/genid/9d396f826af70bb26e6c953fbd3fce0b#10
disjoint with: (foaf) Document
subclass of: (foaf) Agent
disjoint with: (foaf) Project
subclass of: http://lodlaundromat.org/.well-known/genid/5432219778cf6f0499743510fcfcf875#4
disjoint with: http://lodlaundromat.org/.well-known/genid/9d396f826af70bb26e6c953fbd3fce0b#16
disjoint with: http://lodlaundromat.org/.well-known/genid/9d396f826af70bb26e6c953fbd3fce0b#5
subclass of: http://lodlaundromat.org/.well-known/genid/5432219778cf6f0499743510fcfcf875#7
subclass of: http://lodlaundromat.org/.well-known/genid/9d396f826af70bb26e6c953fbd3fce0b#1
comment: A computer system or software program whose action has an effect on external events, for example a laboratory robot that undertakes your experiments, or the financial control system that controls an institution's payrole, or that, following programmed business rules, prevents the principal investigator from placing an order for research equipment because there is insufficient money left in the project budget.

is supported by
sub property of: topObjectProperty
property disjoint with: bottomObjectProperty
inverse of: supports
type: ObjectProperty
description: This property is not intended for use to describe mechanical or physical support, as in 'The statue is supported by the plinth'.
comment: An object property linking something to an agent that provides funding or other support for it.
range: http://lodlaundromat.org/.well-known/genid/5432219778cf6f0499743510fcfcf875#1

accepted
type: Thing
type: status
type: NamedIndividual
comment: The status of something such as an application as having been accepted.

department
disjoint with: (foaf) Project
subclass of: http://lodlaundromat.org/.well-known/genid/5432219778cf6f0499743510fcfcf875#7
disjoint with: http://lodlaundromat.org/.well-known/genid/9d396f826af70bb26e6c953fbd3fce0b#5
disjoint with: Nothing
disjoint with: (foaf) Group
subclass of: (foaf) Organization
subclass of: http://lodlaundromat.org/.well-known/genid/9d396f826af70bb26e6c953fbd3fce0b#13
disjoint with: (foaf) PersonalProfileDocument
disjoint with: (foaf) OnlineAccount
type: Class
subclass of: http://lodlaundromat.org/.well-known/genid/9d396f826af70bb26e6c953fbd3fce0b#18
disjoint with: (foaf) Image
subclass of: http://lodlaundromat.org/.well-known/genid/9d396f826af70bb26e6c953fbd3fce0b#1
subclass of: http://lodlaundromat.org/.well-known/genid/5432219778cf6f0499743510fcfcf875#1
subclass of: http://lodlaundromat.org/.well-known/genid/9d396f826af70bb26e6c953fbd3fce0b#23
subclass of: http://lodlaundromat.org/.well-known/genid/5432219778cf6f0499743510fcfcf875#4
disjoint with: http://lodlaundromat.org/.well-known/genid/9d396f826af70bb26e6c953fbd3fce0b#22
subclass of: http://lodlaundromat.org/.well-known/genid/9d396f826af70bb26e6c953fbd3fce0b#9
subclass of: http://lodlaundromat.org/.well-known/genid/9d396f826af70bb26e6c953fbd3fce0b#6
disjoint with: (foaf) Person
subclass of: Thing
disjoint with: http://lodlaundromat.org/.well-known/genid/9d396f826af70bb26e6c953fbd3fce0b#10
disjoint with: research group
disjoint with: http://lodlaundromat.org/.well-known/genid/9d396f826af70bb26e6c953fbd3fce0b#16
subclass of: (foaf) Agent
disjoint with: http://lodlaundromat.org/.well-known/genid/9d396f826af70bb26e6c953fbd3fce0b#17
disjoint with: (foaf) Document
comment: A department or sub-section within a larger organization, for example a university academic department.

fellowship
type: Class
subclass of: funding
subclass of: stipend
subclass of: financial entity
subclass of: http://lodlaundromat.org/.well-known/genid/5432219778cf6f0499743510fcfcf875#7
subclass of: http://lodlaundromat.org/.well-known/genid/5432219778cf6f0499743510fcfcf875#1
disjoint with: Nothing
subclass of: Thing
comment: The stipend paid to a fellow in a college or university.

has postal address line
sub property of: topDataProperty
sub property of: has information
property disjoint with: bottomDataProperty
property disjoint with: has project identifier
property disjoint with: sha1
property disjoint with: has birth date
type: DatatypeProperty
comment: A data property permitting specification of a single line of a postal address.
domain: postal address

has job title
property disjoint with: has funder identifer
property disjoint with: bottomDataProperty
property disjoint with: sha1
sub property of: has contact information
sub property of: topDataProperty
type: DatatypeProperty
property disjoint with: has project identifier
property disjoint with: has headcount
property disjoint with: has birth date
property disjoint with: has organizational information
sub property of: has information
comment: A data property permitting specification of the job title held by a person, such as might appear next to the name in a directory or on a conference name badge. For example, the person's specific Job Title might be 'Linacre Professor of Zoology' or 'Regius Professor of Moral Philosophy'. This job title properly refers to the **role** held by that person (e.g. 'Head of Department'), which can be separately defined using SCoRO, the Scholarly Contributions and Roles Ontology (http://purl.org/spar/scoro/). [see scoro:withJobTitle].
domain: (foaf) Person

is evaluated by
property disjoint with: workplaceHomepage
property disjoint with: schoolHomepage
type: ObjectProperty
property disjoint with: depiction
property disjoint with: img
property disjoint with: thumbnail
property disjoint with: weblog
sub property of: topObjectProperty
property disjoint with: logo
property disjoint with: tipjar
property disjoint with: made
inverse of: evaluates
property disjoint with: isPrimaryTopicOf
property disjoint with: phone
property disjoint with: workInfoHomepage
property disjoint with: homepage
property disjoint with: currentProject
property disjoint with: page
property disjoint with: interest
property disjoint with: pastProject
property disjoint with: publications
property disjoint with: mbox
property disjoint with: has curriculum vitae
property disjoint with: bottomObjectProperty
comment: An object property linking an entity to an agent that evaluates it.
range: (foaf) Agent

division
subclass of: http://lodlaundromat.org/.well-known/genid/9d396f826af70bb26e6c953fbd3fce0b#13
subclass of: (foaf) Agent
disjoint with: (foaf) Project
subclass of: http://lodlaundromat.org/.well-known/genid/9d396f826af70bb26e6c953fbd3fce0b#18
subclass of: http://lodlaundromat.org/.well-known/genid/5432219778cf6f0499743510fcfcf875#7
subclass of: http://lodlaundromat.org/.well-known/genid/5432219778cf6f0499743510fcfcf875#1
disjoint with: http://lodlaundromat.org/.well-known/genid/9d396f826af70bb26e6c953fbd3fce0b#16
disjoint with: Nothing
subclass of: (foaf) Organization
disjoint with: (foaf) Document
type: Class
disjoint with: research group
disjoint with: (foaf) Group
disjoint with: (foaf) OnlineAccount
subclass of: http://lodlaundromat.org/.well-known/genid/9d396f826af70bb26e6c953fbd3fce0b#23
disjoint with: http://lodlaundromat.org/.well-known/genid/9d396f826af70bb26e6c953fbd3fce0b#22
subclass of: http://lodlaundromat.org/.well-known/genid/5432219778cf6f0499743510fcfcf875#4
subclass of: Thing
disjoint with: http://lodlaundromat.org/.well-known/genid/9d396f826af70bb26e6c953fbd3fce0b#5
disjoint with: http://lodlaundromat.org/.well-known/genid/9d396f826af70bb26e6c953fbd3fce0b#10
disjoint with: (foaf) Person
disjoint with: (foaf) PersonalProfileDocument
subclass of: http://lodlaundromat.org/.well-known/genid/9d396f826af70bb26e6c953fbd3fce0b#9
subclass of: http://lodlaundromat.org/.well-known/genid/9d396f826af70bb26e6c953fbd3fce0b#1
disjoint with: (foaf) Image
disjoint with: http://lodlaundromat.org/.well-known/genid/9d396f826af70bb26e6c953fbd3fce0b#17
subclass of: http://lodlaundromat.org/.well-known/genid/9d396f826af70bb26e6c953fbd3fce0b#6
comment: A grouping of similar departments within a larger organization. In the university context, also known as a school or a faculty, for example the Humanities Division, the Mathematics Faculty, or the School of Medicine.

has organizational information
property disjoint with: jabberID
property disjoint with: has personal identifier
property disjoint with: has contact information
property disjoint with: has job title
property disjoint with: post-nominals
property disjoint with: has project identifier
property disjoint with: has degrees
sub property of: topDataProperty
property disjoint with: birthday
property disjoint with: given name initial
type: DatatypeProperty
property disjoint with: family name initial
property disjoint with: plan
property disjoint with: bottomDataProperty
sub property of: has information
property disjoint with: aimChatID
property disjoint with: sha1
property disjoint with: has alternate name
property disjoint with: nick
property disjoint with: myersBriggs
property disjoint with: has name suffix
property disjoint with: name
property disjoint with: has familiar suffix
property disjoint with: geekcode
property disjoint with: yahooChatID
property disjoint with: initials
property disjoint with: title
property disjoint with: has ORCID
property disjoint with: has qualification
property disjoint with: has birth date
comment: It describes information about the organization.
domain: (foaf) Organization

quotation
disjoint with: Nothing
subclass of: financial entity
subclass of: Thing
type: Class
comment: A formal statement of promise (usually provided in response to a request for quotation) by potential supplier to supply goods or services at specified prices and within a specified period. Acceptance of the quotation by the buyer constitutes an agreement binding on both parties. (Shortened from http://www.businessdictionary.com/definition/quotation.html).

repository
disjoint with: Nothing
subclass of: infrastructure entity
subclass of: facility
subclass of: Thing
type: Class
description: May also be described as an archive, or as a database.
comment: A facility in which entities can be deposited for long-term preservation.

registration agency
subclass of: http://lodlaundromat.org/.well-known/genid/5432219778cf6f0499743510fcfcf875#4
subclass of: (foaf) Agent
subclass of: http://lodlaundromat.org/.well-known/genid/9d396f826af70bb26e6c953fbd3fce0b#13
disjoint with: (foaf) Image
disjoint with: (foaf) Document
disjoint with: http://lodlaundromat.org/.well-known/genid/9d396f826af70bb26e6c953fbd3fce0b#5
disjoint with: Nothing
disjoint with: (foaf) Group
subclass of: http://lodlaundromat.org/.well-known/genid/9d396f826af70bb26e6c953fbd3fce0b#6
disjoint with: http://lodlaundromat.org/.well-known/genid/9d396f826af70bb26e6c953fbd3fce0b#10
disjoint with: (foaf) Person
subclass of: Thing
subclass of: http://lodlaundromat.org/.well-known/genid/5432219778cf6f0499743510fcfcf875#7
subclass of: http://lodlaundromat.org/.well-known/genid/9d396f826af70bb26e6c953fbd3fce0b#1
subclass of: http://lodlaundromat.org/.well-known/genid/5432219778cf6f0499743510fcfcf875#1
disjoint with: research group
disjoint with: http://lodlaundromat.org/.well-known/genid/9d396f826af70bb26e6c953fbd3fce0b#17
disjoint with: (foaf) OnlineAccount
subclass of: (foaf) Organization
disjoint with: (foaf) PersonalProfileDocument
disjoint with: (foaf) Project
type: Class
disjoint with: http://lodlaundromat.org/.well-known/genid/9d396f826af70bb26e6c953fbd3fce0b#22
disjoint with: http://lodlaundromat.org/.well-known/genid/9d396f826af70bb26e6c953fbd3fce0b#16
subclass of: http://lodlaundromat.org/.well-known/genid/9d396f826af70bb26e6c953fbd3fce0b#9
subclass of: http://lodlaundromat.org/.well-known/genid/9d396f826af70bb26e6c953fbd3fce0b#23
subclass of: http://lodlaundromat.org/.well-known/genid/9d396f826af70bb26e6c953fbd3fce0b#18
comment: An organization that acts to register things. For example, CrossRef is a registration agency for DOIs relating to documents, while DataCite is a registration agency for DOIs relating to datasets.

other costs
type: financial entity
type: budget category
type: Thing
type: NamedIndividual
comment: A budget category to cover costs not covered in other budget categories.

directly incurred costs
type: financial entity
type: budget category
type: Thing
description: Also known as the 'direct costs' of the project.
type: NamedIndividual
comment: A budget category to cover all costs directly incurred because of a legitimate expenditure on a project, for example the purchase of reagents or the employment of a post-doctoral researcher.

gift
disjoint with: Nothing
subclass of: financial entity
subclass of: funding
subclass of: Thing
subclass of: http://lodlaundromat.org/.well-known/genid/5432219778cf6f0499743510fcfcf875#7
subclass of: http://lodlaundromat.org/.well-known/genid/5432219778cf6f0499743510fcfcf875#1
type: Class
comment: A gift, donation, benefaction or legacy, typically of money.

was purchased by
property disjoint with: homepage
property disjoint with: thumbnail
property disjoint with: interest
property disjoint with: has curriculum vitae
property disjoint with: page
property disjoint with: phone
property disjoint with: publications
property disjoint with: currentProject
property disjoint with: depiction
property disjoint with: mbox
type: ObjectProperty
property disjoint with: bottomObjectProperty
property disjoint with: tipjar
property disjoint with: pastProject
property disjoint with: isPrimaryTopicOf
sub property of: topObjectProperty
property disjoint with: made
property disjoint with: weblog
property disjoint with: workInfoHomepage
inverse of: purchases
property disjoint with: img
property disjoint with: workplaceHomepage
property disjoint with: schoolHomepage
property disjoint with: logo
description: Domain constraints have been removed from this object property to permit it to be used in unforeseen ways.
comment: An object property relating a purchased entity to its purchaser.
range: (foaf) Agent

has end date
type: FunctionalProperty
property disjoint with: has invoice date
property disjoint with: has birth date
property disjoint with: birthday
sub property of: topDataProperty
type: DatatypeProperty
property disjoint with: has award date
property disjoint with: bottomDataProperty
comment: A data property linking something such as a project to its end date.
range: dateTime
sub property of: date

faculty
subclass of: http://lodlaundromat.org/.well-known/genid/5432219778cf6f0499743510fcfcf875#1
subclass of: http://lodlaundromat.org/.well-known/genid/9d396f826af70bb26e6c953fbd3fce0b#18
disjoint with: (foaf) Document
subclass of: http://lodlaundromat.org/.well-known/genid/9d396f826af70bb26e6c953fbd3fce0b#9
disjoint with: http://lodlaundromat.org/.well-known/genid/9d396f826af70bb26e6c953fbd3fce0b#22
disjoint with: http://lodlaundromat.org/.well-known/genid/9d396f826af70bb26e6c953fbd3fce0b#16
disjoint with: (foaf) Group
disjoint with: Nothing
disjoint with: (foaf) Project
subclass of: http://lodlaundromat.org/.well-known/genid/9d396f826af70bb26e6c953fbd3fce0b#23
disjoint with: (foaf) OnlineAccount
subclass of: Thing
type: Class
subclass of: http://lodlaundromat.org/.well-known/genid/9d396f826af70bb26e6c953fbd3fce0b#1
disjoint with: http://lodlaundromat.org/.well-known/genid/9d396f826af70bb26e6c953fbd3fce0b#17
disjoint with: http://lodlaundromat.org/.well-known/genid/9d396f826af70bb26e6c953fbd3fce0b#5
disjoint with: (foaf) Image
disjoint with: research group
subclass of: http://lodlaundromat.org/.well-known/genid/9d396f826af70bb26e6c953fbd3fce0b#13
disjoint with: (foaf) Person
subclass of: http://lodlaundromat.org/.well-known/genid/5432219778cf6f0499743510fcfcf875#4
disjoint with: http://lodlaundromat.org/.well-known/genid/9d396f826af70bb26e6c953fbd3fce0b#10
disjoint with: (foaf) PersonalProfileDocument
subclass of: http://lodlaundromat.org/.well-known/genid/9d396f826af70bb26e6c953fbd3fce0b#6
subclass of: http://lodlaundromat.org/.well-known/genid/5432219778cf6f0499743510fcfcf875#7
subclass of: division
subclass of: (foaf) Organization
subclass of: (foaf) Agent
comment: A grouping of similar departments within a university context, also known as a school or a division, for example the Humanities Division, the Mathematics Faculty, or the School of Medicine.

has model number
sub property of: identifier
sub property of: topDataProperty
property disjoint with: bottomDataProperty
property disjoint with: has birth date
type: DatatypeProperty
comment: A data property linking something, for example a piece of equipment, to its model number.

is submitted by
sub property of: topObjectProperty
property disjoint with: thumbnail
property disjoint with: tipjar
property disjoint with: publications
property disjoint with: weblog
property disjoint with: workInfoHomepage
property disjoint with: bottomObjectProperty
property disjoint with: currentProject
property disjoint with: has curriculum vitae
property disjoint with: img
property disjoint with: workplaceHomepage
property disjoint with: mbox
property disjoint with: phone
property disjoint with: isPrimaryTopicOf
property disjoint with: logo
property disjoint with: interest
property disjoint with: depiction
property disjoint with: homepage
property disjoint with: schoolHomepage
property disjoint with: pastProject
type: ObjectProperty
inverse of: submits
property disjoint with: made
property disjoint with: page
comment: An object property linking an entity that is submitted (to some third party) to the agent who submits it.
range: (foaf) Agent

funding programme
disjoint with: Nothing
subclass of: Thing
type: Class
comment: A programme of related funded activities or projects, typically established by a funding agency. Often associated with publication of a call for applications (fabio:CallForApplications).

uses facility
sub property of: topObjectProperty
property disjoint with: bottomObjectProperty
type: ObjectProperty
description: Domain constraints have been removed from this object property to permit it to be used in unforeseen ways.
comment: An object property linking an activity such as an expedition, a research project or an investigation, to a facility employed in that activity.
range: facility

software costs
type: financial entity
type: budget category
type: Thing
type: NamedIndividual
comment: A budget category to cover the costs of software licenses required by a project.

has data of manufacture
type: DatatypeProperty
property disjoint with: has award date
type: FunctionalProperty
property disjoint with: birthday
property disjoint with: bottomDataProperty
property disjoint with: has invoice date
property disjoint with: has birth date
sub property of: topDataProperty
comment: A data property linking something to its date of manufacture.
range: dateTime
sub property of: date

has alternate name
property disjoint with: has funder identifer
property disjoint with: bottomDataProperty
property disjoint with: has project identifier
sub property of: topDataProperty
property disjoint with: has birth date
type: DatatypeProperty
property disjoint with: has headcount
sub property of: has contact information
property disjoint with: has organizational information
sub property of: has information
property disjoint with: sha1
comment: An alternative name that a person uses for professional purposes, for example the pen name of an author, or a married woman's maiden name used as her professional name.

application
disjoint with: Nothing
subclass of: Thing
type: Class
comment: The activity of making an application, for example for a job, or for funding.

(foaf) Group
subclass of: http://lodlaundromat.org/.well-known/genid/9d396f826af70bb26e6c953fbd3fce0b#9
disjoint with: division
disjoint with: registration agency
disjoint with: funding agency
disjoint with: not-for-profit organization
disjoint with: spin-off company
disjoint with: http://lodlaundromat.org/.well-known/genid/9d396f826af70bb26e6c953fbd3fce0b#10
type: Class
disjoint with: host institution
disjoint with: Nothing
disjoint with: (foaf) Person
disjoint with: (foaf) Document
subclass of: http://lodlaundromat.org/.well-known/genid/5432219778cf6f0499743510fcfcf875#4
disjoint with: company
subclass of: http://lodlaundromat.org/.well-known/genid/9d396f826af70bb26e6c953fbd3fce0b#1
subclass of: http://lodlaundromat.org/.well-known/genid/5432219778cf6f0499743510fcfcf875#7
disjoint with: government organization
disjoint with: faculty
disjoint with: (foaf) Image
subclass of: http://lodlaundromat.org/.well-known/genid/9d396f826af70bb26e6c953fbd3fce0b#13
disjoint with: university
disjoint with: (foaf) OnlineAccount
disjoint with: registration authority
disjoint with: (foaf) Organization
disjoint with: http://lodlaundromat.org/.well-known/genid/9d396f826af70bb26e6c953fbd3fce0b#17
subclass of: (foaf) Agent
disjoint with: http://lodlaundromat.org/.well-known/genid/9d396f826af70bb26e6c953fbd3fce0b#5
disjoint with: (foaf) Project
disjoint with: college
subclass of: http://lodlaundromat.org/.well-known/genid/9d396f826af70bb26e6c953fbd3fce0b#6
subclass of: Thing
subclass of: http://lodlaundromat.org/.well-known/genid/5432219778cf6f0499743510fcfcf875#1
disjoint with: small to medium enterprise
disjoint with: http://lodlaundromat.org/.well-known/genid/9d396f826af70bb26e6c953fbd3fce0b#22
disjoint with: http://lodlaundromat.org/.well-known/genid/9d396f826af70bb26e6c953fbd3fce0b#16
subclass of: http://lodlaundromat.org/.well-known/genid/9d396f826af70bb26e6c953fbd3fce0b#18
disjoint with: (foaf) PersonalProfileDocument
disjoint with: research institute
subclass of: http://lodlaundromat.org/.well-known/genid/9d396f826af70bb26e6c953fbd3fce0b#23
disjoint with: department
nsterm status: unstable
comment: A class of Agents.

equipment
disjoint with: Nothing
subclass of: infrastructure entity
subclass of: Thing
type: Class
comment: An item of equipment or apparatus, or a laboratory instrument, for example a refrigerated centrifuge.

owner
disjoint with: Nothing
subclass of: Thing
subclass of: http://lodlaundromat.org/.well-known/genid/9d396f826af70bb26e6c953fbd3fce0b#9
disjoint with: (foaf) OnlineAccount
subclass of: (foaf) Agent
disjoint with: (foaf) Project
disjoint with: http://lodlaundromat.org/.well-known/genid/9d396f826af70bb26e6c953fbd3fce0b#16
disjoint with: http://lodlaundromat.org/.well-known/genid/9d396f826af70bb26e6c953fbd3fce0b#17
subclass of: http://lodlaundromat.org/.well-known/genid/9d396f826af70bb26e6c953fbd3fce0b#6
subclass of: http://lodlaundromat.org/.well-known/genid/9d396f826af70bb26e6c953fbd3fce0b#18
disjoint with: http://lodlaundromat.org/.well-known/genid/9d396f826af70bb26e6c953fbd3fce0b#5
subclass of: http://lodlaundromat.org/.well-known/genid/9d396f826af70bb26e6c953fbd3fce0b#1
subclass of: http://lodlaundromat.org/.well-known/genid/9d396f826af70bb26e6c953fbd3fce0b#13
disjoint with: http://lodlaundromat.org/.well-known/genid/9d396f826af70bb26e6c953fbd3fce0b#10
disjoint with: (foaf) PersonalProfileDocument
subclass of: http://lodlaundromat.org/.well-known/genid/9d396f826af70bb26e6c953fbd3fce0b#23
subclass of: http://lodlaundromat.org/.well-known/genid/5432219778cf6f0499743510fcfcf875#1
subclass of: http://lodlaundromat.org/.well-known/genid/5432219778cf6f0499743510fcfcf875#4
type: Class
disjoint with: (foaf) Document
disjoint with: (foaf) Image
subclass of: http://lodlaundromat.org/.well-known/genid/5432219778cf6f0499743510fcfcf875#7
disjoint with: http://lodlaundromat.org/.well-known/genid/9d396f826af70bb26e6c953fbd3fce0b#22
comment: The agent who owns an entity.

vendor
disjoint with: http://lodlaundromat.org/.well-known/genid/9d396f826af70bb26e6c953fbd3fce0b#5
subclass of: http://lodlaundromat.org/.well-known/genid/5432219778cf6f0499743510fcfcf875#7
disjoint with: http://lodlaundromat.org/.well-known/genid/9d396f826af70bb26e6c953fbd3fce0b#22
subclass of: (foaf) Agent
disjoint with: (foaf) Document
subclass of: http://lodlaundromat.org/.well-known/genid/9d396f826af70bb26e6c953fbd3fce0b#6
disjoint with: (foaf) OnlineAccount
subclass of: http://lodlaundromat.org/.well-known/genid/9d396f826af70bb26e6c953fbd3fce0b#18
subclass of: http://lodlaundromat.org/.well-known/genid/9d396f826af70bb26e6c953fbd3fce0b#23
type: Class
subclass of: supplier
subclass of: Thing
subclass of: http://lodlaundromat.org/.well-known/genid/9d396f826af70bb26e6c953fbd3fce0b#1
disjoint with: http://lodlaundromat.org/.well-known/genid/9d396f826af70bb26e6c953fbd3fce0b#10
subclass of: http://lodlaundromat.org/.well-known/genid/9d396f826af70bb26e6c953fbd3fce0b#13
disjoint with: http://lodlaundromat.org/.well-known/genid/9d396f826af70bb26e6c953fbd3fce0b#16
subclass of: http://lodlaundromat.org/.well-known/genid/5432219778cf6f0499743510fcfcf875#4
subclass of: http://lodlaundromat.org/.well-known/genid/9d396f826af70bb26e6c953fbd3fce0b#9
subclass of: http://lodlaundromat.org/.well-known/genid/5432219778cf6f0499743510fcfcf875#1
disjoint with: (foaf) Project
disjoint with: (foaf) PersonalProfileDocument
disjoint with: http://lodlaundromat.org/.well-known/genid/9d396f826af70bb26e6c953fbd3fce0b#17
disjoint with: Nothing
disjoint with: (foaf) Image
comment: An agent who supplies goods or services in exchange for payment, in response to receipt of payment or of an official purchase order from a purchaser that is responded to by submission of an invoice for what is supplied.

manufacturer
subclass of: http://lodlaundromat.org/.well-known/genid/9d396f826af70bb26e6c953fbd3fce0b#1
disjoint with: http://lodlaundromat.org/.well-known/genid/9d396f826af70bb26e6c953fbd3fce0b#17
disjoint with: (foaf) Project
disjoint with: Nothing
subclass of: http://lodlaundromat.org/.well-known/genid/5432219778cf6f0499743510fcfcf875#7
subclass of: http://lodlaundromat.org/.well-known/genid/5432219778cf6f0499743510fcfcf875#4
subclass of: http://lodlaundromat.org/.well-known/genid/9d396f826af70bb26e6c953fbd3fce0b#18
disjoint with: (foaf) Image
subclass of: http://lodlaundromat.org/.well-known/genid/9d396f826af70bb26e6c953fbd3fce0b#23
subclass of: Thing
disjoint with: (foaf) PersonalProfileDocument
disjoint with: http://lodlaundromat.org/.well-known/genid/9d396f826af70bb26e6c953fbd3fce0b#5
subclass of: (foaf) Agent
type: Class
subclass of: http://lodlaundromat.org/.well-known/genid/9d396f826af70bb26e6c953fbd3fce0b#13
subclass of: http://lodlaundromat.org/.well-known/genid/5432219778cf6f0499743510fcfcf875#1
subclass of: http://lodlaundromat.org/.well-known/genid/9d396f826af70bb26e6c953fbd3fce0b#9
disjoint with: (foaf) Document
subclass of: http://lodlaundromat.org/.well-known/genid/9d396f826af70bb26e6c953fbd3fce0b#6
disjoint with: (foaf) OnlineAccount
disjoint with: http://lodlaundromat.org/.well-known/genid/9d396f826af70bb26e6c953fbd3fce0b#16
disjoint with: http://lodlaundromat.org/.well-known/genid/9d396f826af70bb26e6c953fbd3fce0b#22
disjoint with: http://lodlaundromat.org/.well-known/genid/9d396f826af70bb26e6c953fbd3fce0b#10
comment: An agent who manufactures goods or equipment.

funding application
disjoint with: Nothing
subclass of: application
subclass of: Thing
type: Class
description: For the documents supporting a funding application, use fabio:GrantApplicationDocument and fabio:CaseForSupportDocument.
comment: The activity of applying for funding.

has funding agency
property disjoint with: workplaceHomepage
property disjoint with: phone
property disjoint with: interest
inverse of: is funding agency for
property disjoint with: currentProject
property disjoint with: depiction
property disjoint with: workInfoHomepage
sub property of: is supported by
property disjoint with: schoolHomepage
property disjoint with: publications
property disjoint with: pastProject
property disjoint with: bottomObjectProperty
property disjoint with: tipjar
type: ObjectProperty
property disjoint with: knows
property disjoint with: has curriculum vitae
sub property of: topObjectProperty
property disjoint with: img
property disjoint with: weblog
property disjoint with: homepage
property disjoint with: page
property disjoint with: logo
property disjoint with: thumbnail
property disjoint with: isPrimaryTopicOf
property disjoint with: mbox
property disjoint with: made
comment: An object property linking something to a funding agency that provides funding for it.
range: funding agency

has supplier number
sub property of: identifier
sub property of: topDataProperty
property disjoint with: bottomDataProperty
property disjoint with: has project identifier
property disjoint with: sha1
property disjoint with: has birth date
type: DatatypeProperty
comment: A data property linking a supplier to an identifying number for that supplier, typically used by the accounting system of the purchasing institution when placing and tracking orders.
domain: supplier

has time zone
sub property of: topDataProperty
property disjoint with: bottomDataProperty
property disjoint with: has birth date
type: FunctionalProperty
type: DatatypeProperty
comment: A data property that permits the time zone relating to an entity to be specified.

full economic costs
type: financial entity
type: budget category
type: Thing
description: Frequently abbreviated 'FEC'.
type: NamedIndividual
comment: A budget category to cover all the direct and indirect costs of a project.

invoice
disjoint with: Nothing
subclass of: financial entity
subclass of: Thing
type: Class
comment: An invoice for payment of goods or services.

(foaf) Agent
disjoint with: http://lodlaundromat.org/.well-known/genid/9d396f826af70bb26e6c953fbd3fce0b#16
subclass of: http://lodlaundromat.org/.well-known/genid/9d396f826af70bb26e6c953fbd3fce0b#18
disjoint with: http://lodlaundromat.org/.well-known/genid/9d396f826af70bb26e6c953fbd3fce0b#10
subclass of: http://lodlaundromat.org/.well-known/genid/9d396f826af70bb26e6c953fbd3fce0b#6
subclass of: http://lodlaundromat.org/.well-known/genid/9d396f826af70bb26e6c953fbd3fce0b#13
subclass of: http://lodlaundromat.org/.well-known/genid/9d396f826af70bb26e6c953fbd3fce0b#23
type: Class
disjoint with: http://lodlaundromat.org/.well-known/genid/9d396f826af70bb26e6c953fbd3fce0b#5
disjoint with: (foaf) OnlineAccount
disjoint with: (foaf) Document
subclass of: http://lodlaundromat.org/.well-known/genid/9d396f826af70bb26e6c953fbd3fce0b#1
subclass of: http://lodlaundromat.org/.well-known/genid/5432219778cf6f0499743510fcfcf875#4
subclass of: Thing
complement of: http://lodlaundromat.org/.well-known/genid/9d396f826af70bb26e6c953fbd3fce0b#16
subclass of: http://lodlaundromat.org/.well-known/genid/9d396f826af70bb26e6c953fbd3fce0b#9
subclass of: http://lodlaundromat.org/.well-known/genid/5432219778cf6f0499743510fcfcf875#7
disjoint with: (foaf) PersonalProfileDocument
disjoint with: http://lodlaundromat.org/.well-known/genid/9d396f826af70bb26e6c953fbd3fce0b#17
disjoint with: Nothing
disjoint with: (foaf) Project
disjoint with: http://lodlaundromat.org/.well-known/genid/9d396f826af70bb26e6c953fbd3fce0b#22
subclass of: http://lodlaundromat.org/.well-known/genid/5432219778cf6f0499743510fcfcf875#1
disjoint with: (foaf) Image
nsterm status: unstable
comment: An agent (eg. person, group, software or physical artifact).

laboratory
disjoint with: Nothing
subclass of: infrastructure entity
subclass of: facility
subclass of: Thing
type: Class
comment: A facility in which research can be conducted.

postal address
disjoint with: Nothing
subclass of: Thing
type: Class
comment: A postal address.

research information system
disjoint with: Nothing
subclass of: infrastructure entity
subclass of: computational service
subclass of: service
subclass of: Thing
type: Class
comment: A database containing administrative information about the research undertaken in an institution, and the publications and other outputs from such research.

has IPR owner
property disjoint with: page
property disjoint with: weblog
sub property of: is owned by
property disjoint with: logo
property disjoint with: thumbnail
sub property of: topObjectProperty
property disjoint with: img
property disjoint with: workInfoHomepage
property disjoint with: tipjar
property disjoint with: has curriculum vitae
property disjoint with: bottomObjectProperty
property disjoint with: isPrimaryTopicOf
property disjoint with: publications
property disjoint with: homepage
property disjoint with: schoolHomepage
property disjoint with: workplaceHomepage
property disjoint with: made
property disjoint with: pastProject
property disjoint with: currentProject
property disjoint with: depiction
property disjoint with: interest
property disjoint with: mbox
type: ObjectProperty
inverse of: owns IPR of
property disjoint with: phone
comment: An object property linking an entity such as a project, an endeavour or an output to an agent who owns the IPR arising from or related to that entity.
range: (foaf) Agent

has funder identifer
property disjoint with: has degrees
property disjoint with: jabberID
property disjoint with: name
property disjoint with: has birth date
property disjoint with: has qualification
property disjoint with: has job title
property disjoint with: has familiar suffix
property disjoint with: post-nominals
type: DatatypeProperty
property disjoint with: bottomDataProperty
sub property of: topDataProperty
property disjoint with: sha1
property disjoint with: has ORCID
property disjoint with: yahooChatID
property disjoint with: has alternate name
property disjoint with: family name initial
property disjoint with: birthday
property disjoint with: given name initial
property disjoint with: aimChatID
property disjoint with: has project identifier
property disjoint with: has personal identifier
property disjoint with: geekcode
property disjoint with: has name suffix
property disjoint with: plan
property disjoint with: initials
property disjoint with: title
property disjoint with: has contact information
sub property of: identifier
property disjoint with: nick
property disjoint with: myersBriggs
comment: A data property linking a funding agency to an identifier for that funding agency.
domain: funding agency

has birth date
property disjoint with: yahooChatID
property disjoint with: has personal identifier
property disjoint with: has job title
property disjoint with: has expiry date
property disjoint with: has start date
property disjoint with: has reference number
property disjoint with: has currency
property disjoint with: has delivery date
property disjoint with: has application deadline
property disjoint with: sha1
property disjoint with: has organizational information
property disjoint with: initials
property disjoint with: has invoice date
property disjoint with: has purchase date
property disjoint with: has keyword
property disjoint with: has post code
property disjoint with: has country code
property disjoint with: identifier
property disjoint with: has decision date
sub property of: birthday
property disjoint with: has acronym
property disjoint with: given name initial
property disjoint with: geekcode
property disjoint with: plan
property disjoint with: has grant number
property disjoint with: has dispatch date
property disjoint with: name
property disjoint with: myersBriggs
property disjoint with: has model number
property disjoint with: has postal address
property disjoint with: has award date
type: DatatypeProperty
property disjoint with: has domain name
property disjoint with: has time zone
property disjoint with: has creation date
property disjoint with: has language code
property disjoint with: has alternate name
property disjoint with: has completion date
property disjoint with: has name suffix
property disjoint with: has currency code
property disjoint with: has call identifier
property disjoint with: has country
property disjoint with: has quotation date
property disjoint with: has provenance
property disjoint with: has funder identifer
property disjoint with: has supplier number
property disjoint with: has registration deadline
property disjoint with: has location
property disjoint with: has qualification
property disjoint with: aimChatID
property disjoint with: has code
property disjoint with: has cost
property disjoint with: fee or free
property disjoint with: has city or town
property disjoint with: post-nominals
property disjoint with: has familiar suffix
sub property of: topDataProperty
property disjoint with: has batch number
property disjoint with: has value
property disjoint with: has degrees
property disjoint with: has temporal duration
property disjoint with: has expertise
property disjoint with: has contact information
property disjoint with: has phone number
property disjoint with: has ORCID
property disjoint with: has purchase order number
property disjoint with: jabberID
property disjoint with: has deliverable
property disjoint with: family name initial
property disjoint with: has exchange rate
property disjoint with: has postal address line
property disjoint with: has information
property disjoint with: has catalog number
property disjoint with: nick
property disjoint with: has end date
property disjoint with: has customer number
property disjoint with: title
property disjoint with: has milestone
property disjoint with: has project identifier
property disjoint with: has headcount

(foaf) Organization
subclass of: http://lodlaundromat.org/.well-known/genid/9d396f826af70bb26e6c953fbd3fce0b#18
disjoint with: (foaf) Group
disjoint with: http://lodlaundromat.org/.well-known/genid/9d396f826af70bb26e6c953fbd3fce0b#10
subclass of: http://lodlaundromat.org/.well-known/genid/5432219778cf6f0499743510fcfcf875#1
subclass of: http://lodlaundromat.org/.well-known/genid/9d396f826af70bb26e6c953fbd3fce0b#9
disjoint with: research group
disjoint with: http://lodlaundromat.org/.well-known/genid/9d396f826af70bb26e6c953fbd3fce0b#22
disjoint with: (foaf) Image
subclass of: http://lodlaundromat.org/.well-known/genid/9d396f826af70bb26e6c953fbd3fce0b#23
disjoint with: Nothing
subclass of: http://lodlaundromat.org/.well-known/genid/5432219778cf6f0499743510fcfcf875#4
disjoint with: http://lodlaundromat.org/.well-known/genid/9d396f826af70bb26e6c953fbd3fce0b#16
disjoint with: (foaf) Person
subclass of: http://lodlaundromat.org/.well-known/genid/9d396f826af70bb26e6c953fbd3fce0b#1
disjoint with: http://lodlaundromat.org/.well-known/genid/9d396f826af70bb26e6c953fbd3fce0b#17
disjoint with: (foaf) Document
subclass of: Thing
subclass of: http://lodlaundromat.org/.well-known/genid/9d396f826af70bb26e6c953fbd3fce0b#6
subclass of: (foaf) Agent
disjoint with: (foaf) PersonalProfileDocument
disjoint with: (foaf) OnlineAccount
type: Class
disjoint with: (foaf) Project
subclass of: http://lodlaundromat.org/.well-known/genid/9d396f826af70bb26e6c953fbd3fce0b#13
disjoint with: http://lodlaundromat.org/.well-known/genid/9d396f826af70bb26e6c953fbd3fce0b#5
subclass of: http://lodlaundromat.org/.well-known/genid/5432219778cf6f0499743510fcfcf875#7
nsterm status: unstable
comment: An organization.
description: owl:equivalentClass cerf:OrganizationalUnit .

article processing charge
disjoint with: Nothing
subclass of: fee
subclass of: financial entity
subclass of: Thing
type: Class
comment: A fee levied by a publisher on an author or an institution to cover the cost of publishing an Open Access journal article. Also knows as Article Processing Fee, Article Publication Charge, Author Processing Charge or Author Publishing Charge.

percentage of total funding
sub property of: topObjectProperty
property disjoint with: bottomObjectProperty
type: ObjectProperty
comment: An object property linking funding to a budget, specifying what fraction of the total budget is provided by that source of funding.
domain: funding
range: budget

is funding agency for
property disjoint with: has curriculum vitae
property disjoint with: maker
property disjoint with: workInfoHomepage
property disjoint with: schoolHomepage
property disjoint with: topic
property disjoint with: primaryTopic
property disjoint with: topic interest
property disjoint with: bottomObjectProperty
property disjoint with: interest
sub property of: supports
property disjoint with: publications
property disjoint with: thumbnail
type: ObjectProperty
property disjoint with: member
sub property of: topObjectProperty
property disjoint with: currentProject
property disjoint with: depicts
property disjoint with: workplaceHomepage
property disjoint with: pastProject
inverse of: has funding agency
property disjoint with: knows
property disjoint with: img
comment: An object property linking a funding agency to an entity for which it provides funding.
domain: funding agency

has start date
property disjoint with: has invoice date
property disjoint with: has birth date
property disjoint with: bottomDataProperty
property disjoint with: birthday
type: FunctionalProperty
sub property of: topDataProperty
type: DatatypeProperty
property disjoint with: has award date
comment: A data property linking something such as a project to its start date.
range: dateTime
sub property of: date

is enabled by
sub property of: topObjectProperty
property disjoint with: bottomObjectProperty
inverse of: enables
type: ObjectProperty
description: Domain and range constraints have been removed from this object property to permit it to be used in unforeseen ways.
comment: An object property relating an entity to another entity that enables it, e.g. linking an investigation to a project that enables it.

uses service
sub property of: topObjectProperty
property disjoint with: bottomObjectProperty
type: ObjectProperty
description: Domain constraints have been removed from this object property to permit it to be used in unforeseen ways.
comment: An object property linking an activity such as an expedition, a research project or an investigation, to a service employed in that activity.
range: service

has batch number
sub property of: identifier
sub property of: topDataProperty
property disjoint with: bottomDataProperty
property disjoint with: has birth date
type: DatatypeProperty
comment: A data property linking something, for example a chemical or drug, to its manufacturing batch number.

uses equipment
sub property of: topObjectProperty
property disjoint with: bottomObjectProperty
type: ObjectProperty
description: Domain constraints have been removed from this object property to permit it to be used in unforeseen ways.
comment: An object property linking an activity such as an expedition, a research project or an investigation, to an item of equipment employed in that activity.
range: equipment

has degrees
property disjoint with: has funder identifer
property disjoint with: bottomDataProperty
property disjoint with: has birth date
property disjoint with: has project identifier
sub property of: has name suffix
property disjoint with: has headcount
type: DatatypeProperty
sub property of: has contact information
sub property of: has information
property disjoint with: sha1
sub property of: topDataProperty
property disjoint with: has organizational information
comment: The letters that should be displayed after a person's name to indicate an academic degree, e.g. BA, BVSc, PhD, DSc.

facility
disjoint with: Nothing
subclass of: infrastructure entity
subclass of: Thing
type: Class
comment: A place or installation built or designed to serve a specific function or provide a specific service, for example an animal breeding centre, a DNA sequencing facility or a confocal imaging laboratory.

has domain name
sub property of: topDataProperty
property disjoint with: bottomDataProperty
property disjoint with: has birth date
type: DatatypeProperty
comment: A data property linking an entity to an internet domain name that has been registered for that entity, for example http://www.miidi.org for MIIDI, the Minimal Information standard for reporting an Infectious Disease Investigation.

(foaf) PersonalProfileDocument
disjoint with: not-for-profit organization
disjoint with: government organization
disjoint with: (foaf) Project
disjoint with: small to medium enterprise
disjoint with: host institution
disjoint with: department
disjoint with: university
disjoint with: research institute
disjoint with: (foaf) OnlineAccount
disjoint with: owner
disjoint with: Nothing
disjoint with: spin-off company
disjoint with: http://lodlaundromat.org/.well-known/genid/9d396f826af70bb26e6c953fbd3fce0b#17
disjoint with: (foaf) Person
subclass of: http://lodlaundromat.org/.well-known/genid/9d396f826af70bb26e6c953fbd3fce0b#18
disjoint with: registration agency
disjoint with: http://lodlaundromat.org/.well-known/genid/9d396f826af70bb26e6c953fbd3fce0b#6
disjoint with: faculty
disjoint with: company
disjoint with: vendor
disjoint with: registration authority
disjoint with: research group
disjoint with: (foaf) Image
disjoint with: (foaf) Group
subclass of: http://lodlaundromat.org/.well-known/genid/9d396f826af70bb26e6c953fbd3fce0b#23
subclass of: http://lodlaundromat.org/.well-known/genid/9d396f826af70bb26e6c953fbd3fce0b#1
disjoint with: purchaser
subclass of: http://lodlaundromat.org/.well-known/genid/9d396f826af70bb26e6c953fbd3fce0b#10
disjoint with: (foaf) Agent
disjoint with: http://lodlaundromat.org/.well-known/genid/9d396f826af70bb26e6c953fbd3fce0b#9
disjoint with: http://lodlaundromat.org/.well-known/genid/9d396f826af70bb26e6c953fbd3fce0b#13
disjoint with: funding agency
disjoint with: (foaf) Organization
subclass of: Thing
disjoint with: computational agent
disjoint with: manufacturer
type: Class
disjoint with: division
subclass of: http://lodlaundromat.org/.well-known/genid/9d396f826af70bb26e6c953fbd3fce0b#5
subclass of: (foaf) Document
disjoint with: http://lodlaundromat.org/.well-known/genid/9d396f826af70bb26e6c953fbd3fce0b#22
subclass of: http://lodlaundromat.org/.well-known/genid/9d396f826af70bb26e6c953fbd3fce0b#16
disjoint with: college
disjoint with: supplier
nsterm status: testing
comment: A personal profile RDF document.

has curriculum vitae
property disjoint with: maker
property disjoint with: topic
property disjoint with: thumbnail
property disjoint with: sells to
property disjoint with: is submitted by
property disjoint with: mbox
property disjoint with: purchases from
property disjoint with: bottomObjectProperty
property disjoint with: is donated by
property disjoint with: pastProject
property disjoint with: is awarded by
property disjoint with: phone
property disjoint with: is owned by
property disjoint with: has funding agency
property disjoint with: is funding agency for
property disjoint with: primaryTopic
property disjoint with: knows
property disjoint with: member
property disjoint with: is manufactured by
sub property of: topObjectProperty
property disjoint with: is employed by
property disjoint with: was purchased by
property disjoint with: is applied for by
type: ObjectProperty
property disjoint with: depicts
property disjoint with: employs
property disjoint with: has IPR owner
property disjoint with: is evaluated by
property disjoint with: is supplied by
property disjoint with: fundedBy
property disjoint with: collaborates with
comment: An object property linking a person to an on-line version of that person's curriculum vitae.
domain: (foaf) Person
range: (foaf) Document

commitments
disjoint with: Nothing
subclass of: budget information
subclass of: financial entity
subclass of: Thing
type: Class
comment: Money set aside to honour expenditures already made but for which no invoices have yet been received, or expenditures planned for the future, for example for salaries.

has keyword
sub property of: topDataProperty
property disjoint with: bottomDataProperty
property disjoint with: has birth date
type: DatatypeProperty
comment: A data property permitting specification of a keyword relating to an entity.

has application outcome
sub property of: topDataProperty
property disjoint with: bottomDataProperty
property disjoint with: has birth date
type: DatatypeProperty
comment: A data property that permits the outcome of an application to be described, for example that a job has been offered or that a grant has been awarded.

consultancy costs
type: financial entity
type: budget category
type: Thing
type: NamedIndividual
comment: A budget category to cover the costs of consultancy fees.

budget
disjoint with: Nothing
subclass of: http://lodlaundromat.org/.well-known/genid/5432219778cf6f0499743510fcfcf875#4
subclass of: financial entity
subclass of: Thing
type: Class
comment: A structured statement of how funds are to be used for expenditure in defined budget categories. A budget is created, for example, when applying for funding for a project, and is subsequently used to manage the expenditure from the awarded grant for that project.

is output of
sub property of: topObjectProperty
property disjoint with: bottomObjectProperty
inverse of: has output
type: ObjectProperty
description: Domain and range constraints have been removed from this object property to permit it to be used in unforeseen ways.
comment: An object property linking something that is created or produced to the activity that created or produced it.

scholarship application
disjoint with: Nothing
subclass of: application
subclass of: Thing
type: Class
comment: The activity of applying for an educational scholarship.

has purchase date
type: FunctionalProperty
property disjoint with: birthday
sub property of: topDataProperty
type: DatatypeProperty
property disjoint with: has award date
property disjoint with: has birth date
property disjoint with: bottomDataProperty
property disjoint with: has invoice date
comment: A data property linking something to its purchase date.
range: dateTime
sub property of: date

expenditure to date
disjoint with: Nothing
subclass of: budget information
subclass of: expenditure
subclass of: financial entity
subclass of: Thing
type: Class
comment: Total money expended to date from an an account, or from a particular budget category.

financial control system
disjoint with: Nothing
subclass of: infrastructure entity
subclass of: computational service
subclass of: service
subclass of: Thing
type: Class
comment: A software system controlling the financial activities of an organization, for example determining full economic cost budgets for grant applications, and managing the funding of funded projects.

overhead costs
type: financial entity
type: budget category
type: Thing
type: NamedIndividual
comment: A budget category to cover all the non-directly incurred costs of a project, including estates costs and indirect costs, that enable an institution to host an externally-funded project.

grant
disjoint with: Nothing
subclass of: financial entity
subclass of: funding
subclass of: Thing
subclass of: http://lodlaundromat.org/.well-known/genid/5432219778cf6f0499743510fcfcf875#7
subclass of: http://lodlaundromat.org/.well-known/genid/5432219778cf6f0499743510fcfcf875#1
type: Class
comment: A financial award by a funding agency for a particular project or purpose, usually awarded on the basis of a competitive application.

has post code
sub property of: topDataProperty
sub property of: has code
property disjoint with: bottomDataProperty
property disjoint with: has birth date
type: DatatypeProperty
comment: A data property defining the postal code of an address.

project budget
disjoint with: Nothing
subclass of: http://lodlaundromat.org/.well-known/genid/5432219778cf6f0499743510fcfcf875#4
subclass of: budget
subclass of: financial entity
subclass of: Thing
type: Class
comment: A budget for a research project.

service
disjoint with: Nothing
subclass of: infrastructure entity
subclass of: Thing
type: Class
comment: A service of help to others, often requiring funding, employees, equipment and/or facilities for its provision, for example a library service, a transportation service, a DNA sequencing service.

employment application
disjoint with: Nothing
subclass of: application
subclass of: Thing
type: Class
comment: The activity of applying for a job.

endowment
subclass of: http://lodlaundromat.org/.well-known/genid/5432219778cf6f0499743510fcfcf875#1
subclass of: http://lodlaundromat.org/.well-known/genid/5432219778cf6f0499743510fcfcf875#7
subclass of: financial entity
subclass of: gift
disjoint with: Nothing
type: Class
subclass of: funding
subclass of: Thing
comment: A transfer, generally as a gift, of money or property to an institution to provide a permanent fund, the income from which is to be used for a particular purpose. (Abbreviated from http://legal-dictionary.thefreedictionary.com/endowment).

applies for
property disjoint with: primaryTopic
property disjoint with: maker
property disjoint with: bottomObjectProperty
property disjoint with: topic
sub property of: topObjectProperty
inverse of: is applied for by
property disjoint with: thumbnail
type: ObjectProperty
property disjoint with: depicts
comment: An object property linking an agent to something for which that agent applies, for example a job, membership of an organization, or a grant from a funding agency.
domain: (foaf) Agent

has phone number
sub property of: topDataProperty
sub property of: has information
property disjoint with: bottomDataProperty
property disjoint with: has project identifier
property disjoint with: sha1
property disjoint with: has birth date
type: DatatypeProperty
comment: A data property identifying a telephone number for an agent.

has personal identifier
property disjoint with: has birth date
sub property of: identifier
sub property of: topDataProperty
property disjoint with: bottomDataProperty
sub property of: has contact information
property disjoint with: has headcount
property disjoint with: sha1
property disjoint with: has project identifier
property disjoint with: has organizational information
sub property of: has information
type: DatatypeProperty
property disjoint with: has funder identifer
description: owl:equivalentProperty <http://purl.org/spar/datacite/hasPersonalIdentifier> .
description: owl:equivalentProperty <http://purl.org/spar/scoro/hasPersonalIdentifier> .
comment: A unique and unambiguous identifier for an individual person within a given context.
domain: (foaf) Person

evaluates
inverse of: is evaluated by
property disjoint with: topic
sub property of: topObjectProperty
type: ObjectProperty
property disjoint with: bottomObjectProperty
property disjoint with: maker
property disjoint with: primaryTopic
property disjoint with: depicts
property disjoint with: thumbnail
comment: An object property linking an agent to an entity which that agent evaluates, for example a funding agency that is evaluating a grant application to determine whether the proposed project is worthy of funding, or a publisher evaluating a manuscript to determine whether it is suitable for publication.
domain: (foaf) Agent

travel and subsistence costs
type: financial entity
type: budget category
type: Thing
type: NamedIndividual
comment: A budget category to cover the costs of travel and subsistence incurred on behalf of the project.

supplier
subclass of: (foaf) Agent
subclass of: http://lodlaundromat.org/.well-known/genid/9d396f826af70bb26e6c953fbd3fce0b#9
disjoint with: (foaf) Document
subclass of: http://lodlaundromat.org/.well-known/genid/5432219778cf6f0499743510fcfcf875#4
subclass of: http://lodlaundromat.org/.well-known/genid/9d396f826af70bb26e6c953fbd3fce0b#6
disjoint with: http://lodlaundromat.org/.well-known/genid/9d396f826af70bb26e6c953fbd3fce0b#17
subclass of: http://lodlaundromat.org/.well-known/genid/9d396f826af70bb26e6c953fbd3fce0b#13
disjoint with: http://lodlaundromat.org/.well-known/genid/9d396f826af70bb26e6c953fbd3fce0b#22
disjoint with: (foaf) PersonalProfileDocument
disjoint with: Nothing
disjoint with: http://lodlaundromat.org/.well-known/genid/9d396f826af70bb26e6c953fbd3fce0b#5
subclass of: http://lodlaundromat.org/.well-known/genid/5432219778cf6f0499743510fcfcf875#7
subclass of: http://lodlaundromat.org/.well-known/genid/5432219778cf6f0499743510fcfcf875#1
disjoint with: http://lodlaundromat.org/.well-known/genid/9d396f826af70bb26e6c953fbd3fce0b#16
type: Class
disjoint with: (foaf) OnlineAccount
subclass of: http://lodlaundromat.org/.well-known/genid/9d396f826af70bb26e6c953fbd3fce0b#18
disjoint with: (foaf) Project
subclass of: http://lodlaundromat.org/.well-known/genid/9d396f826af70bb26e6c953fbd3fce0b#23
disjoint with: (foaf) Image
subclass of: http://lodlaundromat.org/.well-known/genid/9d396f826af70bb26e6c953fbd3fce0b#1
subclass of: Thing
disjoint with: http://lodlaundromat.org/.well-known/genid/9d396f826af70bb26e6c953fbd3fce0b#10
comment: An agent who supplies something, such as goods or services.

infrastructure entity
disjoint with: Nothing
subclass of: Thing
type: Class
description: owl:equivalentClass cerif:InfrastructureEntity .
comment: An entity that facilitates work.

provides service
sub property of: topObjectProperty
property disjoint with: maker
property disjoint with: primaryTopic
type: ObjectProperty
property disjoint with: topic
property disjoint with: bottomObjectProperty
property disjoint with: thumbnail
property disjoint with: depicts
description: Range constraints have been removed from this object property to permit it to be used in unforeseen ways.
comment: An agent that provides a service.
domain: (foaf) Agent

purchases from
property disjoint with: made
property disjoint with: bottomObjectProperty
property disjoint with: tipjar
property disjoint with: mbox
property disjoint with: currentProject
property disjoint with: depicts
type: ObjectProperty
property disjoint with: img
property disjoint with: thumbnail
property disjoint with: workplaceHomepage
property disjoint with: has curriculum vitae
property disjoint with: pastProject
property disjoint with: homepage
property disjoint with: schoolHomepage
property disjoint with: depiction
sub property of: topObjectProperty
property disjoint with: page
property disjoint with: phone
property disjoint with: topic
property disjoint with: primaryTopic
property disjoint with: maker
property disjoint with: weblog
property disjoint with: isPrimaryTopicOf
property disjoint with: logo
property disjoint with: interest
property disjoint with: workInfoHomepage
property disjoint with: publications
inverse of: sells to
description: Domain and range constraints on this object property have been relaxed to permit it to be used in unforeseen ways.
comment: An object property relating a purchaser to a supplier from whom the purchase is made.
domain: (foaf) Agent
range: (foaf) Agent

academic
type: Thing
type: http://lodlaundromat.org/.well-known/genid/9d396f826af70bb26e6c953fbd3fce0b#13
type: (foaf) Person
type: http://lodlaundromat.org/.well-known/genid/9d396f826af70bb26e6c953fbd3fce0b#18
type: (foaf) Agent
type: http://lodlaundromat.org/.well-known/genid/5432219778cf6f0499743510fcfcf875#7
type: http://lodlaundromat.org/.well-known/genid/9d396f826af70bb26e6c953fbd3fce0b#9
type: http://lodlaundromat.org/.well-known/genid/5432219778cf6f0499743510fcfcf875#1
type: http://lodlaundromat.org/.well-known/genid/9d396f826af70bb26e6c953fbd3fce0b#1
type: http://lodlaundromat.org/.well-known/genid/9d396f826af70bb26e6c953fbd3fce0b#23
type: http://lodlaundromat.org/.well-known/genid/5432219778cf6f0499743510fcfcf875#4
type: http://lodlaundromat.org/.well-known/genid/9d396f826af70bb26e6c953fbd3fce0b#6
type: NamedIndividual
comment: A member of the academic staff of an academic institution such as a university.

has customer number
sub property of: identifier
sub property of: topDataProperty
property disjoint with: bottomDataProperty
property disjoint with: has project identifier
property disjoint with: sha1
property disjoint with: has birth date
type: DatatypeProperty
comment: A data property linking an agent to an identifying number for that agent, typically used by the accounting system of the supplier when issuing quotations, fulfilling orders and submitting invoices.
domain: purchaser

has currency
sub property of: topDataProperty
property disjoint with: bottomDataProperty
property disjoint with: has birth date
type: DatatypeProperty
comment: A data property defining the currency used to specify a financial entity. Use in conjection with frapo:hasMonetaryValue.

has grant number
sub property of: identifier
sub property of: topDataProperty
property disjoint with: bottomDataProperty
property disjoint with: has birth date
type: DatatypeProperty
comment: A data property specifying the grant number of a grant provided by a funding agency.
domain: grant

facilities costs
type: financial entity
type: budget category
type: Thing
type: NamedIndividual
comment: A budget category to cover the costs of maintaining facilities used by a project, for example an electron microscopy facility.

purchase order
disjoint with: Nothing
subclass of: financial entity
subclass of: Thing
type: Class
comment: An official order from a purchasing institution to a supplier for the purchase of goods or services, often issued in response to the receipt of a quotation from the supplier.

payment
disjoint with: Nothing
subclass of: financial entity
subclass of: Thing
type: Class
comment: A financial payment made, for example in exchange for something purchased such as property, goods or services, or to refund expenses incurred.

output
disjoint with: Nothing
subclass of: infrastructure entity
subclass of: Thing
subclass of: equipment
type: Class
description: Ontology terms and definitions for most publishable project outputs are given as 'Expression' classes in FaBiO, the FRBR-aligned Bibliographic Ontology, e.g. fabio:JournalArticle, fabio:DataSet. For 'deliverables', use frapo:Deliverable. For material outputs, use frapo:MaterialOutput.
comment: Something that is created or produced as a result of a project or an endeavour. Examples include a building resulting from a building project, educated students graduating from an educational programme, and a journal article published as a result of a research project. Research outputs can also include reports, datasets, experimental protocols, workflows and mathematical models, and material outputs such as a cell line, a mouse mutant or a new form of microscope.

directly allocated costs
type: financial entity
type: budget category
type: Thing
type: NamedIndividual
comment: A budget category to cover those costs normally borne by an institution, that are assigned to the budget of an externally funded project to cover the value of contributions to that project, for example to pay for the salary of a permanent member of staff seconded to work on the project, to compensate the employing organization for the loss of that person's efforts on other activities that he or she would otherwise be undertaking were it not for that secondment.

fee or free
sub property of: topDataProperty
property disjoint with: bottomDataProperty
property disjoint with: has birth date
type: DatatypeProperty
comment: A data property defining whether participation in an event is free, or requires payment of a fee.

consumables costs
type: financial entity
type: budget category
type: Thing
type: NamedIndividual
comment: A budget category to cover the costs of purchasing consumables.

has city or town
sub property of: topDataProperty
property disjoint with: bottomDataProperty
property disjoint with: has birth date
type: DatatypeProperty
comment: A data property specifying a city or town, for example as the location of an event.

supplies
property disjoint with: thumbnail
type: ObjectProperty
property disjoint with: topic
property disjoint with: primaryTopic
property disjoint with: bottomObjectProperty
property disjoint with: depicts
property disjoint with: maker
sub property of: topObjectProperty
inverse of: is supplied by
description: Domain constraints on this object property have been relaxed to permit it to be used in unforeseen ways.
comment: An object property relating a supplier to a supplied entity, or to an agent to whom the entity is supplied.
domain: (foaf) Agent

small to medium enterprise
disjoint with: Nothing
disjoint with: http://lodlaundromat.org/.well-known/genid/9d396f826af70bb26e6c953fbd3fce0b#5
subclass of: http://lodlaundromat.org/.well-known/genid/9d396f826af70bb26e6c953fbd3fce0b#13
subclass of: http://lodlaundromat.org/.well-known/genid/5432219778cf6f0499743510fcfcf875#7
disjoint with: http://lodlaundromat.org/.well-known/genid/9d396f826af70bb26e6c953fbd3fce0b#10
subclass of: http://lodlaundromat.org/.well-known/genid/9d396f826af70bb26e6c953fbd3fce0b#6
disjoint with: (foaf) Person
disjoint with: (foaf) Image
subclass of: Thing
subclass of: (foaf) Organization
disjoint with: http://lodlaundromat.org/.well-known/genid/9d396f826af70bb26e6c953fbd3fce0b#16
subclass of: (foaf) Agent
subclass of: company
subclass of: http://lodlaundromat.org/.well-known/genid/9d396f826af70bb26e6c953fbd3fce0b#1
subclass of: http://lodlaundromat.org/.well-known/genid/5432219778cf6f0499743510fcfcf875#1
disjoint with: (foaf) Document
disjoint with: (foaf) OnlineAccount
disjoint with: (foaf) Group
subclass of: http://lodlaundromat.org/.well-known/genid/5432219778cf6f0499743510fcfcf875#4
subclass of: http://lodlaundromat.org/.well-known/genid/9d396f826af70bb26e6c953fbd3fce0b#18
disjoint with: http://lodlaundromat.org/.well-known/genid/9d396f826af70bb26e6c953fbd3fce0b#17
disjoint with: http://lodlaundromat.org/.well-known/genid/9d396f826af70bb26e6c953fbd3fce0b#22
disjoint with: (foaf) PersonalProfileDocument
disjoint with: (foaf) Project
type: Class
subclass of: http://lodlaundromat.org/.well-known/genid/9d396f826af70bb26e6c953fbd3fce0b#23
subclass of: http://lodlaundromat.org/.well-known/genid/9d396f826af70bb26e6c953fbd3fce0b#9
disjoint with: research group
comment: A small to medium enterprise, having up to 250 employees.
label: sme

has name suffix
property disjoint with: has headcount
property disjoint with: has funder identifer
property disjoint with: has birth date
sub property of: has contact information
type: DatatypeProperty
sub property of: topDataProperty
property disjoint with: bottomDataProperty
sub property of: has information
property disjoint with: has organizational information
property disjoint with: sha1
property disjoint with: has project identifier
comment: The letters that should be displayed after a person's name.

budget information
disjoint with: Nothing
subclass of: financial entity
subclass of: Thing
type: Class
comment: Information about an aspect of a budget.

benefactor
type: (foaf) Agent
type: http://lodlaundromat.org/.well-known/genid/9d396f826af70bb26e6c953fbd3fce0b#18
type: http://lodlaundromat.org/.well-known/genid/9d396f826af70bb26e6c953fbd3fce0b#6
type: http://lodlaundromat.org/.well-known/genid/9d396f826af70bb26e6c953fbd3fce0b#23
type: http://lodlaundromat.org/.well-known/genid/5432219778cf6f0499743510fcfcf875#7
type: Thing
type: http://lodlaundromat.org/.well-known/genid/9d396f826af70bb26e6c953fbd3fce0b#1
type: http://lodlaundromat.org/.well-known/genid/5432219778cf6f0499743510fcfcf875#1
type: http://lodlaundromat.org/.well-known/genid/9d396f826af70bb26e6c953fbd3fce0b#9
type: http://lodlaundromat.org/.well-known/genid/9d396f826af70bb26e6c953fbd3fce0b#13
type: (foaf) Person
type: http://lodlaundromat.org/.well-known/genid/5432219778cf6f0499743510fcfcf875#4
type: NamedIndividual
comment: A person who gives a gift.

income
disjoint with: Nothing
subclass of: budget information
subclass of: financial entity
subclass of: Thing
type: Class
comment: Money coming into an account. May be associated with a particular budget category.

has reference number
sub property of: identifier
sub property of: topDataProperty
property disjoint with: bottomDataProperty
property disjoint with: has birth date
type: DatatypeProperty
comment: A data property linking something to a reference number for that item.

has registration deadline
property disjoint with: birthday
type: FunctionalProperty
property disjoint with: bottomDataProperty
property disjoint with: has invoice date
type: DatatypeProperty
property disjoint with: has birth date
sub property of: topDataProperty
property disjoint with: has award date
comment: The date by which registration must be made, for example renewal of an internet domain name.
range: dateTime
sub property of: date

has location
sub property of: topDataProperty
property disjoint with: bottomDataProperty
property disjoint with: has birth date
type: DatatypeProperty
comment: A data property link an entity to a relevant location, which might be geographical (e.g. New York City) or local (e.g. Freezer B, second shelf).

has temporal duration
sub property of: topDataProperty
property disjoint with: has award date
property disjoint with: bottomDataProperty
property disjoint with: has invoice date
property disjoint with: has birth date
property disjoint with: birthday
type: DatatypeProperty
comment: A data property enabling one to define the temporal duration of some entity such as an event or a project.
range: dateTime

consortium agreement
disjoint with: Nothing
subclass of: contract
subclass of: financial entity
subclass of: Thing
type: Class
comment: A formal agreement between members of a consortium, for example between research groups at different universities engaged in a multi-partner research project.

post-nominals
property disjoint with: has funder identifer
property disjoint with: bottomDataProperty
property disjoint with: has headcount
sub property of: has information
property disjoint with: has birth date
property disjoint with: has project identifier
property disjoint with: has organizational information
type: DatatypeProperty
sub property of: topDataProperty
property disjoint with: sha1
sub property of: has name suffix
sub property of: has contact information
comment: The letters that should be displayed after a person's name to indicate qualification, membership or fellowship in a professional society, honours or elite status, e.g. MRCVS, FRCS, FRS, OBE, Kt.

has account number
sub property of: identifier
sub property of: topDataProperty
property disjoint with: bottomDataProperty
property disjoint with: has birth date
type: DatatypeProperty
comment: A data property linking a financial account to an identifying number for that account.
domain: account

FOAF Essential v. 2.0
prior version: foaf-essential.owl
creator: me
publisher: Mindinformatics, Massachusetts General Hospital
contributor: Alan Ruttenberg
version info: 2.0
contributor: Paolo Ciccarese
title: FOAF Essential ontology
date: October 12, 2010
type: Ontology
language: en
format: rdf/xml

FRAPO, the Funding, Research Administration and Projects Ontology
version info: 1.1
creator: David Shotton
comment: FRAPO, the Funding, Research Administration and Projects Ontology, is a CERIF-compliant ontology written in OWL 2 DL for describing research project administrative information. This ontology is available at http://purl.org/cerif/frapo/, and uses the namespace prefix 'frapo'.
description: FRAPO is an ontology for use to describe research project administrative information and to work with CRIS (Current Research Information Systems). It can be used for the characterization of grant applications, funding bodies, projects, project partners, etc. It can also be used to describe other types of projects, for example building projects and educational projects. FRAPO imports FOAF and is designed to work with SCoRO, the Scholarly Contributions and Roles Ontology (http://purl.org/spar/scoro/), which is used to characterize the contributions and time-limited roles that may exist between agents such as people and organizations and entities such as projects, research investigations or research outputs. FaBiO, the FRBR-alightned bibliographic ontology (http://purl.org/spar/fabio/), provides terms for documents of relevance, such as grant applications, project plans, project reports, datasets and journal articles, which are therefore not included within FRAPO. FRAPO is not intended to describe the details of research investigations enabled by funded research projects, nor their component studies and assays, which are the domain of a complementary ontology, ISA-RDF (under development - add URL).
date: 2014-01-31
type: Ontology
imports: FOAF Essential v. 2.0
rights: This work is distributed under a Creative Commons Attribution License (http://creativecommons.org/licenses/by/3.0/).
contributor: Silvio Peroni