has curriculum vitae
range: Thing
domain: Thing
type: ObjectProperty
comment: An object property linking a person to an on-line version of that person's curriculum vitae.
domain: (foaf) Person
range: (foaf) Document
type: Property
range: http://lodlaundromat.org/.well-known/genid/9d396f826af70bb26e6c953fbd3fce0b#23
range: http://lodlaundromat.org/.well-known/genid/9d396f826af70bb26e6c953fbd3fce0b#10
range: Resource
range: http://lodlaundromat.org/.well-known/genid/9d396f826af70bb26e6c953fbd3fce0b#18
range: http://lodlaundromat.org/.well-known/genid/9d396f826af70bb26e6c953fbd3fce0b#1
domain: (foaf) Agent
domain: http://lodlaundromat.org/.well-known/genid/9d396f826af70bb26e6c953fbd3fce0b#1
domain: Resource
domain: http://lodlaundromat.org/.well-known/genid/5432219778cf6f0499743510fcfcf875#1
domain: http://lodlaundromat.org/.well-known/genid/5432219778cf6f0499743510fcfcf875#7
domain: http://lodlaundromat.org/.well-known/genid/9d396f826af70bb26e6c953fbd3fce0b#23
domain: http://lodlaundromat.org/.well-known/genid/9d396f826af70bb26e6c953fbd3fce0b#18
domain: http://lodlaundromat.org/.well-known/genid/5432219778cf6f0499743510fcfcf875#4
domain: http://lodlaundromat.org/.well-known/genid/9d396f826af70bb26e6c953fbd3fce0b#13
domain: http://lodlaundromat.org/.well-known/genid/9d396f826af70bb26e6c953fbd3fce0b#6

library
subclass of: Resource
subclass of: Thing
type: Class
comment: A facility in which printed documents (for example books and journals) are deposited for long-term preservation and access.
subclass of: repository
subclass of: facility
subclass of: infrastructure entity

faculty
subclass of: Resource
subclass of: Thing
type: Class
comment: A grouping of similar departments within a university context, also known as a school or a division, for example the Humanities Division, the Mathematics Faculty, or the School of Medicine.
subclass of: division
subclass of: (foaf) Organization
subclass of: http://lodlaundromat.org/.well-known/genid/5432219778cf6f0499743510fcfcf875#7
subclass of: http://lodlaundromat.org/.well-known/genid/9d396f826af70bb26e6c953fbd3fce0b#18
subclass of: http://lodlaundromat.org/.well-known/genid/5432219778cf6f0499743510fcfcf875#4
subclass of: http://lodlaundromat.org/.well-known/genid/9d396f826af70bb26e6c953fbd3fce0b#1
subclass of: http://lodlaundromat.org/.well-known/genid/5432219778cf6f0499743510fcfcf875#1
subclass of: http://lodlaundromat.org/.well-known/genid/9d396f826af70bb26e6c953fbd3fce0b#6
subclass of: http://lodlaundromat.org/.well-known/genid/9d396f826af70bb26e6c953fbd3fce0b#13
subclass of: http://lodlaundromat.org/.well-known/genid/9d396f826af70bb26e6c953fbd3fce0b#23
subclass of: (foaf) Agent

supports
range: Thing
domain: Thing
domain: http://lodlaundromat.org/.well-known/genid/5432219778cf6f0499743510fcfcf875#1
inverse of: is supported by
description: This property is not intended for use to describe mechanical or physical support, as in 'The plinth supports the statue'.
type: ObjectProperty
comment: An object property linking an agent to something that the agent supports by financial or other means.
domain: http://lodlaundromat.org/.well-known/genid/5432219778cf6f0499743510fcfcf875#7
type: Property
range: Resource
domain: Resource

government organization
subclass of: Resource
subclass of: Thing
type: Class
comment: An organization that is part of, or funded by, central or local goverment.
subclass of: (foaf) Organization
subclass of: (foaf) Agent
subclass of: http://lodlaundromat.org/.well-known/genid/5432219778cf6f0499743510fcfcf875#4
subclass of: http://lodlaundromat.org/.well-known/genid/9d396f826af70bb26e6c953fbd3fce0b#18
subclass of: http://lodlaundromat.org/.well-known/genid/5432219778cf6f0499743510fcfcf875#7
subclass of: http://lodlaundromat.org/.well-known/genid/9d396f826af70bb26e6c953fbd3fce0b#23
subclass of: http://lodlaundromat.org/.well-known/genid/9d396f826af70bb26e6c953fbd3fce0b#13
subclass of: http://lodlaundromat.org/.well-known/genid/9d396f826af70bb26e6c953fbd3fce0b#6
subclass of: http://lodlaundromat.org/.well-known/genid/9d396f826af70bb26e6c953fbd3fce0b#1
subclass of: http://lodlaundromat.org/.well-known/genid/5432219778cf6f0499743510fcfcf875#1

collaborates with
range: Thing
domain: Thing
type: ObjectProperty
type: SymmetricProperty
comment: An object property linking agents, for example different organizations, or people typically from different groups or organizations, that work together on a common task, project or endeavour, or towards a common goal.
domain: (foaf) Agent
range: (foaf) Agent
type: Property
range: http://lodlaundromat.org/.well-known/genid/9d396f826af70bb26e6c953fbd3fce0b#1
range: Resource
range: http://lodlaundromat.org/.well-known/genid/5432219778cf6f0499743510fcfcf875#1
range: http://lodlaundromat.org/.well-known/genid/5432219778cf6f0499743510fcfcf875#7
range: http://lodlaundromat.org/.well-known/genid/9d396f826af70bb26e6c953fbd3fce0b#23
range: http://lodlaundromat.org/.well-known/genid/9d396f826af70bb26e6c953fbd3fce0b#18
range: http://lodlaundromat.org/.well-known/genid/5432219778cf6f0499743510fcfcf875#4
range: http://lodlaundromat.org/.well-known/genid/9d396f826af70bb26e6c953fbd3fce0b#13
range: http://lodlaundromat.org/.well-known/genid/9d396f826af70bb26e6c953fbd3fce0b#6
domain: http://lodlaundromat.org/.well-known/genid/9d396f826af70bb26e6c953fbd3fce0b#1
domain: Resource
domain: http://lodlaundromat.org/.well-known/genid/5432219778cf6f0499743510fcfcf875#1
domain: http://lodlaundromat.org/.well-known/genid/5432219778cf6f0499743510fcfcf875#7
domain: http://lodlaundromat.org/.well-known/genid/9d396f826af70bb26e6c953fbd3fce0b#23
domain: http://lodlaundromat.org/.well-known/genid/9d396f826af70bb26e6c953fbd3fce0b#18
domain: http://lodlaundromat.org/.well-known/genid/5432219778cf6f0499743510fcfcf875#4
domain: http://lodlaundromat.org/.well-known/genid/9d396f826af70bb26e6c953fbd3fce0b#13
domain: http://lodlaundromat.org/.well-known/genid/9d396f826af70bb26e6c953fbd3fce0b#6

has headcount
sub property of: has information
type: DatatypeProperty
comment: A data property specifying the number of people employed by an organization.
sub property of: has organizational information
type: Property
domain: (foaf) Agent
domain: http://lodlaundromat.org/.well-known/genid/9d396f826af70bb26e6c953fbd3fce0b#18
domain: http://lodlaundromat.org/.well-known/genid/9d396f826af70bb26e6c953fbd3fce0b#6
domain: http://lodlaundromat.org/.well-known/genid/9d396f826af70bb26e6c953fbd3fce0b#13
domain: http://lodlaundromat.org/.well-known/genid/9d396f826af70bb26e6c953fbd3fce0b#23
domain: http://lodlaundromat.org/.well-known/genid/9d396f826af70bb26e6c953fbd3fce0b#1
domain: http://lodlaundromat.org/.well-known/genid/5432219778cf6f0499743510fcfcf875#4
domain: Thing
domain: http://lodlaundromat.org/.well-known/genid/5432219778cf6f0499743510fcfcf875#7
domain: Resource
domain: http://lodlaundromat.org/.well-known/genid/5432219778cf6f0499743510fcfcf875#1
domain: (foaf) Organization

conference fee
subclass of: Resource
subclass of: Thing
type: Class
comment: A fee paid to attend a conference.
subclass of: fee
subclass of: financial entity

has output
range: Thing
domain: Thing
inverse of: is output of
description: Domain and range constraints have been removed from this object property to permit it to be used in unforeseen ways.
type: ObjectProperty
comment: An object property linking an activity such as a project or endeavour to something that is created or produced as a result of that activity. Examples include a building created as a result of a building project, and a journal article published to describe the results of a research investigation.
type: Property
range: Resource
domain: Resource

payment
subclass of: Resource
subclass of: Thing
type: Class
comment: A financial payment made, for example in exchange for something purchased such as property, goods or services, or to refund expenses incurred.
subclass of: financial entity

has ORCID
sub property of: has contact information
sub property of: identifier
sub property of: has information
description: owl:equivalentProperty <http://purl.org/spar/scoro/hasORCID> .
type: DatatypeProperty
comment: A data property relating an individual to his/her Open Researcher and Contributor ID (ORCID), an alphanumeric identifier for individual scholars described at http://about.orcid.org/.
sub property of: has personal identifier
type: Property
domain: (foaf) Agent
domain: http://lodlaundromat.org/.well-known/genid/9d396f826af70bb26e6c953fbd3fce0b#18
domain: http://lodlaundromat.org/.well-known/genid/9d396f826af70bb26e6c953fbd3fce0b#6
domain: http://lodlaundromat.org/.well-known/genid/9d396f826af70bb26e6c953fbd3fce0b#13
domain: http://lodlaundromat.org/.well-known/genid/9d396f826af70bb26e6c953fbd3fce0b#23
domain: http://lodlaundromat.org/.well-known/genid/9d396f826af70bb26e6c953fbd3fce0b#1
domain: http://lodlaundromat.org/.well-known/genid/5432219778cf6f0499743510fcfcf875#4
domain: Thing
domain: http://lodlaundromat.org/.well-known/genid/5432219778cf6f0499743510fcfcf875#7
domain: Resource
domain: http://lodlaundromat.org/.well-known/genid/5432219778cf6f0499743510fcfcf875#1
domain: (foaf) Person

stipend
subclass of: Resource
subclass of: Thing
type: Class
comment: A sum of money allotted on a regular basis, usually for some specific purpose.
subclass of: funding
subclass of: http://lodlaundromat.org/.well-known/genid/5432219778cf6f0499743510fcfcf875#1
subclass of: http://lodlaundromat.org/.well-known/genid/5432219778cf6f0499743510fcfcf875#7
subclass of: financial entity

computational service
subclass of: Resource
subclass of: Thing
type: Class
comment: A service provided by a computer system.
subclass of: service
subclass of: infrastructure entity

document repository
subclass of: Resource
subclass of: Thing
type: Class
description: May also be described as a document archive, or a digital library.
comment: A facility in which digital documents are deposited for long-term preservation and (optional) publication.
subclass of: repository
subclass of: facility
subclass of: infrastructure entity

status
subclass of: Resource
type: Class
comment: The status of something such as an application, an investigation or a project.
subclass of: Thing

funding
subclass of: Thing
subclass of: Resource
type: Class
subclass of: http://lodlaundromat.org/.well-known/genid/5432219778cf6f0499743510fcfcf875#1
subclass of: http://lodlaundromat.org/.well-known/genid/5432219778cf6f0499743510fcfcf875#7
comment: An amount of money available to finance some project or activity.
subclass of: financial entity

is submitted by
range: Thing
domain: Thing
type: ObjectProperty
comment: An object property linking an entity that is submitted (to some third party) to the agent who submits it.
range: (foaf) Agent
inverse of: submits
type: Property
range: http://lodlaundromat.org/.well-known/genid/9d396f826af70bb26e6c953fbd3fce0b#1
range: Resource
range: http://lodlaundromat.org/.well-known/genid/5432219778cf6f0499743510fcfcf875#1
range: http://lodlaundromat.org/.well-known/genid/5432219778cf6f0499743510fcfcf875#7
range: http://lodlaundromat.org/.well-known/genid/9d396f826af70bb26e6c953fbd3fce0b#23
range: http://lodlaundromat.org/.well-known/genid/9d396f826af70bb26e6c953fbd3fce0b#18
range: http://lodlaundromat.org/.well-known/genid/5432219778cf6f0499743510fcfcf875#4
range: http://lodlaundromat.org/.well-known/genid/9d396f826af70bb26e6c953fbd3fce0b#13
range: http://lodlaundromat.org/.well-known/genid/9d396f826af70bb26e6c953fbd3fce0b#6
domain: Resource

service contract fee
subclass of: Resource
subclass of: Thing
type: Class
comment: A fee paid periodically, typically annually, to obtain access when required to a service such as an equipment maintenance contract."
subclass of: fee
subclass of: financial entity

subscription
subclass of: Resource
subclass of: Thing
type: Class
comment: Payment, commonly made annually, to obtain access to something on a periodic or continuing basis, such as a journal.
subclass of: fee
subclass of: financial entity

project budget
subclass of: Resource
subclass of: Thing
type: Class
comment: A budget for a research project.
subclass of: budget
subclass of: http://lodlaundromat.org/.well-known/genid/5432219778cf6f0499743510fcfcf875#4
subclass of: financial entity

has IPR owner
range: Thing
domain: Thing
inverse of: owns IPR of
type: ObjectProperty
comment: An object property linking an entity such as a project, an endeavour or an output to an agent who owns the IPR arising from or related to that entity.
range: (foaf) Agent
sub property of: is owned by
type: Property
range: Resource
range: http://lodlaundromat.org/.well-known/genid/9d396f826af70bb26e6c953fbd3fce0b#18
range: http://lodlaundromat.org/.well-known/genid/9d396f826af70bb26e6c953fbd3fce0b#6
range: http://lodlaundromat.org/.well-known/genid/9d396f826af70bb26e6c953fbd3fce0b#13
range: http://lodlaundromat.org/.well-known/genid/9d396f826af70bb26e6c953fbd3fce0b#23
range: http://lodlaundromat.org/.well-known/genid/9d396f826af70bb26e6c953fbd3fce0b#1
range: http://lodlaundromat.org/.well-known/genid/5432219778cf6f0499743510fcfcf875#4
range: http://lodlaundromat.org/.well-known/genid/5432219778cf6f0499743510fcfcf875#7
range: http://lodlaundromat.org/.well-known/genid/5432219778cf6f0499743510fcfcf875#1
domain: Resource

budget
subclass of: http://lodlaundromat.org/.well-known/genid/5432219778cf6f0499743510fcfcf875#4
subclass of: Thing
subclass of: Resource
type: Class
comment: A structured statement of how funds are to be used for expenditure in defined budget categories. A budget is created, for example, when applying for funding for a project, and is subsequently used to manage the expenditure from the awarded grant for that project.
subclass of: financial entity

sells to
range: Thing
domain: Thing
description: Domain and range constraints on this object property have been relaxed to permit it to be used in unforeseen ways.
type: ObjectProperty
comment: An object property relating a supplier to a purchaser to whom an entity is sold.
domain: (foaf) Agent
range: (foaf) Agent
inverse of: purchases from
type: Property
range: http://lodlaundromat.org/.well-known/genid/9d396f826af70bb26e6c953fbd3fce0b#1
range: Resource
range: http://lodlaundromat.org/.well-known/genid/5432219778cf6f0499743510fcfcf875#1
range: http://lodlaundromat.org/.well-known/genid/5432219778cf6f0499743510fcfcf875#7
range: http://lodlaundromat.org/.well-known/genid/9d396f826af70bb26e6c953fbd3fce0b#23
range: http://lodlaundromat.org/.well-known/genid/9d396f826af70bb26e6c953fbd3fce0b#18
range: http://lodlaundromat.org/.well-known/genid/5432219778cf6f0499743510fcfcf875#4
range: http://lodlaundromat.org/.well-known/genid/9d396f826af70bb26e6c953fbd3fce0b#13
range: http://lodlaundromat.org/.well-known/genid/9d396f826af70bb26e6c953fbd3fce0b#6
domain: http://lodlaundromat.org/.well-known/genid/9d396f826af70bb26e6c953fbd3fce0b#1
domain: Resource
domain: http://lodlaundromat.org/.well-known/genid/5432219778cf6f0499743510fcfcf875#1
domain: http://lodlaundromat.org/.well-known/genid/5432219778cf6f0499743510fcfcf875#7
domain: http://lodlaundromat.org/.well-known/genid/9d396f826af70bb26e6c953fbd3fce0b#23
domain: http://lodlaundromat.org/.well-known/genid/9d396f826af70bb26e6c953fbd3fce0b#18
domain: http://lodlaundromat.org/.well-known/genid/5432219778cf6f0499743510fcfcf875#4
domain: http://lodlaundromat.org/.well-known/genid/9d396f826af70bb26e6c953fbd3fce0b#13
domain: http://lodlaundromat.org/.well-known/genid/9d396f826af70bb26e6c953fbd3fce0b#6

evaluates
range: Thing
domain: Thing
inverse of: is evaluated by
type: ObjectProperty
comment: An object property linking an agent to an entity which that agent evaluates, for example a funding agency that is evaluating a grant application to determine whether the proposed project is worthy of funding, or a publisher evaluating a manuscript to determine whether it is suitable for publication.
domain: (foaf) Agent
type: Property
range: Resource
domain: http://lodlaundromat.org/.well-known/genid/9d396f826af70bb26e6c953fbd3fce0b#1
domain: Resource
domain: http://lodlaundromat.org/.well-known/genid/5432219778cf6f0499743510fcfcf875#1
domain: http://lodlaundromat.org/.well-known/genid/5432219778cf6f0499743510fcfcf875#7
domain: http://lodlaundromat.org/.well-known/genid/9d396f826af70bb26e6c953fbd3fce0b#23
domain: http://lodlaundromat.org/.well-known/genid/9d396f826af70bb26e6c953fbd3fce0b#18
domain: http://lodlaundromat.org/.well-known/genid/5432219778cf6f0499743510fcfcf875#4
domain: http://lodlaundromat.org/.well-known/genid/9d396f826af70bb26e6c953fbd3fce0b#13
domain: http://lodlaundromat.org/.well-known/genid/9d396f826af70bb26e6c953fbd3fce0b#6

legacy
subclass of: Resource
subclass of: Thing
type: Class
comment: A gift of money or property specified in the will of a person, that is made after that person's death.
subclass of: gift
subclass of: funding
subclass of: http://lodlaundromat.org/.well-known/genid/5432219778cf6f0499743510fcfcf875#7
subclass of: financial entity
subclass of: http://lodlaundromat.org/.well-known/genid/5432219778cf6f0499743510fcfcf875#1

(foaf) OnlineAccount
subclass of: http://lodlaundromat.org/.well-known/genid/9d396f826af70bb26e6c953fbd3fce0b#23
subclass of: Resource
subclass of: Thing
type: Class
subclass of: http://lodlaundromat.org/.well-known/genid/9d396f826af70bb26e6c953fbd3fce0b#6
subclass of: http://lodlaundromat.org/.well-known/genid/9d396f826af70bb26e6c953fbd3fce0b#10
nsterm status: unstable
comment: An online account.
disjoint with: (foaf) Agent
disjoint with: (foaf) Document
disjoint with: (foaf) Project

registration authority
subclass of: Resource
subclass of: Thing
type: Class
comment: An agency with responsibility for registering and maintaining international standards, internet domain names, patents, controlled vocabularies and other similar entities required for reliable international cooperatative activities.
subclass of: (foaf) Organization
subclass of: (foaf) Agent
subclass of: http://lodlaundromat.org/.well-known/genid/9d396f826af70bb26e6c953fbd3fce0b#1
subclass of: http://lodlaundromat.org/.well-known/genid/9d396f826af70bb26e6c953fbd3fce0b#18
subclass of: http://lodlaundromat.org/.well-known/genid/5432219778cf6f0499743510fcfcf875#4
subclass of: http://lodlaundromat.org/.well-known/genid/9d396f826af70bb26e6c953fbd3fce0b#13
subclass of: http://lodlaundromat.org/.well-known/genid/9d396f826af70bb26e6c953fbd3fce0b#6
subclass of: http://lodlaundromat.org/.well-known/genid/9d396f826af70bb26e6c953fbd3fce0b#23
subclass of: http://lodlaundromat.org/.well-known/genid/5432219778cf6f0499743510fcfcf875#1
subclass of: http://lodlaundromat.org/.well-known/genid/5432219778cf6f0499743510fcfcf875#7

tender
subclass of: Resource
subclass of: Thing
type: Class
comment: Sealed bid or offer document submitted in response to a request for tenders, containing detailed information on costs, requirements and terms associated with a potential contract. (Adapted from http://www.businessdictionary.com/definition/tender.html).
subclass of: financial entity

employment application
subclass of: Resource
subclass of: Thing
type: Class
comment: The activity of applying for a job.
subclass of: application

has name suffix
sub property of: has information
type: DatatypeProperty
comment: The letters that should be displayed after a person's name.
sub property of: has contact information
type: Property
domain: (foaf) Agent
domain: http://lodlaundromat.org/.well-known/genid/9d396f826af70bb26e6c953fbd3fce0b#18
domain: http://lodlaundromat.org/.well-known/genid/9d396f826af70bb26e6c953fbd3fce0b#6
domain: http://lodlaundromat.org/.well-known/genid/9d396f826af70bb26e6c953fbd3fce0b#13
domain: http://lodlaundromat.org/.well-known/genid/9d396f826af70bb26e6c953fbd3fce0b#23
domain: http://lodlaundromat.org/.well-known/genid/9d396f826af70bb26e6c953fbd3fce0b#1
domain: http://lodlaundromat.org/.well-known/genid/5432219778cf6f0499743510fcfcf875#4
domain: Thing
domain: http://lodlaundromat.org/.well-known/genid/5432219778cf6f0499743510fcfcf875#7
domain: Resource
domain: http://lodlaundromat.org/.well-known/genid/5432219778cf6f0499743510fcfcf875#1
domain: (foaf) Person

uses equipment
range: Thing
domain: Thing
description: Domain constraints have been removed from this object property to permit it to be used in unforeseen ways.
type: ObjectProperty
comment: An object property linking an activity such as an expedition, a research project or an investigation, to an item of equipment employed in that activity.
range: equipment
sub property of: topObjectProperty
type: Property
range: Resource
range: infrastructure entity
domain: Resource

fellowship
subclass of: Resource
subclass of: Thing
type: Class
comment: The stipend paid to a fellow in a college or university.
subclass of: stipend
subclass of: funding
subclass of: http://lodlaundromat.org/.well-known/genid/5432219778cf6f0499743510fcfcf875#1
subclass of: http://lodlaundromat.org/.well-known/genid/5432219778cf6f0499743510fcfcf875#7
subclass of: financial entity

vendor
subclass of: Resource
subclass of: Thing
type: Class
comment: An agent who supplies goods or services in exchange for payment, in response to receipt of payment or of an official purchase order from a purchaser that is responded to by submission of an invoice for what is supplied.
subclass of: supplier
subclass of: (foaf) Agent
subclass of: http://lodlaundromat.org/.well-known/genid/9d396f826af70bb26e6c953fbd3fce0b#23
subclass of: http://lodlaundromat.org/.well-known/genid/5432219778cf6f0499743510fcfcf875#4
subclass of: http://lodlaundromat.org/.well-known/genid/9d396f826af70bb26e6c953fbd3fce0b#13
subclass of: http://lodlaundromat.org/.well-known/genid/9d396f826af70bb26e6c953fbd3fce0b#1
subclass of: http://lodlaundromat.org/.well-known/genid/9d396f826af70bb26e6c953fbd3fce0b#18
subclass of: http://lodlaundromat.org/.well-known/genid/5432219778cf6f0499743510fcfcf875#1
subclass of: http://lodlaundromat.org/.well-known/genid/5432219778cf6f0499743510fcfcf875#7
subclass of: http://lodlaundromat.org/.well-known/genid/9d396f826af70bb26e6c953fbd3fce0b#6

financial control system
subclass of: Resource
subclass of: Thing
type: Class
comment: A software system controlling the financial activities of an organization, for example determining full economic cost budgets for grant applications, and managing the funding of funded projects.
subclass of: computational service
subclass of: service
subclass of: infrastructure entity

studentship
subclass of: Resource
subclass of: Thing
type: Class
comment: A financial grant to a student to enable him/her to undertake advanced academic study.
subclass of: stipend
subclass of: funding
subclass of: http://lodlaundromat.org/.well-known/genid/5432219778cf6f0499743510fcfcf875#1
subclass of: http://lodlaundromat.org/.well-known/genid/5432219778cf6f0499743510fcfcf875#7
subclass of: financial entity

has personal identifier
sub property of: has information
description: owl:equivalentProperty <http://purl.org/spar/datacite/hasPersonalIdentifier> .
description: owl:equivalentProperty <http://purl.org/spar/scoro/hasPersonalIdentifier> .
type: DatatypeProperty
comment: A unique and unambiguous identifier for an individual person within a given context.
domain: (foaf) Person
sub property of: has contact information
sub property of: identifier
type: Property
domain: (foaf) Agent
domain: http://lodlaundromat.org/.well-known/genid/9d396f826af70bb26e6c953fbd3fce0b#18
domain: http://lodlaundromat.org/.well-known/genid/9d396f826af70bb26e6c953fbd3fce0b#6
domain: http://lodlaundromat.org/.well-known/genid/9d396f826af70bb26e6c953fbd3fce0b#13
domain: http://lodlaundromat.org/.well-known/genid/9d396f826af70bb26e6c953fbd3fce0b#23
domain: http://lodlaundromat.org/.well-known/genid/9d396f826af70bb26e6c953fbd3fce0b#1
domain: http://lodlaundromat.org/.well-known/genid/5432219778cf6f0499743510fcfcf875#4
domain: Thing
domain: http://lodlaundromat.org/.well-known/genid/5432219778cf6f0499743510fcfcf875#7
domain: Resource
domain: http://lodlaundromat.org/.well-known/genid/5432219778cf6f0499743510fcfcf875#1

is manufactured by
range: Thing
domain: Thing
type: ObjectProperty
comment: An object property relating a manufactured entity to its manufacturer.
range: manufacturer
inverse of: manufactures
type: Property
range: (foaf) Agent
range: http://lodlaundromat.org/.well-known/genid/9d396f826af70bb26e6c953fbd3fce0b#1
range: Resource
range: http://lodlaundromat.org/.well-known/genid/5432219778cf6f0499743510fcfcf875#1
range: http://lodlaundromat.org/.well-known/genid/5432219778cf6f0499743510fcfcf875#7
range: http://lodlaundromat.org/.well-known/genid/9d396f826af70bb26e6c953fbd3fce0b#23
range: http://lodlaundromat.org/.well-known/genid/9d396f826af70bb26e6c953fbd3fce0b#18
range: http://lodlaundromat.org/.well-known/genid/5432219778cf6f0499743510fcfcf875#4
range: http://lodlaundromat.org/.well-known/genid/9d396f826af70bb26e6c953fbd3fce0b#13
range: http://lodlaundromat.org/.well-known/genid/9d396f826af70bb26e6c953fbd3fce0b#6
domain: Resource

employs
range: Thing
domain: Thing
inverse of: is employed by
description: This property should not be used for the other meaning of 'employ', meaning to use something, e.g. 'He employed great skill . . .'/
type: ObjectProperty
comment: An object property relating an employing agent to an employed agent, for example a person or an organization, who is typically employed to undertaking specified work in exchange for payment.
domain: (foaf) Agent
range: (foaf) Agent
type: Property
range: http://lodlaundromat.org/.well-known/genid/9d396f826af70bb26e6c953fbd3fce0b#1
range: Resource
range: http://lodlaundromat.org/.well-known/genid/5432219778cf6f0499743510fcfcf875#1
range: http://lodlaundromat.org/.well-known/genid/5432219778cf6f0499743510fcfcf875#7
range: http://lodlaundromat.org/.well-known/genid/9d396f826af70bb26e6c953fbd3fce0b#23
range: http://lodlaundromat.org/.well-known/genid/9d396f826af70bb26e6c953fbd3fce0b#18
range: http://lodlaundromat.org/.well-known/genid/5432219778cf6f0499743510fcfcf875#4
range: http://lodlaundromat.org/.well-known/genid/9d396f826af70bb26e6c953fbd3fce0b#13
range: http://lodlaundromat.org/.well-known/genid/9d396f826af70bb26e6c953fbd3fce0b#6
domain: http://lodlaundromat.org/.well-known/genid/9d396f826af70bb26e6c953fbd3fce0b#1
domain: Resource
domain: http://lodlaundromat.org/.well-known/genid/5432219778cf6f0499743510fcfcf875#1
domain: http://lodlaundromat.org/.well-known/genid/5432219778cf6f0499743510fcfcf875#7
domain: http://lodlaundromat.org/.well-known/genid/9d396f826af70bb26e6c953fbd3fce0b#23
domain: http://lodlaundromat.org/.well-known/genid/9d396f826af70bb26e6c953fbd3fce0b#18
domain: http://lodlaundromat.org/.well-known/genid/5432219778cf6f0499743510fcfcf875#4
domain: http://lodlaundromat.org/.well-known/genid/9d396f826af70bb26e6c953fbd3fce0b#13
domain: http://lodlaundromat.org/.well-known/genid/9d396f826af70bb26e6c953fbd3fce0b#6

consortium agreement
subclass of: Resource
subclass of: Thing
type: Class
comment: A formal agreement between members of a consortium, for example between research groups at different universities engaged in a multi-partner research project.
subclass of: contract
subclass of: financial entity

department
subclass of: Resource
subclass of: Thing
type: Class
comment: A department or sub-section within a larger organization, for example a university academic department.
subclass of: (foaf) Organization
subclass of: (foaf) Agent
subclass of: http://lodlaundromat.org/.well-known/genid/9d396f826af70bb26e6c953fbd3fce0b#13
subclass of: http://lodlaundromat.org/.well-known/genid/5432219778cf6f0499743510fcfcf875#7
subclass of: http://lodlaundromat.org/.well-known/genid/9d396f826af70bb26e6c953fbd3fce0b#6
subclass of: http://lodlaundromat.org/.well-known/genid/9d396f826af70bb26e6c953fbd3fce0b#23
subclass of: http://lodlaundromat.org/.well-known/genid/9d396f826af70bb26e6c953fbd3fce0b#18
subclass of: http://lodlaundromat.org/.well-known/genid/9d396f826af70bb26e6c953fbd3fce0b#1
subclass of: http://lodlaundromat.org/.well-known/genid/5432219778cf6f0499743510fcfcf875#4
subclass of: http://lodlaundromat.org/.well-known/genid/5432219778cf6f0499743510fcfcf875#1

specifies expenditure
range: Thing
domain: Thing
description: Range constraints have been removed from this object property to permit it to be used in unforeseen ways.
type: ObjectProperty
comment: An object property relating an agent or a budget to the expenditure specified by that agent or budget.
domain: http://lodlaundromat.org/.well-known/genid/5432219778cf6f0499743510fcfcf875#4
type: Property
range: Resource
domain: Resource

post-nominals
sub property of: has information
sub property of: has contact information
type: DatatypeProperty
comment: The letters that should be displayed after a person's name to indicate qualification, membership or fellowship in a professional society, honours or elite status, e.g. MRCVS, FRCS, FRS, OBE, Kt.
sub property of: has name suffix
type: Property
domain: (foaf) Agent
domain: http://lodlaundromat.org/.well-known/genid/9d396f826af70bb26e6c953fbd3fce0b#18
domain: http://lodlaundromat.org/.well-known/genid/9d396f826af70bb26e6c953fbd3fce0b#6
domain: http://lodlaundromat.org/.well-known/genid/9d396f826af70bb26e6c953fbd3fce0b#13
domain: http://lodlaundromat.org/.well-known/genid/9d396f826af70bb26e6c953fbd3fce0b#23
domain: http://lodlaundromat.org/.well-known/genid/9d396f826af70bb26e6c953fbd3fce0b#1
domain: http://lodlaundromat.org/.well-known/genid/5432219778cf6f0499743510fcfcf875#4
domain: Thing
domain: http://lodlaundromat.org/.well-known/genid/5432219778cf6f0499743510fcfcf875#7
domain: Resource
domain: http://lodlaundromat.org/.well-known/genid/5432219778cf6f0499743510fcfcf875#1
domain: (foaf) Person

available funds
subclass of: Resource
subclass of: Thing
type: Class
comment: The amount available to spend in a budget category, equalling the income minus the expenditure to date plus future expenditure commitments.
subclass of: budget information
subclass of: financial entity

is output of
range: Thing
domain: Thing
description: Domain and range constraints have been removed from this object property to permit it to be used in unforeseen ways.
type: ObjectProperty
comment: An object property linking something that is created or produced to the activity that created or produced it.
inverse of: has output
type: Property
range: Resource
domain: Resource

grant
subclass of: Thing
subclass of: Resource
type: Class
comment: A financial award by a funding agency for a particular project or purpose, usually awarded on the basis of a competitive application.
subclass of: funding
subclass of: http://lodlaundromat.org/.well-known/genid/5432219778cf6f0499743510fcfcf875#1
subclass of: financial entity
subclass of: http://lodlaundromat.org/.well-known/genid/5432219778cf6f0499743510fcfcf875#7

account statement
subclass of: Resource
subclass of: Thing
type: Class
comment: A statement of income and expenditure for an account, typically presented as dated income receipts and outgoings against categories in a budget for that account.
subclass of: financial entity

family name initial
sub property of: has contact information
sub property of: has information
type: DatatypeProperty
comment: A data property permitting specification of the initial(s) of a person's family name.
sub property of: initials
type: Property
domain: (foaf) Agent
domain: http://lodlaundromat.org/.well-known/genid/9d396f826af70bb26e6c953fbd3fce0b#18
domain: http://lodlaundromat.org/.well-known/genid/9d396f826af70bb26e6c953fbd3fce0b#6
domain: http://lodlaundromat.org/.well-known/genid/9d396f826af70bb26e6c953fbd3fce0b#13
domain: http://lodlaundromat.org/.well-known/genid/9d396f826af70bb26e6c953fbd3fce0b#23
domain: http://lodlaundromat.org/.well-known/genid/9d396f826af70bb26e6c953fbd3fce0b#1
domain: http://lodlaundromat.org/.well-known/genid/5432219778cf6f0499743510fcfcf875#4
domain: Thing
domain: http://lodlaundromat.org/.well-known/genid/5432219778cf6f0499743510fcfcf875#7
domain: Resource
domain: http://lodlaundromat.org/.well-known/genid/5432219778cf6f0499743510fcfcf875#1
domain: (foaf) Person

endeavour
subclass of: Resource
type: Class
comment: In FRAPO, an endeavour is an activity such as a research investigation that is enabled by a project. An endeavour relate to the academic and practical aspects of undertaking that endeavour - thus for a research investigation the research itself, including the hypotheses being investigated, the experiments being undertaken, the data being gathered and analysed, the interpretations being drawn from the data, and the results obtained. In contrast, the project relates to the administrative aspects of undertaking an endeavour, including the funding obtained, the people employed, and the management of the project in terms of deadlines and deliverables.
subclass of: Thing

commitments
subclass of: Resource
subclass of: Thing
type: Class
comment: Money set aside to honour expenditures already made but for which no invoices have yet been received, or expenditures planned for the future, for example for salaries.
subclass of: budget information
subclass of: financial entity

owns IPR of
range: Thing
domain: Thing
type: ObjectProperty
comment: An object property linking an agent who owns IPR arising from or relating to an entity to that entity.
domain: (foaf) Agent
sub property of: owns
inverse of: has IPR owner
type: Property
range: Resource
domain: Resource
domain: http://lodlaundromat.org/.well-known/genid/9d396f826af70bb26e6c953fbd3fce0b#18
domain: http://lodlaundromat.org/.well-known/genid/9d396f826af70bb26e6c953fbd3fce0b#6
domain: http://lodlaundromat.org/.well-known/genid/9d396f826af70bb26e6c953fbd3fce0b#13
domain: http://lodlaundromat.org/.well-known/genid/9d396f826af70bb26e6c953fbd3fce0b#23
domain: http://lodlaundromat.org/.well-known/genid/9d396f826af70bb26e6c953fbd3fce0b#1
domain: http://lodlaundromat.org/.well-known/genid/5432219778cf6f0499743510fcfcf875#4
domain: http://lodlaundromat.org/.well-known/genid/5432219778cf6f0499743510fcfcf875#7
domain: http://lodlaundromat.org/.well-known/genid/5432219778cf6f0499743510fcfcf875#1

repository
subclass of: Resource
subclass of: Thing
type: Class
description: May also be described as an archive, or as a database.
comment: A facility in which entities can be deposited for long-term preservation.
subclass of: facility
subclass of: infrastructure entity

is applied for by
range: Thing
domain: Thing
type: ObjectProperty
comment: An object property linking something applied for to the agent making the application.
range: (foaf) Agent
inverse of: applies for
type: Property
range: http://lodlaundromat.org/.well-known/genid/9d396f826af70bb26e6c953fbd3fce0b#1
range: Resource
range: http://lodlaundromat.org/.well-known/genid/5432219778cf6f0499743510fcfcf875#1
range: http://lodlaundromat.org/.well-known/genid/5432219778cf6f0499743510fcfcf875#7
range: http://lodlaundromat.org/.well-known/genid/9d396f826af70bb26e6c953fbd3fce0b#23
range: http://lodlaundromat.org/.well-known/genid/9d396f826af70bb26e6c953fbd3fce0b#18
range: http://lodlaundromat.org/.well-known/genid/5432219778cf6f0499743510fcfcf875#4
range: http://lodlaundromat.org/.well-known/genid/9d396f826af70bb26e6c953fbd3fce0b#13
range: http://lodlaundromat.org/.well-known/genid/9d396f826af70bb26e6c953fbd3fce0b#6
domain: Resource

scholarship application
subclass of: Resource
subclass of: Thing
type: Class
comment: The activity of applying for an educational scholarship.
subclass of: application

uses facility
range: Thing
domain: Thing
description: Domain constraints have been removed from this object property to permit it to be used in unforeseen ways.
type: ObjectProperty
comment: An object property linking an activity such as an expedition, a research project or an investigation, to a facility employed in that activity.
range: facility
sub property of: topObjectProperty
type: Property
range: Resource
range: infrastructure entity
domain: Resource

(foaf) PersonalProfileDocument
subclass of: Resource
subclass of: Thing
type: Class
nsterm status: testing
comment: A personal profile RDF document.
subclass of: (foaf) Document
disjoint with: (foaf) Image
subclass of: http://lodlaundromat.org/.well-known/genid/9d396f826af70bb26e6c953fbd3fce0b#23
subclass of: http://lodlaundromat.org/.well-known/genid/9d396f826af70bb26e6c953fbd3fce0b#10
subclass of: http://lodlaundromat.org/.well-known/genid/9d396f826af70bb26e6c953fbd3fce0b#1
subclass of: http://lodlaundromat.org/.well-known/genid/9d396f826af70bb26e6c953fbd3fce0b#18

is funding agency for
range: Thing
domain: Thing
type: ObjectProperty
comment: An object property linking a funding agency to an entity for which it provides funding.
domain: funding agency
sub property of: supports
inverse of: has funding agency
type: Property
range: Resource
domain: http://lodlaundromat.org/.well-known/genid/5432219778cf6f0499743510fcfcf875#1
domain: http://lodlaundromat.org/.well-known/genid/5432219778cf6f0499743510fcfcf875#7
domain: Resource
domain: (foaf) Agent
domain: http://lodlaundromat.org/.well-known/genid/9d396f826af70bb26e6c953fbd3fce0b#1
domain: http://lodlaundromat.org/.well-known/genid/9d396f826af70bb26e6c953fbd3fce0b#23
domain: http://lodlaundromat.org/.well-known/genid/9d396f826af70bb26e6c953fbd3fce0b#18
domain: http://lodlaundromat.org/.well-known/genid/5432219778cf6f0499743510fcfcf875#4
domain: http://lodlaundromat.org/.well-known/genid/9d396f826af70bb26e6c953fbd3fce0b#13
domain: (foaf) Organization
domain: http://lodlaundromat.org/.well-known/genid/9d396f826af70bb26e6c953fbd3fce0b#6

manufacturer
subclass of: Thing
subclass of: Resource
type: Class
comment: An agent who manufactures goods or equipment.
subclass of: (foaf) Agent
subclass of: http://lodlaundromat.org/.well-known/genid/9d396f826af70bb26e6c953fbd3fce0b#18
subclass of: http://lodlaundromat.org/.well-known/genid/5432219778cf6f0499743510fcfcf875#4
subclass of: http://lodlaundromat.org/.well-known/genid/9d396f826af70bb26e6c953fbd3fce0b#13
subclass of: http://lodlaundromat.org/.well-known/genid/9d396f826af70bb26e6c953fbd3fce0b#1
subclass of: http://lodlaundromat.org/.well-known/genid/9d396f826af70bb26e6c953fbd3fce0b#23
subclass of: http://lodlaundromat.org/.well-known/genid/5432219778cf6f0499743510fcfcf875#1
subclass of: http://lodlaundromat.org/.well-known/genid/5432219778cf6f0499743510fcfcf875#7
subclass of: http://lodlaundromat.org/.well-known/genid/9d396f826af70bb26e6c953fbd3fce0b#6

laboratory
subclass of: Resource
subclass of: Thing
type: Class
comment: A facility in which research can be conducted.
subclass of: facility
subclass of: infrastructure entity

gift
subclass of: Resource
subclass of: Thing
type: Class
comment: A gift, donation, benefaction or legacy, typically of money.
subclass of: funding
subclass of: http://lodlaundromat.org/.well-known/genid/5432219778cf6f0499743510fcfcf875#7
subclass of: financial entity
subclass of: http://lodlaundromat.org/.well-known/genid/5432219778cf6f0499743510fcfcf875#1

purchaser
subclass of: Resource
subclass of: Thing
type: Class
comment: An agent who purchases something from a supplier.
subclass of: (foaf) Agent
subclass of: http://lodlaundromat.org/.well-known/genid/9d396f826af70bb26e6c953fbd3fce0b#6
subclass of: http://lodlaundromat.org/.well-known/genid/5432219778cf6f0499743510fcfcf875#7
subclass of: http://lodlaundromat.org/.well-known/genid/9d396f826af70bb26e6c953fbd3fce0b#13
subclass of: http://lodlaundromat.org/.well-known/genid/5432219778cf6f0499743510fcfcf875#4
subclass of: http://lodlaundromat.org/.well-known/genid/9d396f826af70bb26e6c953fbd3fce0b#1
subclass of: http://lodlaundromat.org/.well-known/genid/5432219778cf6f0499743510fcfcf875#1
subclass of: http://lodlaundromat.org/.well-known/genid/9d396f826af70bb26e6c953fbd3fce0b#23
subclass of: http://lodlaundromat.org/.well-known/genid/9d396f826af70bb26e6c953fbd3fce0b#18

awards
range: Thing
domain: Thing
inverse of: is awarded by
type: InverseFunctionalProperty
type: ObjectProperty
comment: An object property linking an agent to something the agent awards, for example linking a funding agency to a grant, a university to a degree, or an organization to a prize.
domain: (foaf) Agent
type: Property
range: Resource
domain: http://lodlaundromat.org/.well-known/genid/9d396f826af70bb26e6c953fbd3fce0b#1
domain: Resource
domain: http://lodlaundromat.org/.well-known/genid/5432219778cf6f0499743510fcfcf875#1
domain: http://lodlaundromat.org/.well-known/genid/5432219778cf6f0499743510fcfcf875#7
domain: http://lodlaundromat.org/.well-known/genid/9d396f826af70bb26e6c953fbd3fce0b#23
domain: http://lodlaundromat.org/.well-known/genid/9d396f826af70bb26e6c953fbd3fce0b#18
domain: http://lodlaundromat.org/.well-known/genid/5432219778cf6f0499743510fcfcf875#4
domain: http://lodlaundromat.org/.well-known/genid/9d396f826af70bb26e6c953fbd3fce0b#13
domain: http://lodlaundromat.org/.well-known/genid/9d396f826af70bb26e6c953fbd3fce0b#6

financial entity
subclass of: Resource
type: Class
comment: An entity primarily to do with money.
subclass of: Thing

budgeted amount
subclass of: Resource
subclass of: Thing
type: Class
comment: The amount of money originally available to spend in a particular budget category.
subclass of: budget information
subclass of: financial entity

quotation
subclass of: Resource
subclass of: Thing
type: Class
comment: A formal statement of promise (usually provided in response to a request for quotation) by potential supplier to supply goods or services at specified prices and within a specified period. Acceptance of the quotation by the buyer constitutes an agreement binding on both parties. (Shortened from http://www.businessdictionary.com/definition/quotation.html).
subclass of: financial entity

has funding agency
inverse of: is funding agency for
range: Thing
domain: Thing
type: ObjectProperty
comment: An object property linking something to a funding agency that provides funding for it.
range: funding agency
sub property of: is supported by
type: Property
range: http://lodlaundromat.org/.well-known/genid/5432219778cf6f0499743510fcfcf875#7
range: http://lodlaundromat.org/.well-known/genid/5432219778cf6f0499743510fcfcf875#1
range: Resource
domain: Resource
range: (foaf) Agent
range: http://lodlaundromat.org/.well-known/genid/9d396f826af70bb26e6c953fbd3fce0b#1
range: http://lodlaundromat.org/.well-known/genid/9d396f826af70bb26e6c953fbd3fce0b#23
range: http://lodlaundromat.org/.well-known/genid/9d396f826af70bb26e6c953fbd3fce0b#18
range: http://lodlaundromat.org/.well-known/genid/5432219778cf6f0499743510fcfcf875#4
range: http://lodlaundromat.org/.well-known/genid/9d396f826af70bb26e6c953fbd3fce0b#13
range: (foaf) Organization
range: http://lodlaundromat.org/.well-known/genid/9d396f826af70bb26e6c953fbd3fce0b#6

submits
inverse of: is submitted by
range: Thing
domain: Thing
type: ObjectProperty
comment: An object property linking an agent to an entity that is submitted to some third party, for example a grant application submitted to a funding agency, a manuscript submitted to a publisher, a quotation submitted by a vendor, or a dataset submitted by a researcher to a data repository.
domain: (foaf) Agent
type: Property
range: Resource
domain: http://lodlaundromat.org/.well-known/genid/9d396f826af70bb26e6c953fbd3fce0b#1
domain: Resource
domain: http://lodlaundromat.org/.well-known/genid/5432219778cf6f0499743510fcfcf875#1
domain: http://lodlaundromat.org/.well-known/genid/5432219778cf6f0499743510fcfcf875#7
domain: http://lodlaundromat.org/.well-known/genid/9d396f826af70bb26e6c953fbd3fce0b#23
domain: http://lodlaundromat.org/.well-known/genid/9d396f826af70bb26e6c953fbd3fce0b#18
domain: http://lodlaundromat.org/.well-known/genid/5432219778cf6f0499743510fcfcf875#4
domain: http://lodlaundromat.org/.well-known/genid/9d396f826af70bb26e6c953fbd3fce0b#13
domain: http://lodlaundromat.org/.well-known/genid/9d396f826af70bb26e6c953fbd3fce0b#6

service
subclass of: Thing
subclass of: Resource
type: Class
comment: A service of help to others, often requiring funding, employees, equipment and/or facilities for its provision, for example a library service, a transportation service, a DNA sequencing service.
subclass of: infrastructure entity

article processing charge
subclass of: Resource
subclass of: Thing
type: Class
comment: A fee levied by a publisher on an author or an institution to cover the cost of publishing an Open Access journal article. Also knows as Article Processing Fee, Article Publication Charge, Author Processing Charge or Author Publishing Charge.
subclass of: fee
subclass of: financial entity

was purchased by
range: Thing
domain: Thing
inverse of: purchases
description: Domain constraints have been removed from this object property to permit it to be used in unforeseen ways.
type: ObjectProperty
comment: An object property relating a purchased entity to its purchaser.
range: (foaf) Agent
type: Property
range: http://lodlaundromat.org/.well-known/genid/9d396f826af70bb26e6c953fbd3fce0b#1
range: Resource
range: http://lodlaundromat.org/.well-known/genid/5432219778cf6f0499743510fcfcf875#1
range: http://lodlaundromat.org/.well-known/genid/5432219778cf6f0499743510fcfcf875#7
range: http://lodlaundromat.org/.well-known/genid/9d396f826af70bb26e6c953fbd3fce0b#23
range: http://lodlaundromat.org/.well-known/genid/9d396f826af70bb26e6c953fbd3fce0b#18
range: http://lodlaundromat.org/.well-known/genid/5432219778cf6f0499743510fcfcf875#4
range: http://lodlaundromat.org/.well-known/genid/9d396f826af70bb26e6c953fbd3fce0b#13
range: http://lodlaundromat.org/.well-known/genid/9d396f826af70bb26e6c953fbd3fce0b#6
domain: Resource

is donated by
range: Thing
domain: Thing
description: Domain constraints have been removed from this object property to permit it to be used in unforeseen ways.
type: ObjectProperty
comment: An object property linking a gift to the benefactor who provided it.
range: (foaf) Agent
inverse of: donates
type: Property
range: http://lodlaundromat.org/.well-known/genid/9d396f826af70bb26e6c953fbd3fce0b#1
range: Resource
range: http://lodlaundromat.org/.well-known/genid/5432219778cf6f0499743510fcfcf875#1
range: http://lodlaundromat.org/.well-known/genid/5432219778cf6f0499743510fcfcf875#7
range: http://lodlaundromat.org/.well-known/genid/9d396f826af70bb26e6c953fbd3fce0b#23
range: http://lodlaundromat.org/.well-known/genid/9d396f826af70bb26e6c953fbd3fce0b#18
range: http://lodlaundromat.org/.well-known/genid/5432219778cf6f0499743510fcfcf875#4
range: http://lodlaundromat.org/.well-known/genid/9d396f826af70bb26e6c953fbd3fce0b#13
range: http://lodlaundromat.org/.well-known/genid/9d396f826af70bb26e6c953fbd3fce0b#6
domain: Resource

supplies
range: Thing
domain: Thing
domain: supplier
inverse of: is supplied by
description: Domain constraints on this object property have been relaxed to permit it to be used in unforeseen ways.
type: ObjectProperty
comment: An object property relating a supplier to a supplied entity, or to an agent to whom the entity is supplied.
domain: (foaf) Agent
type: Property
range: Resource
domain: http://lodlaundromat.org/.well-known/genid/9d396f826af70bb26e6c953fbd3fce0b#1
domain: Resource
domain: http://lodlaundromat.org/.well-known/genid/5432219778cf6f0499743510fcfcf875#1
domain: http://lodlaundromat.org/.well-known/genid/5432219778cf6f0499743510fcfcf875#7
domain: http://lodlaundromat.org/.well-known/genid/9d396f826af70bb26e6c953fbd3fce0b#23
domain: http://lodlaundromat.org/.well-known/genid/9d396f826af70bb26e6c953fbd3fce0b#18
domain: http://lodlaundromat.org/.well-known/genid/5432219778cf6f0499743510fcfcf875#4
domain: http://lodlaundromat.org/.well-known/genid/9d396f826af70bb26e6c953fbd3fce0b#13
domain: http://lodlaundromat.org/.well-known/genid/9d396f826af70bb26e6c953fbd3fce0b#6

equipment
subclass of: Resource
subclass of: Thing
type: Class
comment: An item of equipment or apparatus, or a laboratory instrument, for example a refrigerated centrifuge.
subclass of: infrastructure entity

income
subclass of: Resource
subclass of: Thing
type: Class
comment: Money coming into an account. May be associated with a particular budget category.
subclass of: budget information
subclass of: financial entity

percentage of total funding
range: Thing
domain: Thing
type: ObjectProperty
comment: An object property linking funding to a budget, specifying what fraction of the total budget is provided by that source of funding.
domain: funding
range: budget
type: Property
range: Resource
range: http://lodlaundromat.org/.well-known/genid/5432219778cf6f0499743510fcfcf875#4
range: financial entity
domain: Resource
domain: http://lodlaundromat.org/.well-known/genid/5432219778cf6f0499743510fcfcf875#1
domain: http://lodlaundromat.org/.well-known/genid/5432219778cf6f0499743510fcfcf875#7
domain: financial entity

has familiar suffix
sub property of: has information
sub property of: has contact information
type: DatatypeProperty
comment: The letters that may be displayed after a person's name to indicate familial status, e.g. Sn., Jn., III, 3rd.
sub property of: has name suffix
type: Property
domain: (foaf) Agent
domain: http://lodlaundromat.org/.well-known/genid/9d396f826af70bb26e6c953fbd3fce0b#18
domain: http://lodlaundromat.org/.well-known/genid/9d396f826af70bb26e6c953fbd3fce0b#6
domain: http://lodlaundromat.org/.well-known/genid/9d396f826af70bb26e6c953fbd3fce0b#13
domain: http://lodlaundromat.org/.well-known/genid/9d396f826af70bb26e6c953fbd3fce0b#23
domain: http://lodlaundromat.org/.well-known/genid/9d396f826af70bb26e6c953fbd3fce0b#1
domain: http://lodlaundromat.org/.well-known/genid/5432219778cf6f0499743510fcfcf875#4
domain: Thing
domain: http://lodlaundromat.org/.well-known/genid/5432219778cf6f0499743510fcfcf875#7
domain: Resource
domain: http://lodlaundromat.org/.well-known/genid/5432219778cf6f0499743510fcfcf875#1
domain: (foaf) Person

material output
subclass of: Resource
subclass of: Thing
type: Class
comment: A material or physical output created or produced as a result of a project or an endeavour such as a research investigation. Examples include a building constructed as a result of a building project, and research outputs such as a cell line, a mouse mutant or a new form of microscope.
subclass of: output
subclass of: infrastructure entity
subclass of: equipment

college
subclass of: Resource
subclass of: Thing
type: Class
comment: An academic organization that is either a small degree-giving university, or (in the OxBridge sense) an independent corporation of scholars within a larger university, providing undergraduate tuition and a social environment for its students and fellows.
subclass of: (foaf) Organization
subclass of: (foaf) Agent
subclass of: http://lodlaundromat.org/.well-known/genid/9d396f826af70bb26e6c953fbd3fce0b#23
subclass of: http://lodlaundromat.org/.well-known/genid/5432219778cf6f0499743510fcfcf875#7
subclass of: http://lodlaundromat.org/.well-known/genid/9d396f826af70bb26e6c953fbd3fce0b#18
subclass of: http://lodlaundromat.org/.well-known/genid/5432219778cf6f0499743510fcfcf875#1
subclass of: http://lodlaundromat.org/.well-known/genid/9d396f826af70bb26e6c953fbd3fce0b#6
subclass of: http://lodlaundromat.org/.well-known/genid/9d396f826af70bb26e6c953fbd3fce0b#13
subclass of: http://lodlaundromat.org/.well-known/genid/5432219778cf6f0499743510fcfcf875#4
subclass of: http://lodlaundromat.org/.well-known/genid/9d396f826af70bb26e6c953fbd3fce0b#1

applies for
inverse of: is applied for by
range: Thing
domain: Thing
type: ObjectProperty
comment: An object property linking an agent to something for which that agent applies, for example a job, membership of an organization, or a grant from a funding agency.
domain: (foaf) Agent
type: Property
range: Resource
domain: http://lodlaundromat.org/.well-known/genid/9d396f826af70bb26e6c953fbd3fce0b#1
domain: Resource
domain: http://lodlaundromat.org/.well-known/genid/5432219778cf6f0499743510fcfcf875#1
domain: http://lodlaundromat.org/.well-known/genid/5432219778cf6f0499743510fcfcf875#7
domain: http://lodlaundromat.org/.well-known/genid/9d396f826af70bb26e6c953fbd3fce0b#23
domain: http://lodlaundromat.org/.well-known/genid/9d396f826af70bb26e6c953fbd3fce0b#18
domain: http://lodlaundromat.org/.well-known/genid/5432219778cf6f0499743510fcfcf875#4
domain: http://lodlaundromat.org/.well-known/genid/9d396f826af70bb26e6c953fbd3fce0b#13
domain: http://lodlaundromat.org/.well-known/genid/9d396f826af70bb26e6c953fbd3fce0b#6

enables
range: Thing
domain: Thing
inverse of: is enabled by
description: Domain and range constraints have been removed from this object property to permit it to be used in unforeseen ways.
type: ObjectProperty
comment: An object property relating an entity to another entity that it enables, e.g. linking a project to an endeavour that the project enables.
type: Property
range: Resource
domain: Resource

investment
subclass of: Resource
subclass of: Thing
type: Class
comment: An investment of money, generally in stocks and shares, or in property, for the purpose of safeguarding the capital and yielding an income.
subclass of: financial entity

provides service
range: Thing
domain: Thing
description: Range constraints have been removed from this object property to permit it to be used in unforeseen ways.
type: ObjectProperty
comment: An agent that provides a service.
domain: (foaf) Agent
type: Property
range: Resource
domain: http://lodlaundromat.org/.well-known/genid/9d396f826af70bb26e6c953fbd3fce0b#1
domain: Resource
domain: http://lodlaundromat.org/.well-known/genid/5432219778cf6f0499743510fcfcf875#1
domain: http://lodlaundromat.org/.well-known/genid/5432219778cf6f0499743510fcfcf875#7
domain: http://lodlaundromat.org/.well-known/genid/9d396f826af70bb26e6c953fbd3fce0b#23
domain: http://lodlaundromat.org/.well-known/genid/9d396f826af70bb26e6c953fbd3fce0b#18
domain: http://lodlaundromat.org/.well-known/genid/5432219778cf6f0499743510fcfcf875#4
domain: http://lodlaundromat.org/.well-known/genid/9d396f826af70bb26e6c953fbd3fce0b#13
domain: http://lodlaundromat.org/.well-known/genid/9d396f826af70bb26e6c953fbd3fce0b#6

funding programme
subclass of: Resource
type: Class
comment: A programme of related funded activities or projects, typically established by a funding agency. Often associated with publication of a call for applications (fabio:CallForApplications).
subclass of: Thing

research group
subclass of: Resource
subclass of: Thing
type: Class
comment: A group of people, usually within a university department or a research institute, and typically under a single group leader, dedicated to working together to undertake research on one or more topics. May also be called a research unit.
subclass of: (foaf) Group
subclass of: (foaf) Agent
subclass of: http://lodlaundromat.org/.well-known/genid/9d396f826af70bb26e6c953fbd3fce0b#23
subclass of: http://lodlaundromat.org/.well-known/genid/5432219778cf6f0499743510fcfcf875#7
subclass of: http://lodlaundromat.org/.well-known/genid/5432219778cf6f0499743510fcfcf875#1
subclass of: http://lodlaundromat.org/.well-known/genid/5432219778cf6f0499743510fcfcf875#4
subclass of: http://lodlaundromat.org/.well-known/genid/9d396f826af70bb26e6c953fbd3fce0b#6
subclass of: http://lodlaundromat.org/.well-known/genid/9d396f826af70bb26e6c953fbd3fce0b#18
subclass of: http://lodlaundromat.org/.well-known/genid/9d396f826af70bb26e6c953fbd3fce0b#13
subclass of: http://lodlaundromat.org/.well-known/genid/9d396f826af70bb26e6c953fbd3fce0b#1

purchase order
subclass of: Resource
subclass of: Thing
type: Class
comment: An official order from a purchasing institution to a supplier for the purchase of goods or services, often issued in response to the receipt of a quotation from the supplier.
subclass of: financial entity

small to medium enterprise
subclass of: Resource
subclass of: Thing
type: Class
comment: A small to medium enterprise, having up to 250 employees.
label: sme
subclass of: company
subclass of: (foaf) Organization
subclass of: (foaf) Agent
subclass of: http://lodlaundromat.org/.well-known/genid/9d396f826af70bb26e6c953fbd3fce0b#6
subclass of: http://lodlaundromat.org/.well-known/genid/9d396f826af70bb26e6c953fbd3fce0b#13
subclass of: http://lodlaundromat.org/.well-known/genid/5432219778cf6f0499743510fcfcf875#4
subclass of: http://lodlaundromat.org/.well-known/genid/5432219778cf6f0499743510fcfcf875#1
subclass of: http://lodlaundromat.org/.well-known/genid/9d396f826af70bb26e6c953fbd3fce0b#1
subclass of: http://lodlaundromat.org/.well-known/genid/9d396f826af70bb26e6c953fbd3fce0b#23
subclass of: http://lodlaundromat.org/.well-known/genid/5432219778cf6f0499743510fcfcf875#7
subclass of: http://lodlaundromat.org/.well-known/genid/9d396f826af70bb26e6c953fbd3fce0b#18

(foaf) Group
subclass of: Resource
subclass of: Thing
type: Class
nsterm status: unstable
comment: A class of Agents.
subclass of: (foaf) Agent
disjoint with: (foaf) Organization
disjoint with: (foaf) Person
subclass of: http://lodlaundromat.org/.well-known/genid/9d396f826af70bb26e6c953fbd3fce0b#1
subclass of: http://lodlaundromat.org/.well-known/genid/9d396f826af70bb26e6c953fbd3fce0b#13
subclass of: http://lodlaundromat.org/.well-known/genid/9d396f826af70bb26e6c953fbd3fce0b#23
subclass of: http://lodlaundromat.org/.well-known/genid/9d396f826af70bb26e6c953fbd3fce0b#6
subclass of: http://lodlaundromat.org/.well-known/genid/5432219778cf6f0499743510fcfcf875#4
subclass of: http://lodlaundromat.org/.well-known/genid/5432219778cf6f0499743510fcfcf875#7
subclass of: http://lodlaundromat.org/.well-known/genid/5432219778cf6f0499743510fcfcf875#1
subclass of: http://lodlaundromat.org/.well-known/genid/9d396f826af70bb26e6c953fbd3fce0b#18

postal address
subclass of: Resource
type: Class
comment: A postal address.
subclass of: Thing

has alternate name
sub property of: has information
type: DatatypeProperty
comment: An alternative name that a person uses for professional purposes, for example the pen name of an author, or a married woman's maiden name used as her professional name.
sub property of: has contact information
type: Property
domain: (foaf) Agent
domain: http://lodlaundromat.org/.well-known/genid/9d396f826af70bb26e6c953fbd3fce0b#18
domain: http://lodlaundromat.org/.well-known/genid/9d396f826af70bb26e6c953fbd3fce0b#6
domain: http://lodlaundromat.org/.well-known/genid/9d396f826af70bb26e6c953fbd3fce0b#13
domain: http://lodlaundromat.org/.well-known/genid/9d396f826af70bb26e6c953fbd3fce0b#23
domain: http://lodlaundromat.org/.well-known/genid/9d396f826af70bb26e6c953fbd3fce0b#1
domain: http://lodlaundromat.org/.well-known/genid/5432219778cf6f0499743510fcfcf875#4
domain: Thing
domain: http://lodlaundromat.org/.well-known/genid/5432219778cf6f0499743510fcfcf875#7
domain: Resource
domain: http://lodlaundromat.org/.well-known/genid/5432219778cf6f0499743510fcfcf875#1
domain: (foaf) Person

(foaf) Image
subclass of: Thing
subclass of: Resource
type: Class
nsterm status: testing
comment: An image.
subclass of: (foaf) Document
disjoint with: (foaf) PersonalProfileDocument
subclass of: http://lodlaundromat.org/.well-known/genid/9d396f826af70bb26e6c953fbd3fce0b#1
subclass of: http://lodlaundromat.org/.well-known/genid/9d396f826af70bb26e6c953fbd3fce0b#18
subclass of: http://lodlaundromat.org/.well-known/genid/9d396f826af70bb26e6c953fbd3fce0b#23
subclass of: http://lodlaundromat.org/.well-known/genid/9d396f826af70bb26e6c953fbd3fce0b#10

(foaf) Person
subclass of: Thing
subclass of: Resource
type: Class
nsterm status: stable
comment: A person.
subclass of: (foaf) Agent
disjoint with: (foaf) Group
disjoint with: (foaf) Organization
subclass of: http://lodlaundromat.org/.well-known/genid/9d396f826af70bb26e6c953fbd3fce0b#13
subclass of: http://lodlaundromat.org/.well-known/genid/9d396f826af70bb26e6c953fbd3fce0b#23
subclass of: http://lodlaundromat.org/.well-known/genid/9d396f826af70bb26e6c953fbd3fce0b#18
subclass of: http://lodlaundromat.org/.well-known/genid/5432219778cf6f0499743510fcfcf875#1
subclass of: http://lodlaundromat.org/.well-known/genid/5432219778cf6f0499743510fcfcf875#4
subclass of: http://lodlaundromat.org/.well-known/genid/9d396f826af70bb26e6c953fbd3fce0b#1
subclass of: http://lodlaundromat.org/.well-known/genid/5432219778cf6f0499743510fcfcf875#7
subclass of: http://lodlaundromat.org/.well-known/genid/9d396f826af70bb26e6c953fbd3fce0b#6

research institute
subclass of: Resource
subclass of: Thing
type: Class
comment: An organization primarily dedicated to undertaking research, that might be part of a university or of a commercial company, or might be independently funded by a research funding agency.
subclass of: (foaf) Organization
subclass of: (foaf) Agent
subclass of: http://lodlaundromat.org/.well-known/genid/5432219778cf6f0499743510fcfcf875#1
subclass of: http://lodlaundromat.org/.well-known/genid/5432219778cf6f0499743510fcfcf875#4
subclass of: http://lodlaundromat.org/.well-known/genid/5432219778cf6f0499743510fcfcf875#7
subclass of: http://lodlaundromat.org/.well-known/genid/9d396f826af70bb26e6c953fbd3fce0b#6
subclass of: http://lodlaundromat.org/.well-known/genid/9d396f826af70bb26e6c953fbd3fce0b#18
subclass of: http://lodlaundromat.org/.well-known/genid/9d396f826af70bb26e6c953fbd3fce0b#13
subclass of: http://lodlaundromat.org/.well-known/genid/9d396f826af70bb26e6c953fbd3fce0b#1
subclass of: http://lodlaundromat.org/.well-known/genid/9d396f826af70bb26e6c953fbd3fce0b#23

employment contract
subclass of: Resource
subclass of: Thing
type: Class
comment: A contract of employment between a person and an organization.
subclass of: contract
subclass of: financial entity

data repository
subclass of: Resource
subclass of: Thing
type: Class
description: May also be described as a data archive, or as a database.
comment: A facility in which digital data are deposited for long-term preservation and (optional) publication.
subclass of: repository
subclass of: facility
subclass of: infrastructure entity

uses service
range: Thing
domain: Thing
description: Domain constraints have been removed from this object property to permit it to be used in unforeseen ways.
type: ObjectProperty
comment: An object property linking an activity such as an expedition, a research project or an investigation, to a service employed in that activity.
range: service
type: Property
range: Resource
range: infrastructure entity
domain: Resource

output
subclass of: Resource
type: Class
description: Ontology terms and definitions for most publishable project outputs are given as 'Expression' classes in FaBiO, the FRBR-aligned Bibliographic Ontology, e.g. fabio:JournalArticle, fabio:DataSet. For 'deliverables', use frapo:Deliverable. For material outputs, use frapo:MaterialOutput.
comment: Something that is created or produced as a result of a project or an endeavour. Examples include a building resulting from a building project, educated students graduating from an educational programme, and a journal article published as a result of a research project. Research outputs can also include reports, datasets, experimental protocols, workflows and mathematical models, and material outputs such as a cell line, a mouse mutant or a new form of microscope.
subclass of: equipment
subclass of: Thing
subclass of: infrastructure entity

budget category
subclass of: Resource
subclass of: Thing
type: Class
comment: A category of expenditure within a budget, determining what the allocated money can be spent on, for example salaries, equipment, travel.
subclass of: financial entity

funding application
subclass of: Resource
subclass of: Thing
type: Class
description: For the documents supporting a funding application, use fabio:GrantApplicationDocument and fabio:CaseForSupportDocument.
comment: The activity of applying for funding.
subclass of: application

company
subclass of: Resource
subclass of: Thing
type: Class
comment: A commercial company or business run for profit.
subclass of: (foaf) Organization
subclass of: (foaf) Agent
subclass of: http://lodlaundromat.org/.well-known/genid/9d396f826af70bb26e6c953fbd3fce0b#18
subclass of: http://lodlaundromat.org/.well-known/genid/5432219778cf6f0499743510fcfcf875#7
subclass of: http://lodlaundromat.org/.well-known/genid/9d396f826af70bb26e6c953fbd3fce0b#1
subclass of: http://lodlaundromat.org/.well-known/genid/9d396f826af70bb26e6c953fbd3fce0b#6
subclass of: http://lodlaundromat.org/.well-known/genid/5432219778cf6f0499743510fcfcf875#1
subclass of: http://lodlaundromat.org/.well-known/genid/9d396f826af70bb26e6c953fbd3fce0b#13
subclass of: http://lodlaundromat.org/.well-known/genid/9d396f826af70bb26e6c953fbd3fce0b#23
subclass of: http://lodlaundromat.org/.well-known/genid/5432219778cf6f0499743510fcfcf875#4

funding agency
subclass of: Resource
subclass of: Thing
type: Class
comment: An organization that provides funding for projects, often in the form of grants awarded on the basis of competitive application.
subclass of: (foaf) Organization
subclass of: (foaf) Agent
subclass of: http://lodlaundromat.org/.well-known/genid/9d396f826af70bb26e6c953fbd3fce0b#18
subclass of: http://lodlaundromat.org/.well-known/genid/9d396f826af70bb26e6c953fbd3fce0b#1
subclass of: http://lodlaundromat.org/.well-known/genid/9d396f826af70bb26e6c953fbd3fce0b#6
subclass of: http://lodlaundromat.org/.well-known/genid/9d396f826af70bb26e6c953fbd3fce0b#23
subclass of: http://lodlaundromat.org/.well-known/genid/9d396f826af70bb26e6c953fbd3fce0b#13
subclass of: http://lodlaundromat.org/.well-known/genid/5432219778cf6f0499743510fcfcf875#1
subclass of: http://lodlaundromat.org/.well-known/genid/5432219778cf6f0499743510fcfcf875#4
subclass of: http://lodlaundromat.org/.well-known/genid/5432219778cf6f0499743510fcfcf875#7

is employed by
range: Thing
domain: Thing
description: This property should not be used for the other meaning of 'employ', meaning to use something, e.g. 'Great skill is employed by master craftsmen . . .'/
type: ObjectProperty
comment: An object property relating an employed agent, typically a person or an organization, to an employing agent.
domain: (foaf) Agent
range: (foaf) Agent
sub property of: topObjectProperty
inverse of: employs
type: Property
range: http://lodlaundromat.org/.well-known/genid/9d396f826af70bb26e6c953fbd3fce0b#1
range: Resource
range: http://lodlaundromat.org/.well-known/genid/5432219778cf6f0499743510fcfcf875#1
range: http://lodlaundromat.org/.well-known/genid/5432219778cf6f0499743510fcfcf875#7
range: http://lodlaundromat.org/.well-known/genid/9d396f826af70bb26e6c953fbd3fce0b#23
range: http://lodlaundromat.org/.well-known/genid/9d396f826af70bb26e6c953fbd3fce0b#18
range: http://lodlaundromat.org/.well-known/genid/5432219778cf6f0499743510fcfcf875#4
range: http://lodlaundromat.org/.well-known/genid/9d396f826af70bb26e6c953fbd3fce0b#13
range: http://lodlaundromat.org/.well-known/genid/9d396f826af70bb26e6c953fbd3fce0b#6
domain: http://lodlaundromat.org/.well-known/genid/9d396f826af70bb26e6c953fbd3fce0b#1
domain: Resource
domain: http://lodlaundromat.org/.well-known/genid/5432219778cf6f0499743510fcfcf875#1
domain: http://lodlaundromat.org/.well-known/genid/5432219778cf6f0499743510fcfcf875#7
domain: http://lodlaundromat.org/.well-known/genid/9d396f826af70bb26e6c953fbd3fce0b#23
domain: http://lodlaundromat.org/.well-known/genid/9d396f826af70bb26e6c953fbd3fce0b#18
domain: http://lodlaundromat.org/.well-known/genid/5432219778cf6f0499743510fcfcf875#4
domain: http://lodlaundromat.org/.well-known/genid/9d396f826af70bb26e6c953fbd3fce0b#13
domain: http://lodlaundromat.org/.well-known/genid/9d396f826af70bb26e6c953fbd3fce0b#6

funds
range: Thing
domain: Thing
type: ObjectProperty
comment: An object property that links a grant to something that it funds (i.e. that it finances or pays for), or that links an agent providing funding to something that it funds. This flexibility is given because of alternative usages of the English word 'funds'. [See also frapo:awards and frapo:supports.]
sub property of: supports
inverse of: is funded by
type: Property
range: Resource
domain: http://lodlaundromat.org/.well-known/genid/5432219778cf6f0499743510fcfcf875#1
domain: http://lodlaundromat.org/.well-known/genid/5432219778cf6f0499743510fcfcf875#7
domain: Resource

is awarded by
range: Thing
domain: Thing
description: Domain constraints have been removed from this object property to permit it to be used in unforeseen ways.
type: FunctionalProperty
type: ObjectProperty
comment: An object property linking something awarded to the agent making the award, for example linking a grant to a funding agency, a degree to a university, or a prize to the awarding organization.
range: (foaf) Agent
inverse of: awards
type: Property
range: http://lodlaundromat.org/.well-known/genid/9d396f826af70bb26e6c953fbd3fce0b#1
range: Resource
range: http://lodlaundromat.org/.well-known/genid/5432219778cf6f0499743510fcfcf875#1
range: http://lodlaundromat.org/.well-known/genid/5432219778cf6f0499743510fcfcf875#7
range: http://lodlaundromat.org/.well-known/genid/9d396f826af70bb26e6c953fbd3fce0b#23
range: http://lodlaundromat.org/.well-known/genid/9d396f826af70bb26e6c953fbd3fce0b#18
range: http://lodlaundromat.org/.well-known/genid/5432219778cf6f0499743510fcfcf875#4
range: http://lodlaundromat.org/.well-known/genid/9d396f826af70bb26e6c953fbd3fce0b#13
range: http://lodlaundromat.org/.well-known/genid/9d396f826af70bb26e6c953fbd3fce0b#6
domain: Resource

application
subclass of: Resource
type: Class
comment: The activity of making an application, for example for a job, or for funding.
subclass of: Thing

purchases from
inverse of: sells to
range: Thing
domain: Thing
description: Domain and range constraints on this object property have been relaxed to permit it to be used in unforeseen ways.
type: ObjectProperty
comment: An object property relating a purchaser to a supplier from whom the purchase is made.
domain: (foaf) Agent
range: (foaf) Agent
type: Property
range: http://lodlaundromat.org/.well-known/genid/9d396f826af70bb26e6c953fbd3fce0b#1
range: Resource
range: http://lodlaundromat.org/.well-known/genid/5432219778cf6f0499743510fcfcf875#1
range: http://lodlaundromat.org/.well-known/genid/5432219778cf6f0499743510fcfcf875#7
range: http://lodlaundromat.org/.well-known/genid/9d396f826af70bb26e6c953fbd3fce0b#23
range: http://lodlaundromat.org/.well-known/genid/9d396f826af70bb26e6c953fbd3fce0b#18
range: http://lodlaundromat.org/.well-known/genid/5432219778cf6f0499743510fcfcf875#4
range: http://lodlaundromat.org/.well-known/genid/9d396f826af70bb26e6c953fbd3fce0b#13
range: http://lodlaundromat.org/.well-known/genid/9d396f826af70bb26e6c953fbd3fce0b#6
domain: http://lodlaundromat.org/.well-known/genid/9d396f826af70bb26e6c953fbd3fce0b#1
domain: Resource
domain: http://lodlaundromat.org/.well-known/genid/5432219778cf6f0499743510fcfcf875#1
domain: http://lodlaundromat.org/.well-known/genid/5432219778cf6f0499743510fcfcf875#7
domain: http://lodlaundromat.org/.well-known/genid/9d396f826af70bb26e6c953fbd3fce0b#23
domain: http://lodlaundromat.org/.well-known/genid/9d396f826af70bb26e6c953fbd3fce0b#18
domain: http://lodlaundromat.org/.well-known/genid/5432219778cf6f0499743510fcfcf875#4
domain: http://lodlaundromat.org/.well-known/genid/9d396f826af70bb26e6c953fbd3fce0b#13
domain: http://lodlaundromat.org/.well-known/genid/9d396f826af70bb26e6c953fbd3fce0b#6

donates
inverse of: is donated by
range: Thing
domain: Thing
description: Range constraints have been removed from this object property to permit it to be used in unforeseen ways.
type: ObjectProperty
comment: An object property linking a benefactor to a gift.
domain: (foaf) Agent
type: Property
range: Resource
domain: http://lodlaundromat.org/.well-known/genid/9d396f826af70bb26e6c953fbd3fce0b#1
domain: Resource
domain: http://lodlaundromat.org/.well-known/genid/5432219778cf6f0499743510fcfcf875#1
domain: http://lodlaundromat.org/.well-known/genid/5432219778cf6f0499743510fcfcf875#7
domain: http://lodlaundromat.org/.well-known/genid/9d396f826af70bb26e6c953fbd3fce0b#23
domain: http://lodlaundromat.org/.well-known/genid/9d396f826af70bb26e6c953fbd3fce0b#18
domain: http://lodlaundromat.org/.well-known/genid/5432219778cf6f0499743510fcfcf875#4
domain: http://lodlaundromat.org/.well-known/genid/9d396f826af70bb26e6c953fbd3fce0b#13
domain: http://lodlaundromat.org/.well-known/genid/9d396f826af70bb26e6c953fbd3fce0b#6

computational agent
subclass of: Resource
subclass of: Thing
type: Class
comment: A computer system or software program whose action has an effect on external events, for example a laboratory robot that undertakes your experiments, or the financial control system that controls an institution's payrole, or that, following programmed business rules, prevents the principal investigator from placing an order for research equipment because there is insufficient money left in the project budget.
subclass of: (foaf) Agent
subclass of: http://lodlaundromat.org/.well-known/genid/9d396f826af70bb26e6c953fbd3fce0b#18
subclass of: http://lodlaundromat.org/.well-known/genid/9d396f826af70bb26e6c953fbd3fce0b#13
subclass of: http://lodlaundromat.org/.well-known/genid/9d396f826af70bb26e6c953fbd3fce0b#6
subclass of: http://lodlaundromat.org/.well-known/genid/9d396f826af70bb26e6c953fbd3fce0b#23
subclass of: http://lodlaundromat.org/.well-known/genid/5432219778cf6f0499743510fcfcf875#1
subclass of: http://lodlaundromat.org/.well-known/genid/5432219778cf6f0499743510fcfcf875#4
subclass of: http://lodlaundromat.org/.well-known/genid/9d396f826af70bb26e6c953fbd3fce0b#1
subclass of: http://lodlaundromat.org/.well-known/genid/5432219778cf6f0499743510fcfcf875#7

has degrees
sub property of: has information
sub property of: has contact information
type: DatatypeProperty
comment: The letters that should be displayed after a person's name to indicate an academic degree, e.g. BA, BVSc, PhD, DSc.
sub property of: has name suffix
type: Property
domain: (foaf) Person
domain: Thing
domain: Resource
domain: (foaf) Agent
domain: http://lodlaundromat.org/.well-known/genid/9d396f826af70bb26e6c953fbd3fce0b#13
domain: http://lodlaundromat.org/.well-known/genid/9d396f826af70bb26e6c953fbd3fce0b#23
domain: http://lodlaundromat.org/.well-known/genid/9d396f826af70bb26e6c953fbd3fce0b#18
domain: http://lodlaundromat.org/.well-known/genid/5432219778cf6f0499743510fcfcf875#1
domain: http://lodlaundromat.org/.well-known/genid/5432219778cf6f0499743510fcfcf875#4
domain: http://lodlaundromat.org/.well-known/genid/9d396f826af70bb26e6c953fbd3fce0b#1
domain: http://lodlaundromat.org/.well-known/genid/5432219778cf6f0499743510fcfcf875#7
domain: http://lodlaundromat.org/.well-known/genid/9d396f826af70bb26e6c953fbd3fce0b#6

(foaf) Organization
subclass of: Resource
subclass of: Thing
type: Class
nsterm status: unstable
comment: An organization.
subclass of: (foaf) Agent
disjoint with: (foaf) Person
disjoint with: (foaf) Group
description: owl:equivalentClass cerf:OrganizationalUnit .
subclass of: http://lodlaundromat.org/.well-known/genid/9d396f826af70bb26e6c953fbd3fce0b#23
subclass of: http://lodlaundromat.org/.well-known/genid/9d396f826af70bb26e6c953fbd3fce0b#18
subclass of: http://lodlaundromat.org/.well-known/genid/9d396f826af70bb26e6c953fbd3fce0b#6
subclass of: http://lodlaundromat.org/.well-known/genid/9d396f826af70bb26e6c953fbd3fce0b#1
subclass of: http://lodlaundromat.org/.well-known/genid/5432219778cf6f0499743510fcfcf875#7
subclass of: http://lodlaundromat.org/.well-known/genid/9d396f826af70bb26e6c953fbd3fce0b#13
subclass of: http://lodlaundromat.org/.well-known/genid/5432219778cf6f0499743510fcfcf875#4
subclass of: http://lodlaundromat.org/.well-known/genid/5432219778cf6f0499743510fcfcf875#1

research information system
subclass of: Resource
subclass of: Thing
type: Class
comment: A database containing administrative information about the research undertaken in an institution, and the publications and other outputs from such research.
subclass of: computational service
subclass of: infrastructure entity
subclass of: service

is enabled by
range: Thing
domain: Thing
description: Domain and range constraints have been removed from this object property to permit it to be used in unforeseen ways.
type: ObjectProperty
comment: An object property relating an entity to another entity that enables it, e.g. linking an investigation to a project that enables it.
inverse of: enables
type: Property
range: Resource
domain: Resource

host institution
subclass of: Resource
subclass of: Thing
type: Class
comment: An institution that acts as a host, for example of a project or a person.
subclass of: (foaf) Organization
subclass of: (foaf) Agent
subclass of: http://lodlaundromat.org/.well-known/genid/5432219778cf6f0499743510fcfcf875#4
subclass of: http://lodlaundromat.org/.well-known/genid/9d396f826af70bb26e6c953fbd3fce0b#6
subclass of: http://lodlaundromat.org/.well-known/genid/9d396f826af70bb26e6c953fbd3fce0b#18
subclass of: http://lodlaundromat.org/.well-known/genid/5432219778cf6f0499743510fcfcf875#7
subclass of: http://lodlaundromat.org/.well-known/genid/9d396f826af70bb26e6c953fbd3fce0b#23
subclass of: http://lodlaundromat.org/.well-known/genid/5432219778cf6f0499743510fcfcf875#1
subclass of: http://lodlaundromat.org/.well-known/genid/9d396f826af70bb26e6c953fbd3fce0b#1
subclass of: http://lodlaundromat.org/.well-known/genid/9d396f826af70bb26e6c953fbd3fce0b#13

invoice
subclass of: Thing
subclass of: Resource
type: Class
comment: An invoice for payment of goods or services.
subclass of: financial entity

purchase
subclass of: Resource
subclass of: Thing
type: Class
comment: The payment for obtaining something, for example property, goods or services.
subclass of: financial entity

registration agency
subclass of: Resource
subclass of: Thing
type: Class
comment: An organization that acts to register things. For example, CrossRef is a registration agency for DOIs relating to documents, while DataCite is a registration agency for DOIs relating to datasets.
subclass of: (foaf) Organization
subclass of: (foaf) Agent
subclass of: http://lodlaundromat.org/.well-known/genid/9d396f826af70bb26e6c953fbd3fce0b#23
subclass of: http://lodlaundromat.org/.well-known/genid/5432219778cf6f0499743510fcfcf875#7
subclass of: http://lodlaundromat.org/.well-known/genid/9d396f826af70bb26e6c953fbd3fce0b#1
subclass of: http://lodlaundromat.org/.well-known/genid/5432219778cf6f0499743510fcfcf875#4
subclass of: http://lodlaundromat.org/.well-known/genid/9d396f826af70bb26e6c953fbd3fce0b#18
subclass of: http://lodlaundromat.org/.well-known/genid/9d396f826af70bb26e6c953fbd3fce0b#13
subclass of: http://lodlaundromat.org/.well-known/genid/5432219778cf6f0499743510fcfcf875#1
subclass of: http://lodlaundromat.org/.well-known/genid/9d396f826af70bb26e6c953fbd3fce0b#6

is supported by
range: http://lodlaundromat.org/.well-known/genid/5432219778cf6f0499743510fcfcf875#7
range: Thing
domain: Thing
description: This property is not intended for use to describe mechanical or physical support, as in 'The statue is supported by the plinth'.
type: ObjectProperty
comment: An object property linking something to an agent that provides funding or other support for it.
range: http://lodlaundromat.org/.well-known/genid/5432219778cf6f0499743510fcfcf875#1
inverse of: supports
type: Property
range: Resource
domain: Resource

account
subclass of: Thing
subclass of: Resource
type: Class
comment: A mechanism for administering money, typically owned by an agent and dedicated to a particular purpose, for example the equipment account of a university department, to be used only for the purchase or maintenance of items of equipment.
subclass of: financial entity

fee
subclass of: Resource
subclass of: Thing
type: Class
comment: An amount of money paid for something that is not purchased.
subclass of: financial entity

is supplied by
range: (foaf) Agent
range: Thing
domain: Thing
type: ObjectProperty
comment: An object property relating an entity that is supplied, or an agent to whom an entity is supplied, to the supplier.
range: supplier
inverse of: supplies
type: Property
range: http://lodlaundromat.org/.well-known/genid/9d396f826af70bb26e6c953fbd3fce0b#1
range: Resource
range: http://lodlaundromat.org/.well-known/genid/5432219778cf6f0499743510fcfcf875#1
range: http://lodlaundromat.org/.well-known/genid/5432219778cf6f0499743510fcfcf875#7
range: http://lodlaundromat.org/.well-known/genid/9d396f826af70bb26e6c953fbd3fce0b#23
range: http://lodlaundromat.org/.well-known/genid/9d396f826af70bb26e6c953fbd3fce0b#18
range: http://lodlaundromat.org/.well-known/genid/5432219778cf6f0499743510fcfcf875#4
range: http://lodlaundromat.org/.well-known/genid/9d396f826af70bb26e6c953fbd3fce0b#13
range: http://lodlaundromat.org/.well-known/genid/9d396f826af70bb26e6c953fbd3fce0b#6
domain: Resource

deliverable
subclass of: Resource
subclass of: Thing
type: Class
comment: A class defining a 'deliverable' of a project, i.e. something that the project set out to deliver, or succeeds in delivering.
subclass of: output
subclass of: infrastructure entity
subclass of: equipment

annual turnover
subclass of: Resource
subclass of: Thing
type: Class
comment: The anual financial turnover of an organization (in a specified currency).
subclass of: financial entity

university
subclass of: Resource
subclass of: Thing
type: Class
comment: A university at which higher education and research is conducted.
subclass of: (foaf) Organization
subclass of: (foaf) Agent
subclass of: http://lodlaundromat.org/.well-known/genid/5432219778cf6f0499743510fcfcf875#1
subclass of: http://lodlaundromat.org/.well-known/genid/9d396f826af70bb26e6c953fbd3fce0b#13
subclass of: http://lodlaundromat.org/.well-known/genid/9d396f826af70bb26e6c953fbd3fce0b#18
subclass of: http://lodlaundromat.org/.well-known/genid/9d396f826af70bb26e6c953fbd3fce0b#23
subclass of: http://lodlaundromat.org/.well-known/genid/9d396f826af70bb26e6c953fbd3fce0b#1
subclass of: http://lodlaundromat.org/.well-known/genid/5432219778cf6f0499743510fcfcf875#7
subclass of: http://lodlaundromat.org/.well-known/genid/9d396f826af70bb26e6c953fbd3fce0b#6
subclass of: http://lodlaundromat.org/.well-known/genid/5432219778cf6f0499743510fcfcf875#4

owner
subclass of: Resource
subclass of: Thing
type: Class
comment: The agent who owns an entity.
subclass of: (foaf) Agent
subclass of: http://lodlaundromat.org/.well-known/genid/9d396f826af70bb26e6c953fbd3fce0b#18
subclass of: http://lodlaundromat.org/.well-known/genid/9d396f826af70bb26e6c953fbd3fce0b#6
subclass of: http://lodlaundromat.org/.well-known/genid/9d396f826af70bb26e6c953fbd3fce0b#13
subclass of: http://lodlaundromat.org/.well-known/genid/5432219778cf6f0499743510fcfcf875#7
subclass of: http://lodlaundromat.org/.well-known/genid/5432219778cf6f0499743510fcfcf875#4
subclass of: http://lodlaundromat.org/.well-known/genid/9d396f826af70bb26e6c953fbd3fce0b#23
subclass of: http://lodlaundromat.org/.well-known/genid/9d396f826af70bb26e6c953fbd3fce0b#1
subclass of: http://lodlaundromat.org/.well-known/genid/5432219778cf6f0499743510fcfcf875#1

scholarship
subclass of: Resource
subclass of: Thing
type: Class
comment: A financial grant to a scholar to enable him/her to undertake advanced academic study.
subclass of: stipend
subclass of: http://lodlaundromat.org/.well-known/genid/5432219778cf6f0499743510fcfcf875#7
subclass of: financial entity
subclass of: http://lodlaundromat.org/.well-known/genid/5432219778cf6f0499743510fcfcf875#1
subclass of: funding

facility
subclass of: Resource
subclass of: Thing
type: Class
comment: A place or installation built or designed to serve a specific function or provide a specific service, for example an animal breeding centre, a DNA sequencing facility or a confocal imaging laboratory.
subclass of: infrastructure entity

is funded by
inverse of: funds
range: Thing
domain: Thing
type: ObjectProperty
comment: An object property linking something to the funding that funds it (i.e. that finances or pays for it), or to the funding agency providing that funding. This flexibility is given because of alternative usages of the English word 'funds'. [See also frapo:isAwardedBy and frapo:hasFundingAgency and frapo:isSupportedBy.]
sub property of: is supported by
type: Property
range: http://lodlaundromat.org/.well-known/genid/5432219778cf6f0499743510fcfcf875#7
range: http://lodlaundromat.org/.well-known/genid/5432219778cf6f0499743510fcfcf875#1
range: Resource
domain: Resource

supplier
subclass of: Resource
subclass of: Thing
type: Class
comment: An agent who supplies something, such as goods or services.
subclass of: (foaf) Agent
subclass of: http://lodlaundromat.org/.well-known/genid/9d396f826af70bb26e6c953fbd3fce0b#1
subclass of: http://lodlaundromat.org/.well-known/genid/9d396f826af70bb26e6c953fbd3fce0b#18
subclass of: http://lodlaundromat.org/.well-known/genid/5432219778cf6f0499743510fcfcf875#7
subclass of: http://lodlaundromat.org/.well-known/genid/9d396f826af70bb26e6c953fbd3fce0b#6
subclass of: http://lodlaundromat.org/.well-known/genid/5432219778cf6f0499743510fcfcf875#1
subclass of: http://lodlaundromat.org/.well-known/genid/9d396f826af70bb26e6c953fbd3fce0b#23
subclass of: http://lodlaundromat.org/.well-known/genid/5432219778cf6f0499743510fcfcf875#4
subclass of: http://lodlaundromat.org/.well-known/genid/9d396f826af70bb26e6c953fbd3fce0b#13

service contract
subclass of: Resource
subclass of: Thing
type: Class
comment: A contract for the provision of a service such as a cleaning service, or for the regular servicing, maintenance and repair of some item of equipment or infrastructure.
subclass of: contract
subclass of: financial entity

contract
subclass of: Resource
subclass of: Thing
type: Class
comment: A legally binding agreement between parties.
subclass of: financial entity

has birth date
type: FunctionalProperty
sub property of: date
type: DatatypeProperty
comment: A data property permitting specification of the birth date of a person.
domain: (foaf) Person
range: dateTime
sub property of: birthday
type: Property
range: Nothing
range: date
range: Resource
domain: Thing
domain: Resource
domain: (foaf) Agent
domain: http://lodlaundromat.org/.well-known/genid/9d396f826af70bb26e6c953fbd3fce0b#13
domain: http://lodlaundromat.org/.well-known/genid/9d396f826af70bb26e6c953fbd3fce0b#23
domain: http://lodlaundromat.org/.well-known/genid/9d396f826af70bb26e6c953fbd3fce0b#18
domain: http://lodlaundromat.org/.well-known/genid/5432219778cf6f0499743510fcfcf875#1
domain: http://lodlaundromat.org/.well-known/genid/5432219778cf6f0499743510fcfcf875#4
domain: http://lodlaundromat.org/.well-known/genid/9d396f826af70bb26e6c953fbd3fce0b#1
domain: http://lodlaundromat.org/.well-known/genid/5432219778cf6f0499743510fcfcf875#7
domain: http://lodlaundromat.org/.well-known/genid/9d396f826af70bb26e6c953fbd3fce0b#6
range: Thing
range: (foaf) Image
range: http://lodlaundromat.org/.well-known/genid/9d396f826af70bb26e6c953fbd3fce0b#10
range: http://lodlaundromat.org/.well-known/genid/9d396f826af70bb26e6c953fbd3fce0b#23
range: http://lodlaundromat.org/.well-known/genid/9d396f826af70bb26e6c953fbd3fce0b#1
range: (foaf) Document
range: http://lodlaundromat.org/.well-known/genid/9d396f826af70bb26e6c953fbd3fce0b#18
range: Property
domain: Class
domain: (foaf) Group
range: http://lodlaundromat.org/.well-known/genid/9d396f826af70bb26e6c953fbd3fce0b#13
range: (foaf) Agent
range: http://lodlaundromat.org/.well-known/genid/9d396f826af70bb26e6c953fbd3fce0b#6
range: http://lodlaundromat.org/.well-known/genid/5432219778cf6f0499743510fcfcf875#7
range: http://lodlaundromat.org/.well-known/genid/5432219778cf6f0499743510fcfcf875#1
range: (foaf) Person
range: http://lodlaundromat.org/.well-known/genid/5432219778cf6f0499743510fcfcf875#4
range: List
range: http://lodlaundromat.org/.well-known/genid/9d396f826af70bb26e6c953fbd3fce0b#17
domain: financial entity
domain: invoice
domain: (foaf) Organization
domain: funding agency
domain: application
range: (foaf) Organization
range: funding agency
range: infrastructure entity
range: facility
domain: purchaser
domain: manufacturer
domain: Restriction
domain: http://lodlaundromat.org/.well-known/genid/9d396f826af70bb26e6c953fbd3fce0b#16
domain: Property
domain: Statement
domain: Ontology
domain: List
domain: purchase order
domain: postal address
domain: grant
domain: funding
domain: (foaf) Document
domain: http://lodlaundromat.org/.well-known/genid/9d396f826af70bb26e6c953fbd3fce0b#10
domain: supplier
domain: account
domain: (foaf) Project
domain: (foaf) Image
range: supplier
range: Ontology
range: manufacturer
range: equipment
range: http://lodlaundromat.org/.well-known/genid/9d396f826af70bb26e6c953fbd3fce0b#22
range: financial entity
range: Class
range: service
range: http://lodlaundromat.org/.well-known/genid/9d396f826af70bb26e6c953fbd3fce0b#16
range: http://lodlaundromat.org/.well-known/genid/9d396f826af70bb26e6c953fbd3fce0b#9
range: http://lodlaundromat.org/.well-known/genid/9d396f826af70bb26e6c953fbd3fce0b#5

has job title
sub property of: has information
type: DatatypeProperty
comment: A data property permitting specification of the job title held by a person, such as might appear next to the name in a directory or on a conference name badge. For example, the person's specific Job Title might be 'Linacre Professor of Zoology' or 'Regius Professor of Moral Philosophy'. This job title properly refers to the **role** held by that person (e.g. 'Head of Department'), which can be separately defined using SCoRO, the Scholarly Contributions and Roles Ontology (http://purl.org/spar/scoro/). [see scoro:withJobTitle].
domain: (foaf) Person
sub property of: has contact information
type: Property
domain: (foaf) Agent
domain: http://lodlaundromat.org/.well-known/genid/9d396f826af70bb26e6c953fbd3fce0b#18
domain: http://lodlaundromat.org/.well-known/genid/9d396f826af70bb26e6c953fbd3fce0b#6
domain: http://lodlaundromat.org/.well-known/genid/9d396f826af70bb26e6c953fbd3fce0b#13
domain: http://lodlaundromat.org/.well-known/genid/9d396f826af70bb26e6c953fbd3fce0b#23
domain: http://lodlaundromat.org/.well-known/genid/9d396f826af70bb26e6c953fbd3fce0b#1
domain: http://lodlaundromat.org/.well-known/genid/5432219778cf6f0499743510fcfcf875#4
domain: Thing
domain: http://lodlaundromat.org/.well-known/genid/5432219778cf6f0499743510fcfcf875#7
domain: Resource
domain: http://lodlaundromat.org/.well-known/genid/5432219778cf6f0499743510fcfcf875#1

(foaf) Project
subclass of: http://lodlaundromat.org/.well-known/genid/9d396f826af70bb26e6c953fbd3fce0b#23
subclass of: http://lodlaundromat.org/.well-known/genid/9d396f826af70bb26e6c953fbd3fce0b#18
subclass of: http://lodlaundromat.org/.well-known/genid/9d396f826af70bb26e6c953fbd3fce0b#13
subclass of: http://lodlaundromat.org/.well-known/genid/9d396f826af70bb26e6c953fbd3fce0b#1
subclass of: Resource
type: Class
disjoint with: (foaf) Document
comment: In FRAPO, a project is an administrative entity that enables an endeavour such as a research investigation. A project relates to the administrative aspects of undertaking an endeavour, including the funding obtained, the people employed, and the management of the project in terms of deadlines and deliverables. In contrast, an endeavour such as a research investigation relate to the academic and practical aspects of undertaking that endeavour - thus for a research investigation: the research itself, including the hypotheses being investigated, the experiments being undertaken, the data being gathered and analysed, the interpretations being drawn from the data, and the results obtained.
nsterm status: unstable
disjoint with: (foaf) Agent
subclass of: Thing
label: project
disjoint with: (foaf) OnlineAccount
description: Super-class of cerif:Project.
comment: A project (a collective endeavour of some kind).

infrastructure entity
subclass of: Resource
type: Class
description: owl:equivalentClass cerif:InfrastructureEntity .
comment: An entity that facilitates work.
subclass of: Thing

expenditure to date
subclass of: Resource
subclass of: Thing
type: Class
comment: Total money expended to date from an an account, or from a particular budget category.
subclass of: expenditure
subclass of: budget information
subclass of: financial entity

initials
sub property of: has information
type: DatatypeProperty
comment: A data property permitting specification of the initial(s) of a person's name.
sub property of: has contact information
type: Property
domain: (foaf) Agent
domain: http://lodlaundromat.org/.well-known/genid/9d396f826af70bb26e6c953fbd3fce0b#18
domain: http://lodlaundromat.org/.well-known/genid/9d396f826af70bb26e6c953fbd3fce0b#6
domain: http://lodlaundromat.org/.well-known/genid/9d396f826af70bb26e6c953fbd3fce0b#13
domain: http://lodlaundromat.org/.well-known/genid/9d396f826af70bb26e6c953fbd3fce0b#23
domain: http://lodlaundromat.org/.well-known/genid/9d396f826af70bb26e6c953fbd3fce0b#1
domain: http://lodlaundromat.org/.well-known/genid/5432219778cf6f0499743510fcfcf875#4
domain: Thing
domain: http://lodlaundromat.org/.well-known/genid/5432219778cf6f0499743510fcfcf875#7
domain: Resource
domain: http://lodlaundromat.org/.well-known/genid/5432219778cf6f0499743510fcfcf875#1
domain: (foaf) Person

endowment
subclass of: Resource
subclass of: Thing
type: Class
comment: A transfer, generally as a gift, of money or property to an institution to provide a permanent fund, the income from which is to be used for a particular purpose. (Abbreviated from http://legal-dictionary.thefreedictionary.com/endowment).
subclass of: gift
subclass of: financial entity
subclass of: http://lodlaundromat.org/.well-known/genid/5432219778cf6f0499743510fcfcf875#7
subclass of: http://lodlaundromat.org/.well-known/genid/5432219778cf6f0499743510fcfcf875#1
subclass of: funding

investigation
subclass of: Resource
subclass of: Thing
type: Class
description: Equivalent class in ISA-RDF: 'Investigation'.
comment: An investigation is an endeavour that involves research, enabled by a project. The investigation relate to the scholarly and practical aspects of conducting the research itself, including the hypotheses being investigated, the experiments being undertaken, the data being gathered and analysed, the interpretations being drawn from the data, and the results obtained. In contrast, the project that enables it encompasses the administrative aspects of undertaking the endeavour, including the funding obtained, the people employed, and the management of the project in terms of deadlines and deliverables.
subclass of: endeavour

not-for-profit organization
subclass of: Resource
subclass of: Thing
type: Class
comment: An organization that does not primarily exist to make profit, for example a charity or charitable foundation, a learned society, or a standards body such as the World Wide Web Consortium.
subclass of: (foaf) Organization
subclass of: (foaf) Agent
subclass of: http://lodlaundromat.org/.well-known/genid/9d396f826af70bb26e6c953fbd3fce0b#23
subclass of: http://lodlaundromat.org/.well-known/genid/9d396f826af70bb26e6c953fbd3fce0b#1
subclass of: http://lodlaundromat.org/.well-known/genid/9d396f826af70bb26e6c953fbd3fce0b#6
subclass of: http://lodlaundromat.org/.well-known/genid/9d396f826af70bb26e6c953fbd3fce0b#13
subclass of: http://lodlaundromat.org/.well-known/genid/5432219778cf6f0499743510fcfcf875#4
subclass of: http://lodlaundromat.org/.well-known/genid/5432219778cf6f0499743510fcfcf875#7
subclass of: http://lodlaundromat.org/.well-known/genid/9d396f826af70bb26e6c953fbd3fce0b#18
subclass of: http://lodlaundromat.org/.well-known/genid/5432219778cf6f0499743510fcfcf875#1

(foaf) Document
subclass of: http://lodlaundromat.org/.well-known/genid/9d396f826af70bb26e6c953fbd3fce0b#23
subclass of: http://lodlaundromat.org/.well-known/genid/9d396f826af70bb26e6c953fbd3fce0b#18
subclass of: http://lodlaundromat.org/.well-known/genid/9d396f826af70bb26e6c953fbd3fce0b#1
subclass of: Resource
subclass of: Thing
subclass of: http://lodlaundromat.org/.well-known/genid/9d396f826af70bb26e6c953fbd3fce0b#10
comment: A document.
type: Class
disjoint with: (foaf) OnlineAccount
disjoint with: (foaf) Project
disjoint with: (foaf) Agent
description: Ontology terms and definitions for many documents relevant to FRAPO are given as 'Expression' classes in FaBiO, the FRBR-aligned Bibliographic Ontology, e.g. fabio:CallForApplications, fabio:DataManagementPlan, fabio:GrantApplicationDocument, fabio:ProjectPlan. Others are given as sub-classes of this class.
nsterm status: testing

expenditure
subclass of: Resource
subclass of: Thing
type: Class
comment: Money going out of an account, because of expenditure on various entities. May be associated with a particular budget category.
subclass of: budget information
subclass of: financial entity

budget information
subclass of: Resource
subclass of: Thing
type: Class
comment: Information about an aspect of a budget.
subclass of: financial entity

manufactures
inverse of: is manufactured by
range: Thing
domain: Thing
type: ObjectProperty
comment: An object property relating a manufacturer to a manufactured entity.
domain: manufacturer
type: Property
range: Resource
domain: (foaf) Agent
domain: http://lodlaundromat.org/.well-known/genid/9d396f826af70bb26e6c953fbd3fce0b#1
domain: Resource
domain: http://lodlaundromat.org/.well-known/genid/5432219778cf6f0499743510fcfcf875#1
domain: http://lodlaundromat.org/.well-known/genid/5432219778cf6f0499743510fcfcf875#7
domain: http://lodlaundromat.org/.well-known/genid/9d396f826af70bb26e6c953fbd3fce0b#23
domain: http://lodlaundromat.org/.well-known/genid/9d396f826af70bb26e6c953fbd3fce0b#18
domain: http://lodlaundromat.org/.well-known/genid/5432219778cf6f0499743510fcfcf875#4
domain: http://lodlaundromat.org/.well-known/genid/9d396f826af70bb26e6c953fbd3fce0b#13
domain: http://lodlaundromat.org/.well-known/genid/9d396f826af70bb26e6c953fbd3fce0b#6

bursary
subclass of: Resource
subclass of: Thing
type: Class
comment: An amount of money given to a person by an organization, for example by a university to a university student in need to enable that student to continue his/her studies.
subclass of: funding
subclass of: http://lodlaundromat.org/.well-known/genid/5432219778cf6f0499743510fcfcf875#1
subclass of: financial entity
subclass of: http://lodlaundromat.org/.well-known/genid/5432219778cf6f0499743510fcfcf875#7

is evaluated by
range: Thing
domain: Thing
type: ObjectProperty
comment: An object property linking an entity to an agent that evaluates it.
range: (foaf) Agent
inverse of: evaluates
type: Property
range: http://lodlaundromat.org/.well-known/genid/9d396f826af70bb26e6c953fbd3fce0b#1
range: Resource
range: http://lodlaundromat.org/.well-known/genid/5432219778cf6f0499743510fcfcf875#1
range: http://lodlaundromat.org/.well-known/genid/5432219778cf6f0499743510fcfcf875#7
range: http://lodlaundromat.org/.well-known/genid/9d396f826af70bb26e6c953fbd3fce0b#23
range: http://lodlaundromat.org/.well-known/genid/9d396f826af70bb26e6c953fbd3fce0b#18
range: http://lodlaundromat.org/.well-known/genid/5432219778cf6f0499743510fcfcf875#4
range: http://lodlaundromat.org/.well-known/genid/9d396f826af70bb26e6c953fbd3fce0b#13
range: http://lodlaundromat.org/.well-known/genid/9d396f826af70bb26e6c953fbd3fce0b#6
domain: Resource

admission application
subclass of: Resource
subclass of: Thing
type: Class
comment: The activity of applying for admission to some group or institution, for example a learned society or a university.
subclass of: application

given name initial
sub property of: has information
sub property of: has contact information
type: DatatypeProperty
comment: A data property permitting specification of the initial(s) of a person's given name(s).
sub property of: initials
type: Property
domain: (foaf) Person
domain: Thing
domain: Resource
domain: (foaf) Agent
domain: http://lodlaundromat.org/.well-known/genid/9d396f826af70bb26e6c953fbd3fce0b#13
domain: http://lodlaundromat.org/.well-known/genid/9d396f826af70bb26e6c953fbd3fce0b#23
domain: http://lodlaundromat.org/.well-known/genid/9d396f826af70bb26e6c953fbd3fce0b#18
domain: http://lodlaundromat.org/.well-known/genid/5432219778cf6f0499743510fcfcf875#1
domain: http://lodlaundromat.org/.well-known/genid/5432219778cf6f0499743510fcfcf875#4
domain: http://lodlaundromat.org/.well-known/genid/9d396f826af70bb26e6c953fbd3fce0b#1
domain: http://lodlaundromat.org/.well-known/genid/5432219778cf6f0499743510fcfcf875#7
domain: http://lodlaundromat.org/.well-known/genid/9d396f826af70bb26e6c953fbd3fce0b#6

has qualification
sub property of: has information
type: DatatypeProperty
comment: A data property permitting specification of the qualification held by a person.
sub property of: has contact information
type: Property
domain: (foaf) Agent
domain: http://lodlaundromat.org/.well-known/genid/9d396f826af70bb26e6c953fbd3fce0b#18
domain: http://lodlaundromat.org/.well-known/genid/9d396f826af70bb26e6c953fbd3fce0b#6
domain: http://lodlaundromat.org/.well-known/genid/9d396f826af70bb26e6c953fbd3fce0b#13
domain: http://lodlaundromat.org/.well-known/genid/9d396f826af70bb26e6c953fbd3fce0b#23
domain: http://lodlaundromat.org/.well-known/genid/9d396f826af70bb26e6c953fbd3fce0b#1
domain: http://lodlaundromat.org/.well-known/genid/5432219778cf6f0499743510fcfcf875#4
domain: Thing
domain: http://lodlaundromat.org/.well-known/genid/5432219778cf6f0499743510fcfcf875#7
domain: Resource
domain: http://lodlaundromat.org/.well-known/genid/5432219778cf6f0499743510fcfcf875#1
domain: (foaf) Person

is owned by
range: Thing
domain: Thing
type: ObjectProperty
comment: An object property linking an entity to the agent that owns it.
range: (foaf) Agent
inverse of: owns
type: Property
range: http://lodlaundromat.org/.well-known/genid/9d396f826af70bb26e6c953fbd3fce0b#1
range: Resource
range: http://lodlaundromat.org/.well-known/genid/5432219778cf6f0499743510fcfcf875#1
range: http://lodlaundromat.org/.well-known/genid/5432219778cf6f0499743510fcfcf875#7
range: http://lodlaundromat.org/.well-known/genid/9d396f826af70bb26e6c953fbd3fce0b#23
range: http://lodlaundromat.org/.well-known/genid/9d396f826af70bb26e6c953fbd3fce0b#18
range: http://lodlaundromat.org/.well-known/genid/5432219778cf6f0499743510fcfcf875#4
range: http://lodlaundromat.org/.well-known/genid/9d396f826af70bb26e6c953fbd3fce0b#13
range: http://lodlaundromat.org/.well-known/genid/9d396f826af70bb26e6c953fbd3fce0b#6
domain: Resource

spin-off company
subclass of: Resource
subclass of: Thing
type: Class
comment: A company that has been established by a university or research institute to mature and market the results of research conducted at that research institution.
subclass of: company
subclass of: (foaf) Agent
subclass of: (foaf) Organization
subclass of: http://lodlaundromat.org/.well-known/genid/9d396f826af70bb26e6c953fbd3fce0b#6
subclass of: http://lodlaundromat.org/.well-known/genid/9d396f826af70bb26e6c953fbd3fce0b#23
subclass of: http://lodlaundromat.org/.well-known/genid/5432219778cf6f0499743510fcfcf875#7
subclass of: http://lodlaundromat.org/.well-known/genid/9d396f826af70bb26e6c953fbd3fce0b#13
subclass of: http://lodlaundromat.org/.well-known/genid/5432219778cf6f0499743510fcfcf875#1
subclass of: http://lodlaundromat.org/.well-known/genid/5432219778cf6f0499743510fcfcf875#4
subclass of: http://lodlaundromat.org/.well-known/genid/9d396f826af70bb26e6c953fbd3fce0b#18
subclass of: http://lodlaundromat.org/.well-known/genid/9d396f826af70bb26e6c953fbd3fce0b#1

purchases
range: Thing
domain: Thing
description: Range constraints have been removed from this object property to permit it to be used in unforeseen ways.
type: ObjectProperty
comment: An object property relating a purchaser to a purchased entity.
domain: (foaf) Agent
inverse of: was purchased by
type: Property
range: Resource
domain: http://lodlaundromat.org/.well-known/genid/9d396f826af70bb26e6c953fbd3fce0b#1
domain: Resource
domain: http://lodlaundromat.org/.well-known/genid/5432219778cf6f0499743510fcfcf875#1
domain: http://lodlaundromat.org/.well-known/genid/5432219778cf6f0499743510fcfcf875#7
domain: http://lodlaundromat.org/.well-known/genid/9d396f826af70bb26e6c953fbd3fce0b#23
domain: http://lodlaundromat.org/.well-known/genid/9d396f826af70bb26e6c953fbd3fce0b#18
domain: http://lodlaundromat.org/.well-known/genid/5432219778cf6f0499743510fcfcf875#4
domain: http://lodlaundromat.org/.well-known/genid/9d396f826af70bb26e6c953fbd3fce0b#13
domain: http://lodlaundromat.org/.well-known/genid/9d396f826af70bb26e6c953fbd3fce0b#6

(foaf) Agent
subclass of: http://lodlaundromat.org/.well-known/genid/9d396f826af70bb26e6c953fbd3fce0b#18
subclass of: http://lodlaundromat.org/.well-known/genid/9d396f826af70bb26e6c953fbd3fce0b#6
subclass of: http://lodlaundromat.org/.well-known/genid/9d396f826af70bb26e6c953fbd3fce0b#13
subclass of: http://lodlaundromat.org/.well-known/genid/9d396f826af70bb26e6c953fbd3fce0b#23
subclass of: http://lodlaundromat.org/.well-known/genid/9d396f826af70bb26e6c953fbd3fce0b#1
subclass of: http://lodlaundromat.org/.well-known/genid/5432219778cf6f0499743510fcfcf875#4
subclass of: Thing
subclass of: http://lodlaundromat.org/.well-known/genid/5432219778cf6f0499743510fcfcf875#7
subclass of: Resource
subclass of: http://lodlaundromat.org/.well-known/genid/5432219778cf6f0499743510fcfcf875#1
nsterm status: unstable
comment: An agent (eg. person, group, software or physical artifact).
disjoint with: (foaf) Document
disjoint with: (foaf) Project
disjoint with: (foaf) OnlineAccount
type: Class

consultancy agreement
subclass of: Resource
subclass of: Thing
type: Class
comment: A contract between an employer and a consultant, detailing the terms of the consultancy.
subclass of: contract
subclass of: financial entity

division
subclass of: Resource
subclass of: Thing
type: Class
comment: A grouping of similar departments within a larger organization. In the university context, also known as a school or a faculty, for example the Humanities Division, the Mathematics Faculty, or the School of Medicine.
subclass of: (foaf) Organization
subclass of: (foaf) Agent
subclass of: http://lodlaundromat.org/.well-known/genid/5432219778cf6f0499743510fcfcf875#7
subclass of: http://lodlaundromat.org/.well-known/genid/9d396f826af70bb26e6c953fbd3fce0b#23
subclass of: http://lodlaundromat.org/.well-known/genid/9d396f826af70bb26e6c953fbd3fce0b#18
subclass of: http://lodlaundromat.org/.well-known/genid/5432219778cf6f0499743510fcfcf875#4
subclass of: http://lodlaundromat.org/.well-known/genid/9d396f826af70bb26e6c953fbd3fce0b#1
subclass of: http://lodlaundromat.org/.well-known/genid/9d396f826af70bb26e6c953fbd3fce0b#6
subclass of: http://lodlaundromat.org/.well-known/genid/5432219778cf6f0499743510fcfcf875#1
subclass of: http://lodlaundromat.org/.well-known/genid/9d396f826af70bb26e6c953fbd3fce0b#13

owns
inverse of: is owned by
range: Thing
domain: Thing
type: ObjectProperty
comment: An object property linking an agent to an entity owned by that agent.
domain: (foaf) Agent
type: Property
range: Resource
domain: http://lodlaundromat.org/.well-known/genid/9d396f826af70bb26e6c953fbd3fce0b#1
domain: Resource
domain: http://lodlaundromat.org/.well-known/genid/5432219778cf6f0499743510fcfcf875#1
domain: http://lodlaundromat.org/.well-known/genid/5432219778cf6f0499743510fcfcf875#7
domain: http://lodlaundromat.org/.well-known/genid/9d396f826af70bb26e6c953fbd3fce0b#23
domain: http://lodlaundromat.org/.well-known/genid/9d396f826af70bb26e6c953fbd3fce0b#18
domain: http://lodlaundromat.org/.well-known/genid/5432219778cf6f0499743510fcfcf875#4
domain: http://lodlaundromat.org/.well-known/genid/9d396f826af70bb26e6c953fbd3fce0b#13
domain: http://lodlaundromat.org/.well-known/genid/9d396f826af70bb26e6c953fbd3fce0b#6

has purchase order number
type: DatatypeProperty
comment: A data property identifying an official purchase order issued by a purchasing agent to a supplier of goods or services, and used by the supplier to identify the order when delivering goods or submitting an invoice.
domain: purchase order
sub property of: identifier
type: Property
domain: Resource
domain: Thing
domain: financial entity

has creation date
type: DatatypeProperty
type: FunctionalProperty
comment: A data property linking something to its date of creation.
range: dateTime
sub property of: date
type: Property
range: Resource

has call identifier
type: DatatypeProperty
comment: A data property specifying the identifying number of a call for applications issued by a funding agency.
sub property of: identifier
type: Property

rejected
type: status
type: NamedIndividual
comment: The status of something such as an application as having been rejected.
type: Thing

has quotation date
type: DatatypeProperty
comment: A data property linking a quotation to its date.
range: dateTime
sub property of: date
type: Property
range: Resource

has post code
type: DatatypeProperty
comment: A data property defining the postal code of an address.
sub property of: has code
type: Property

unfunded
type: status
type: NamedIndividual
comment: The status of something such as an investigation or a project as being unfunded.
type: Thing

building costs
type: budget category
type: NamedIndividual
comment: A budget category to cover the costs of constructing, renovating or modifying a physical building.
type: Thing
type: financial entity

academic
type: NamedIndividual
type: (foaf) Person
comment: A member of the academic staff of an academic institution such as a university.
type: Thing
type: http://lodlaundromat.org/.well-known/genid/5432219778cf6f0499743510fcfcf875#7
type: http://lodlaundromat.org/.well-known/genid/9d396f826af70bb26e6c953fbd3fce0b#6
type: http://lodlaundromat.org/.well-known/genid/9d396f826af70bb26e6c953fbd3fce0b#23
type: http://lodlaundromat.org/.well-known/genid/9d396f826af70bb26e6c953fbd3fce0b#18
type: http://lodlaundromat.org/.well-known/genid/9d396f826af70bb26e6c953fbd3fce0b#13
type: http://lodlaundromat.org/.well-known/genid/9d396f826af70bb26e6c953fbd3fce0b#1
type: http://lodlaundromat.org/.well-known/genid/5432219778cf6f0499743510fcfcf875#4
type: http://lodlaundromat.org/.well-known/genid/5432219778cf6f0499743510fcfcf875#1
type: (foaf) Agent

has information
type: DatatypeProperty
comment: A data property linking an agent to information about that agent.
domain: (foaf) Agent
type: Property
domain: http://lodlaundromat.org/.well-known/genid/9d396f826af70bb26e6c953fbd3fce0b#1
domain: Thing
domain: Resource
domain: http://lodlaundromat.org/.well-known/genid/5432219778cf6f0499743510fcfcf875#1
domain: http://lodlaundromat.org/.well-known/genid/5432219778cf6f0499743510fcfcf875#7
domain: http://lodlaundromat.org/.well-known/genid/9d396f826af70bb26e6c953fbd3fce0b#23
domain: http://lodlaundromat.org/.well-known/genid/9d396f826af70bb26e6c953fbd3fce0b#18
domain: http://lodlaundromat.org/.well-known/genid/5432219778cf6f0499743510fcfcf875#4
domain: http://lodlaundromat.org/.well-known/genid/9d396f826af70bb26e6c953fbd3fce0b#13
domain: http://lodlaundromat.org/.well-known/genid/9d396f826af70bb26e6c953fbd3fce0b#6

accepted
type: status
type: NamedIndividual
comment: The status of something such as an application as having been accepted.
type: Thing

other costs
type: budget category
type: NamedIndividual
comment: A budget category to cover costs not covered in other budget categories.
type: Thing
type: financial entity

has supplier number
type: DatatypeProperty
comment: A data property linking a supplier to an identifying number for that supplier, typically used by the accounting system of the purchasing institution when placing and tracking orders.
domain: supplier
sub property of: identifier
type: Property
domain: (foaf) Agent
domain: http://lodlaundromat.org/.well-known/genid/9d396f826af70bb26e6c953fbd3fce0b#1
domain: Thing
domain: Resource
domain: http://lodlaundromat.org/.well-known/genid/5432219778cf6f0499743510fcfcf875#1
domain: http://lodlaundromat.org/.well-known/genid/5432219778cf6f0499743510fcfcf875#7
domain: http://lodlaundromat.org/.well-known/genid/9d396f826af70bb26e6c953fbd3fce0b#23
domain: http://lodlaundromat.org/.well-known/genid/9d396f826af70bb26e6c953fbd3fce0b#18
domain: http://lodlaundromat.org/.well-known/genid/5432219778cf6f0499743510fcfcf875#4
domain: http://lodlaundromat.org/.well-known/genid/9d396f826af70bb26e6c953fbd3fce0b#13
domain: http://lodlaundromat.org/.well-known/genid/9d396f826af70bb26e6c953fbd3fce0b#6

has phone number
type: DatatypeProperty
comment: A data property identifying a telephone number for an agent.
sub property of: has information
type: Property
domain: (foaf) Agent
domain: http://lodlaundromat.org/.well-known/genid/9d396f826af70bb26e6c953fbd3fce0b#18
domain: http://lodlaundromat.org/.well-known/genid/9d396f826af70bb26e6c953fbd3fce0b#6
domain: http://lodlaundromat.org/.well-known/genid/9d396f826af70bb26e6c953fbd3fce0b#13
domain: http://lodlaundromat.org/.well-known/genid/9d396f826af70bb26e6c953fbd3fce0b#23
domain: http://lodlaundromat.org/.well-known/genid/9d396f826af70bb26e6c953fbd3fce0b#1
domain: http://lodlaundromat.org/.well-known/genid/5432219778cf6f0499743510fcfcf875#4
domain: Thing
domain: http://lodlaundromat.org/.well-known/genid/5432219778cf6f0499743510fcfcf875#7
domain: Resource
domain: http://lodlaundromat.org/.well-known/genid/5432219778cf6f0499743510fcfcf875#1

has time zone
type: DatatypeProperty
type: FunctionalProperty
comment: A data property that permits the time zone relating to an entity to be specified.
type: Property

contributions in kind
type: budget category
type: NamedIndividual
comment: A budget category to categorize the financial worth of contributions in kind (e.g. staff effort, access to facilities, sharing of know-how) given to a project by an agent, for example by the host institution or by a commerical partner in an academic project.
type: Thing
type: financial entity

consumables costs
type: budget category
type: NamedIndividual
comment: A budget category to cover the costs of purchasing consumables.
type: Thing
type: financial entity

full economic costs
description: Frequently abbreviated 'FEC'.
type: budget category
type: NamedIndividual
comment: A budget category to cover all the direct and indirect costs of a project.
type: Thing
type: financial entity

A person who invests in novel enterprises.
type: NamedIndividual
type: (foaf) Person
label: entrepreneur
type: Thing
type: http://lodlaundromat.org/.well-known/genid/5432219778cf6f0499743510fcfcf875#7
type: http://lodlaundromat.org/.well-known/genid/9d396f826af70bb26e6c953fbd3fce0b#6
type: http://lodlaundromat.org/.well-known/genid/9d396f826af70bb26e6c953fbd3fce0b#23
type: http://lodlaundromat.org/.well-known/genid/9d396f826af70bb26e6c953fbd3fce0b#18
type: http://lodlaundromat.org/.well-known/genid/9d396f826af70bb26e6c953fbd3fce0b#13
type: http://lodlaundromat.org/.well-known/genid/9d396f826af70bb26e6c953fbd3fce0b#1
type: http://lodlaundromat.org/.well-known/genid/5432219778cf6f0499743510fcfcf875#4
type: http://lodlaundromat.org/.well-known/genid/5432219778cf6f0499743510fcfcf875#1
type: (foaf) Agent

has application outcome
type: DatatypeProperty
comment: A data property that permits the outcome of an application to be described, for example that a job has been offered or that a grant has been awarded.
sub property of: topDataProperty
type: Property

has customer number
type: DatatypeProperty
comment: A data property linking an agent to an identifying number for that agent, typically used by the accounting system of the supplier when issuing quotations, fulfilling orders and submitting invoices.
domain: purchaser
sub property of: identifier
type: Property
domain: (foaf) Agent
domain: Resource
domain: Thing
domain: http://lodlaundromat.org/.well-known/genid/9d396f826af70bb26e6c953fbd3fce0b#1
domain: http://lodlaundromat.org/.well-known/genid/5432219778cf6f0499743510fcfcf875#1
domain: http://lodlaundromat.org/.well-known/genid/5432219778cf6f0499743510fcfcf875#7
domain: http://lodlaundromat.org/.well-known/genid/9d396f826af70bb26e6c953fbd3fce0b#23
domain: http://lodlaundromat.org/.well-known/genid/9d396f826af70bb26e6c953fbd3fce0b#18
domain: http://lodlaundromat.org/.well-known/genid/5432219778cf6f0499743510fcfcf875#4
domain: http://lodlaundromat.org/.well-known/genid/9d396f826af70bb26e6c953fbd3fce0b#13
domain: http://lodlaundromat.org/.well-known/genid/9d396f826af70bb26e6c953fbd3fce0b#6

has exchange rate
type: DatatypeProperty
comment: A data property specifying the currency exchange rate between two specified currencies.
type: Property

has value
type: DatatypeProperty
comment: A data property enabling one to specify the monetary value of a financial entity such as a grant, a gift or a budget category. Use in conjuction with frapo:hasCurrency.
type: Property

has postal address
type: DatatypeProperty
comment: A data property identifying a postal address for an agent.
sub property of: has information
type: Property
domain: (foaf) Agent
domain: http://lodlaundromat.org/.well-known/genid/9d396f826af70bb26e6c953fbd3fce0b#18
domain: http://lodlaundromat.org/.well-known/genid/9d396f826af70bb26e6c953fbd3fce0b#6
domain: http://lodlaundromat.org/.well-known/genid/9d396f826af70bb26e6c953fbd3fce0b#13
domain: http://lodlaundromat.org/.well-known/genid/9d396f826af70bb26e6c953fbd3fce0b#23
domain: http://lodlaundromat.org/.well-known/genid/9d396f826af70bb26e6c953fbd3fce0b#1
domain: http://lodlaundromat.org/.well-known/genid/5432219778cf6f0499743510fcfcf875#4
domain: Thing
domain: http://lodlaundromat.org/.well-known/genid/5432219778cf6f0499743510fcfcf875#7
domain: Resource
domain: http://lodlaundromat.org/.well-known/genid/5432219778cf6f0499743510fcfcf875#1

has grant number
type: DatatypeProperty
comment: A data property specifying the grant number of a grant provided by a funding agency.
domain: grant
sub property of: identifier
type: Property
domain: Resource
domain: Thing
domain: http://lodlaundromat.org/.well-known/genid/5432219778cf6f0499743510fcfcf875#1
domain: funding
domain: http://lodlaundromat.org/.well-known/genid/5432219778cf6f0499743510fcfcf875#7
domain: financial entity

has catalog number
type: DatatypeProperty
comment: A data property linking something to its catalog number.
sub property of: identifier
type: Property

has purchase date
type: DatatypeProperty
type: FunctionalProperty
comment: A data property linking something to its purchase date.
range: dateTime
sub property of: date
type: Property
range: Resource

has currency code
type: DatatypeProperty
comment: A data property specifying the three-letter currency code used to identify a currency, as defined by ISO 4217 (e.g. EUR or GBP) (see http://en.wikipedia.org/wiki/ISO_4217). Not to be confused with the symbol used with numbers to denote an amount of money in a particular currency (e.g.€500; £3.40)
sub property of: has code
type: Property

has award date
type: DatatypeProperty
type: FunctionalProperty
comment: The date on which notification is given or received that something, for example a scholarship or a grant, has been awarded. [See also frapo:hasDecisionDate.]
range: date
sub property of: date
type: Property
range: Resource

has acronym
type: DatatypeProperty
comment: A data property linking an entity to an acronym used to identify it, based on its full name or title. For example, this ontology has the full name 'Funding, Research Administration and Projects Ontology' and the acronym 'FRAPO'.
type: Property

estates costs
type: budget category
type: NamedIndividual
comment: A budget category to cover the 'overhead' costs of maintaining the premises in which work is undertaken.
type: Thing
type: financial entity

has currency
type: DatatypeProperty
comment: A data property defining the currency used to specify a financial entity. Use in conjection with frapo:hasMonetaryValue.
type: Property

has country code
type: DatatypeProperty
comment: A data property specifying the two-letter or three-letter upper-case country code used to identify a country (e.g. FR/FRA for France, DE/DEU for Germany) (see http://countrycode.org/).
sub property of: has code
type: Property

has decision date
description: This same data property appears in FaBiO, the FRBR-aligned Bibliographic Ontology (http://purl.org/spar/fabio/).
type: DatatypeProperty
type: FunctionalProperty
comment: The date on which a particular action is or will be decided upon, or when an application, such as a grant application, is or will be approved or rejected. [See also frapo:hasAwardDate.]
range: dateTime
sub property of: date
type: Property
range: Resource

FOAF Essential v. 2.0
prior version: foaf-essential.owl
creator: me
publisher: Mindinformatics, Massachusetts General Hospital
contributor: Alan Ruttenberg
version info: 2.0
contributor: Paolo Ciccarese
title: FOAF Essential ontology
date: October 12, 2010
type: Ontology
language: en
format: rdf/xml

non-staff costs
type: budget category
type: NamedIndividual
comment: A budget category to cover all the costs associated with a project that do not involve the employment of staff by the institution, thus, for example, including consumables purchase, travel costs and consultancy fees, but excluding the salary, estates and indirect costs associated with the allocation of the PI's time to the project and the direct employment of a project manager.
type: Thing
type: financial entity

has delivery date
type: DatatypeProperty
comment: The date on which something is delivered, or is due to be delivered.
range: dateTime
sub property of: date
type: Property
range: Resource

has model number
type: DatatypeProperty
comment: A data property linking something, for example a piece of equipment, to its model number.
sub property of: identifier
type: Property

has application deadline
description: owl:equivalentProperty fabio:hasApplicationDeadline .
type: AnnotationProperty
type: DatatypeProperty
type: FunctionalProperty
comment: The date by which an application, for example a job application, a fellowship application or a grant application, has to be submitted if it is to be considered for acceptance or funding.
domain: application
range: dateTime
sub property of: date
type: Property
range: Resource
domain: Resource
domain: Thing

has completion date
type: DatatypeProperty
type: FunctionalProperty
comment: A data property linking something such as a building or a contract to its date of completion.
range: dateTime
sub property of: date
type: Property
range: Resource

has language code
type: DatatypeProperty
comment: A data property specifying the two-letter or three-letter lower-case code used to identify a language (e.g. fr/fra for French, de/deu for Germany) (see http://en.wikipedia.org/wiki/List_of_ISO_639-1_codes).
sub property of: has code
type: Property

has data of manufacture
type: DatatypeProperty
type: FunctionalProperty
comment: A data property linking something to its date of manufacture.
range: dateTime
sub property of: date
type: Property
range: Resource

has deliverable
type: DatatypeProperty
comment: A data property that permits one to define a deliverable of a project.
type: Property

funded
type: status
type: NamedIndividual
comment: The status of something such as an investigation or a project as being funded.
type: Thing

FRAPO, the Funding, Research Administration and Projects Ontology
version info: 1.1
creator: David Shotton
comment: FRAPO, the Funding, Research Administration and Projects Ontology, is a CERIF-compliant ontology written in OWL 2 DL for describing research project administrative information. This ontology is available at http://purl.org/cerif/frapo/, and uses the namespace prefix 'frapo'.
description: FRAPO is an ontology for use to describe research project administrative information and to work with CRIS (Current Research Information Systems). It can be used for the characterization of grant applications, funding bodies, projects, project partners, etc. It can also be used to describe other types of projects, for example building projects and educational projects. FRAPO imports FOAF and is designed to work with SCoRO, the Scholarly Contributions and Roles Ontology (http://purl.org/spar/scoro/), which is used to characterize the contributions and time-limited roles that may exist between agents such as people and organizations and entities such as projects, research investigations or research outputs. FaBiO, the FRBR-alightned bibliographic ontology (http://purl.org/spar/fabio/), provides terms for documents of relevance, such as grant applications, project plans, project reports, datasets and journal articles, which are therefore not included within FRAPO. FRAPO is not intended to describe the details of research investigations enabled by funded research projects, nor their component studies and assays, which are the domain of a complementary ontology, ISA-RDF (under development - add URL).
date: 2014-01-31
type: Ontology
imports: FOAF Essential v. 2.0
rights: This work is distributed under a Creative Commons Attribution License (http://creativecommons.org/licenses/by/3.0/).
contributor: Silvio Peroni

has reference number
type: DatatypeProperty
comment: A data property linking something to a reference number for that item.
sub property of: identifier
type: Property

has funder identifer
type: DatatypeProperty
comment: A data property linking a funding agency to an identifier for that funding agency.
domain: funding agency
sub property of: identifier
type: Property
domain: (foaf) Agent
domain: http://lodlaundromat.org/.well-known/genid/9d396f826af70bb26e6c953fbd3fce0b#1
domain: Thing
domain: Resource
domain: http://lodlaundromat.org/.well-known/genid/5432219778cf6f0499743510fcfcf875#1
domain: http://lodlaundromat.org/.well-known/genid/5432219778cf6f0499743510fcfcf875#7
domain: http://lodlaundromat.org/.well-known/genid/9d396f826af70bb26e6c953fbd3fce0b#23
domain: http://lodlaundromat.org/.well-known/genid/9d396f826af70bb26e6c953fbd3fce0b#18
domain: http://lodlaundromat.org/.well-known/genid/5432219778cf6f0499743510fcfcf875#4
domain: http://lodlaundromat.org/.well-known/genid/9d396f826af70bb26e6c953fbd3fce0b#13
domain: (foaf) Organization
domain: http://lodlaundromat.org/.well-known/genid/9d396f826af70bb26e6c953fbd3fce0b#6

has organizational information
type: DatatypeProperty
comment: It describes information about the organization.
domain: (foaf) Organization
sub property of: has information
type: Property
domain: (foaf) Agent
domain: http://lodlaundromat.org/.well-known/genid/9d396f826af70bb26e6c953fbd3fce0b#18
domain: http://lodlaundromat.org/.well-known/genid/9d396f826af70bb26e6c953fbd3fce0b#6
domain: http://lodlaundromat.org/.well-known/genid/9d396f826af70bb26e6c953fbd3fce0b#13
domain: http://lodlaundromat.org/.well-known/genid/9d396f826af70bb26e6c953fbd3fce0b#23
domain: http://lodlaundromat.org/.well-known/genid/9d396f826af70bb26e6c953fbd3fce0b#1
domain: http://lodlaundromat.org/.well-known/genid/5432219778cf6f0499743510fcfcf875#4
domain: Thing
domain: http://lodlaundromat.org/.well-known/genid/5432219778cf6f0499743510fcfcf875#7
domain: Resource
domain: http://lodlaundromat.org/.well-known/genid/5432219778cf6f0499743510fcfcf875#1

directly allocated costs
type: budget category
type: NamedIndividual
comment: A budget category to cover those costs normally borne by an institution, that are assigned to the budget of an externally funded project to cover the value of contributions to that project, for example to pay for the salary of a permanent member of staff seconded to work on the project, to compensate the employing organization for the loss of that person's efforts on other activities that he or she would otherwise be undertaking were it not for that secondment.
type: Thing
type: financial entity

has end date
type: DatatypeProperty
type: FunctionalProperty
comment: A data property linking something such as a project to its end date.
range: dateTime
sub property of: date
type: Property
range: Resource

has country
type: DatatypeProperty
comment: A data property specifying a country, for example as the location of an event.
type: Property

has project identifier
type: AnnotationProperty
type: DatatypeProperty
comment: A data property linking a project to an identifier for that project.
domain: (foaf) Project
sub property of: identifier
type: Property
domain: http://lodlaundromat.org/.well-known/genid/9d396f826af70bb26e6c953fbd3fce0b#18
domain: Thing
domain: http://lodlaundromat.org/.well-known/genid/9d396f826af70bb26e6c953fbd3fce0b#23
domain: Resource
domain: http://lodlaundromat.org/.well-known/genid/9d396f826af70bb26e6c953fbd3fce0b#13
domain: http://lodlaundromat.org/.well-known/genid/9d396f826af70bb26e6c953fbd3fce0b#1

has postal address line
type: DatatypeProperty
comment: A data property permitting specification of a single line of a postal address.
domain: postal address
sub property of: has information
type: Property
domain: (foaf) Agent
domain: http://lodlaundromat.org/.well-known/genid/9d396f826af70bb26e6c953fbd3fce0b#18
domain: http://lodlaundromat.org/.well-known/genid/9d396f826af70bb26e6c953fbd3fce0b#6
domain: http://lodlaundromat.org/.well-known/genid/9d396f826af70bb26e6c953fbd3fce0b#13
domain: http://lodlaundromat.org/.well-known/genid/9d396f826af70bb26e6c953fbd3fce0b#23
domain: http://lodlaundromat.org/.well-known/genid/9d396f826af70bb26e6c953fbd3fce0b#1
domain: http://lodlaundromat.org/.well-known/genid/5432219778cf6f0499743510fcfcf875#4
domain: Thing
domain: http://lodlaundromat.org/.well-known/genid/5432219778cf6f0499743510fcfcf875#7
domain: Resource
domain: http://lodlaundromat.org/.well-known/genid/5432219778cf6f0499743510fcfcf875#1

has expiry date
type: DatatypeProperty
type: FunctionalProperty
comment: A data property linking something, for example a drug, to its expiry date, beyond which the manufacture recommends that it should not be used.
range: dateTime
sub property of: date
type: Property
range: Resource

benefactor
type: NamedIndividual
type: (foaf) Person
comment: A person who gives a gift.
type: Thing
type: http://lodlaundromat.org/.well-known/genid/5432219778cf6f0499743510fcfcf875#7
type: http://lodlaundromat.org/.well-known/genid/9d396f826af70bb26e6c953fbd3fce0b#6
type: http://lodlaundromat.org/.well-known/genid/9d396f826af70bb26e6c953fbd3fce0b#23
type: http://lodlaundromat.org/.well-known/genid/9d396f826af70bb26e6c953fbd3fce0b#18
type: http://lodlaundromat.org/.well-known/genid/9d396f826af70bb26e6c953fbd3fce0b#13
type: http://lodlaundromat.org/.well-known/genid/9d396f826af70bb26e6c953fbd3fce0b#1
type: http://lodlaundromat.org/.well-known/genid/5432219778cf6f0499743510fcfcf875#4
type: http://lodlaundromat.org/.well-known/genid/5432219778cf6f0499743510fcfcf875#1
type: (foaf) Agent

has cost
type: DatatypeProperty
comment: A data property enabling the cost of something that can be paid for to be defined.
type: Property

has batch number
type: DatatypeProperty
comment: A data property linking something, for example a chemical or drug, to its manufacturing batch number.
sub property of: identifier
type: Property

has city or town
type: DatatypeProperty
comment: A data property specifying a city or town, for example as the location of an event.
type: Property

has provenance
type: DatatypeProperty
comment: A data property that permits the provenance of an entity to be described.
sub property of: topDataProperty
type: Property

service costs
type: budget category
type: NamedIndividual
comment: A budget category to cover the costs of services used by a project, for example a DNA sequencing service, or an equipment maintenance service.
type: Thing
type: financial entity

has temporal duration
type: DatatypeProperty
comment: A data property enabling one to define the temporal duration of some entity such as an event or a project.
range: dateTime
type: Property
range: Resource

has keyword
type: DatatypeProperty
comment: A data property permitting specification of a keyword relating to an entity.
type: Property

has dispatch date
type: DatatypeProperty
comment: The date on which something, for example an item of equipment, is dispatched by the supplier.
range: dateTime
sub property of: date
type: Property
range: Resource

overhead costs
type: budget category
type: NamedIndividual
comment: A budget category to cover all the non-directly incurred costs of a project, including estates costs and indirect costs, that enable an institution to host an externally-funded project.
type: Thing
type: financial entity

identifier
type: DatatypeProperty
comment: A unique and unambiguous reference to the resource within a given context. Recommended best practice is to identify the resource by means of a string conforming to a formal identification system.
type: Property

consultancy costs
type: budget category
type: NamedIndividual
comment: A budget category to cover the costs of consultancy fees.
type: Thing
type: financial entity

has registration deadline
type: DatatypeProperty
type: FunctionalProperty
comment: The date by which registration must be made, for example renewal of an internet domain name.
range: dateTime
sub property of: date
type: Property
range: Resource

publishing costs
type: budget category
type: NamedIndividual
comment: A budget category to cover the cost of publishing outpots from a project, for example author fees for journal articles in an open access journal.
type: Thing
type: financial entity

indirect costs
type: budget category
type: NamedIndividual
comment: A budget category to cover the indirect costs of running a project, for example heating and lighting, and the employment of non-project staff including administrators, accountants and cleaners.
type: Thing
type: financial entity

has location
type: DatatypeProperty
comment: A data property link an entity to a relevant location, which might be geographical (e.g. New York City) or local (e.g. Freezer B, second shelf).
type: Property

has start date
type: DatatypeProperty
type: FunctionalProperty
comment: A data property linking something such as a project to its start date.
range: dateTime
sub property of: date
type: Property
range: Resource

has expertise
type: DatatypeProperty
comment: A data property identifying the area(s) of expertise and skills posessed by an individual or an organization.
sub property of: has information
type: Property
domain: (foaf) Agent
domain: http://lodlaundromat.org/.well-known/genid/9d396f826af70bb26e6c953fbd3fce0b#18
domain: http://lodlaundromat.org/.well-known/genid/9d396f826af70bb26e6c953fbd3fce0b#6
domain: http://lodlaundromat.org/.well-known/genid/9d396f826af70bb26e6c953fbd3fce0b#13
domain: http://lodlaundromat.org/.well-known/genid/9d396f826af70bb26e6c953fbd3fce0b#23
domain: http://lodlaundromat.org/.well-known/genid/9d396f826af70bb26e6c953fbd3fce0b#1
domain: http://lodlaundromat.org/.well-known/genid/5432219778cf6f0499743510fcfcf875#4
domain: Thing
domain: http://lodlaundromat.org/.well-known/genid/5432219778cf6f0499743510fcfcf875#7
domain: Resource
domain: http://lodlaundromat.org/.well-known/genid/5432219778cf6f0499743510fcfcf875#1

travel and subsistence costs
type: budget category
type: NamedIndividual
comment: A budget category to cover the costs of travel and subsistence incurred on behalf of the project.
type: Thing
type: financial entity

has invoice date
type: AnnotationProperty
type: DatatypeProperty
type: FunctionalProperty
comment: A data property linking an invoice to its date.
domain: invoice
range: date
sub property of: date
type: Property
range: Resource
domain: Resource
domain: Thing
domain: financial entity

has account number
type: DatatypeProperty
comment: A data property linking a financial account to an identifying number for that account.
domain: account
sub property of: identifier
type: Property
domain: Resource
domain: Thing
domain: financial entity

has domain name
type: DatatypeProperty
comment: A data property linking an entity to an internet domain name that has been registered for that entity, for example http://www.miidi.org for MIIDI, the Minimal Information standard for reporting an Infectious Disease Investigation.
type: Property

business angel
type: NamedIndividual
type: (foaf) Person
comment: A person willing to invest in start-up companies.
type: Thing
type: http://lodlaundromat.org/.well-known/genid/5432219778cf6f0499743510fcfcf875#7
type: http://lodlaundromat.org/.well-known/genid/9d396f826af70bb26e6c953fbd3fce0b#6
type: http://lodlaundromat.org/.well-known/genid/9d396f826af70bb26e6c953fbd3fce0b#23
type: http://lodlaundromat.org/.well-known/genid/9d396f826af70bb26e6c953fbd3fce0b#18
type: http://lodlaundromat.org/.well-known/genid/9d396f826af70bb26e6c953fbd3fce0b#13
type: http://lodlaundromat.org/.well-known/genid/9d396f826af70bb26e6c953fbd3fce0b#1
type: http://lodlaundromat.org/.well-known/genid/5432219778cf6f0499743510fcfcf875#4
type: http://lodlaundromat.org/.well-known/genid/5432219778cf6f0499743510fcfcf875#1
type: (foaf) Agent

has milestone
type: DatatypeProperty
comment: A data property that permits one to define a significant event (a 'milestone') in the progress of a project.
type: Property

directly incurred costs
description: Also known as the 'direct costs' of the project.
type: budget category
type: NamedIndividual
comment: A budget category to cover all costs directly incurred because of a legitimate expenditure on a project, for example the purchase of reagents or the employment of a post-doctoral researcher.
type: Thing
type: financial entity

software costs
type: budget category
type: NamedIndividual
comment: A budget category to cover the costs of software licenses required by a project.
type: Thing
type: financial entity

fee or free
type: DatatypeProperty
comment: A data property defining whether participation in an event is free, or requires payment of a fee.
type: Property

has contact information
type: DatatypeProperty
comment: A data property linking a person to information about that person.
domain: (foaf) Person
sub property of: has information
type: Property
domain: (foaf) Agent
domain: http://lodlaundromat.org/.well-known/genid/9d396f826af70bb26e6c953fbd3fce0b#18
domain: http://lodlaundromat.org/.well-known/genid/9d396f826af70bb26e6c953fbd3fce0b#6
domain: http://lodlaundromat.org/.well-known/genid/9d396f826af70bb26e6c953fbd3fce0b#13
domain: http://lodlaundromat.org/.well-known/genid/9d396f826af70bb26e6c953fbd3fce0b#23
domain: http://lodlaundromat.org/.well-known/genid/9d396f826af70bb26e6c953fbd3fce0b#1
domain: http://lodlaundromat.org/.well-known/genid/5432219778cf6f0499743510fcfcf875#4
domain: Thing
domain: http://lodlaundromat.org/.well-known/genid/5432219778cf6f0499743510fcfcf875#7
domain: Resource
domain: http://lodlaundromat.org/.well-known/genid/5432219778cf6f0499743510fcfcf875#1

has code
type: DatatypeProperty
comment: A data property defining a code.
type: Property

facilities costs
type: budget category
type: NamedIndividual
comment: A budget category to cover the costs of maintaining facilities used by a project, for example an electron microscopy facility.
type: Thing
type: financial entity

has fax number
type: DatatypeProperty
comment: A data property identifying a Fax number for an agent.
sub property of: has information
type: Property
domain: (foaf) Agent
domain: http://lodlaundromat.org/.well-known/genid/9d396f826af70bb26e6c953fbd3fce0b#18
domain: http://lodlaundromat.org/.well-known/genid/9d396f826af70bb26e6c953fbd3fce0b#6
domain: http://lodlaundromat.org/.well-known/genid/9d396f826af70bb26e6c953fbd3fce0b#13
domain: http://lodlaundromat.org/.well-known/genid/9d396f826af70bb26e6c953fbd3fce0b#23
domain: http://lodlaundromat.org/.well-known/genid/9d396f826af70bb26e6c953fbd3fce0b#1
domain: http://lodlaundromat.org/.well-known/genid/5432219778cf6f0499743510fcfcf875#4
domain: Thing
domain: http://lodlaundromat.org/.well-known/genid/5432219778cf6f0499743510fcfcf875#7
domain: Resource
domain: http://lodlaundromat.org/.well-known/genid/5432219778cf6f0499743510fcfcf875#1

has serial number
type: DatatypeProperty
comment: A data property linking something, for example a piece of equipment, to its serial number.
sub property of: identifier
type: Property