Is Child Of
range: Thing
domain: Thing
range: Family Bond
domain: Being
type: ObjectProperty
comment: This property specifies that the being is the child of the specified being
domain: Family Bond
range: Being
sub property of: Is Relation Of
inverse of: Is Parent Of
type: Property
domain: Resource
domain: http://lodlaundromat.org/.well-known/genid/49b69061d73c2102e0328121a637ab78#72
domain: http://lodlaundromat.org/.well-known/genid/49b69061d73c2102e0328121a637ab78#99
domain: http://lodlaundromat.org/.well-known/genid/49b69061d73c2102e0328121a637ab78#104
domain: http://lodlaundromat.org/.well-known/genid/49b69061d73c2102e0328121a637ab78#44
domain: http://lodlaundromat.org/.well-known/genid/49b69061d73c2102e0328121a637ab78#96
domain: http://lodlaundromat.org/.well-known/genid/49b69061d73c2102e0328121a637ab78#136
domain: Person
domain: http://lodlaundromat.org/.well-known/genid/49b69061d73c2102e0328121a637ab78#76
domain: http://lodlaundromat.org/.well-known/genid/49b69061d73c2102e0328121a637ab78#81
domain: http://lodlaundromat.org/.well-known/genid/49b69061d73c2102e0328121a637ab78#54
domain: http://lodlaundromat.org/.well-known/genid/49b69061d73c2102e0328121a637ab78#91
domain: http://lodlaundromat.org/.well-known/genid/49b69061d73c2102e0328121a637ab78#122
domain: http://lodlaundromat.org/.well-known/genid/49b69061d73c2102e0328121a637ab78#132
domain: http://lodlaundromat.org/.well-known/genid/49b69061d73c2102e0328121a637ab78#67
domain: http://lodlaundromat.org/.well-known/genid/49b69061d73c2102e0328121a637ab78#86
domain: http://lodlaundromat.org/.well-known/genid/49b69061d73c2102e0328121a637ab78#128
domain: http://lodlaundromat.org/.well-known/genid/49b69061d73c2102e0328121a637ab78#2
domain: http://lodlaundromat.org/.well-known/genid/49b69061d73c2102e0328121a637ab78#110
domain: http://lodlaundromat.org/.well-known/genid/49b69061d73c2102e0328121a637ab78#107
domain: Entity
domain: Bond
domain: Abstract-Item
range: Resource
range: Bond
range: Abstract-Item
range: http://lodlaundromat.org/.well-known/genid/49b69061d73c2102e0328121a637ab78#72
range: http://lodlaundromat.org/.well-known/genid/49b69061d73c2102e0328121a637ab78#99
range: http://lodlaundromat.org/.well-known/genid/49b69061d73c2102e0328121a637ab78#104
range: http://lodlaundromat.org/.well-known/genid/49b69061d73c2102e0328121a637ab78#44
range: http://lodlaundromat.org/.well-known/genid/49b69061d73c2102e0328121a637ab78#96
range: http://lodlaundromat.org/.well-known/genid/49b69061d73c2102e0328121a637ab78#136
range: Person
range: http://lodlaundromat.org/.well-known/genid/49b69061d73c2102e0328121a637ab78#76
range: http://lodlaundromat.org/.well-known/genid/49b69061d73c2102e0328121a637ab78#81
range: http://lodlaundromat.org/.well-known/genid/49b69061d73c2102e0328121a637ab78#54
range: http://lodlaundromat.org/.well-known/genid/49b69061d73c2102e0328121a637ab78#91
range: http://lodlaundromat.org/.well-known/genid/49b69061d73c2102e0328121a637ab78#122
range: http://lodlaundromat.org/.well-known/genid/49b69061d73c2102e0328121a637ab78#132
range: http://lodlaundromat.org/.well-known/genid/49b69061d73c2102e0328121a637ab78#67
range: http://lodlaundromat.org/.well-known/genid/49b69061d73c2102e0328121a637ab78#86
range: http://lodlaundromat.org/.well-known/genid/49b69061d73c2102e0328121a637ab78#128
range: http://lodlaundromat.org/.well-known/genid/49b69061d73c2102e0328121a637ab78#2
range: http://lodlaundromat.org/.well-known/genid/49b69061d73c2102e0328121a637ab78#110
range: http://lodlaundromat.org/.well-known/genid/49b69061d73c2102e0328121a637ab78#107
range: Entity

Governs
range: Thing
domain: Thing
range: http://lodlaundromat.org/.well-known/genid/49b69061d73c2102e0328121a637ab78#51
type: ObjectProperty
comment: This property specifies a class of items of which the group or collection is made
domain: Government
range: http://lodlaundromat.org/.well-known/genid/49b69061d73c2102e0328121a637ab78#48
inverse of: Governed By
type: Property
domain: http://lodlaundromat.org/.well-known/genid/49b69061d73c2102e0328121a637ab78#91
domain: http://lodlaundromat.org/.well-known/genid/49b69061d73c2102e0328121a637ab78#136
domain: http://lodlaundromat.org/.well-known/genid/49b69061d73c2102e0328121a637ab78#107
domain: Resource
domain: Organisation
domain: http://lodlaundromat.org/.well-known/genid/49b69061d73c2102e0328121a637ab78#37
domain: http://lodlaundromat.org/.well-known/genid/49b69061d73c2102e0328121a637ab78#67
domain: http://lodlaundromat.org/.well-known/genid/49b69061d73c2102e0328121a637ab78#34
domain: http://lodlaundromat.org/.well-known/genid/49b69061d73c2102e0328121a637ab78#51
domain: http://lodlaundromat.org/.well-known/genid/49b69061d73c2102e0328121a637ab78#72
domain: http://lodlaundromat.org/.well-known/genid/49b69061d73c2102e0328121a637ab78#99
domain: Group
domain: http://lodlaundromat.org/.well-known/genid/49b69061d73c2102e0328121a637ab78#86
domain: http://lodlaundromat.org/.well-known/genid/49b69061d73c2102e0328121a637ab78#1
domain: http://lodlaundromat.org/.well-known/genid/49b69061d73c2102e0328121a637ab78#116
domain: Collection
domain: http://lodlaundromat.org/.well-known/genid/49b69061d73c2102e0328121a637ab78#96
domain: Organization
domain: http://lodlaundromat.org/.well-known/genid/49b69061d73c2102e0328121a637ab78#54
domain: http://lodlaundromat.org/.well-known/genid/49b69061d73c2102e0328121a637ab78#76
domain: http://lodlaundromat.org/.well-known/genid/49b69061d73c2102e0328121a637ab78#122
domain: http://lodlaundromat.org/.well-known/genid/49b69061d73c2102e0328121a637ab78#110
domain: http://lodlaundromat.org/.well-known/genid/49b69061d73c2102e0328121a637ab78#132
domain: http://lodlaundromat.org/.well-known/genid/49b69061d73c2102e0328121a637ab78#48
domain: http://lodlaundromat.org/.well-known/genid/49b69061d73c2102e0328121a637ab78#2
domain: http://lodlaundromat.org/.well-known/genid/49b69061d73c2102e0328121a637ab78#81
domain: http://lodlaundromat.org/.well-known/genid/49b69061d73c2102e0328121a637ab78#128
domain: http://lodlaundromat.org/.well-known/genid/49b69061d73c2102e0328121a637ab78#40
domain: http://lodlaundromat.org/.well-known/genid/49b69061d73c2102e0328121a637ab78#104
range: Resource

Recovered
range: Thing
domain: Thing
type: ObjectProperty
comment: This property specifies a recovery event
domain: http://lodlaundromat.org/.well-known/genid/49b69061d73c2102e0328121a637ab78#17
range: Event
type: Property
domain: Resource
range: http://lodlaundromat.org/.well-known/genid/49b69061d73c2102e0328121a637ab78#116
range: Resource
range: http://lodlaundromat.org/.well-known/genid/49b69061d73c2102e0328121a637ab78#122
range: http://lodlaundromat.org/.well-known/genid/49b69061d73c2102e0328121a637ab78#136
range: http://lodlaundromat.org/.well-known/genid/49b69061d73c2102e0328121a637ab78#110

Proto-Being
subclass of: Resource
subclass of: Thing
type: Class
subclass of: Person
comment: This class represents something that may develop into a being for cases where the being/item divide isn't clear
subclass of: Being
subclass of: http://lodlaundromat.org/.well-known/genid/49b69061d73c2102e0328121a637ab78#67
subclass of: http://lodlaundromat.org/.well-known/genid/49b69061d73c2102e0328121a637ab78#91
subclass of: http://lodlaundromat.org/.well-known/genid/49b69061d73c2102e0328121a637ab78#76
subclass of: http://lodlaundromat.org/.well-known/genid/49b69061d73c2102e0328121a637ab78#54
subclass of: http://lodlaundromat.org/.well-known/genid/49b69061d73c2102e0328121a637ab78#110
subclass of: Entity
subclass of: http://lodlaundromat.org/.well-known/genid/49b69061d73c2102e0328121a637ab78#86
subclass of: http://lodlaundromat.org/.well-known/genid/49b69061d73c2102e0328121a637ab78#104
subclass of: http://lodlaundromat.org/.well-known/genid/49b69061d73c2102e0328121a637ab78#107
subclass of: http://lodlaundromat.org/.well-known/genid/49b69061d73c2102e0328121a637ab78#122
subclass of: http://lodlaundromat.org/.well-known/genid/49b69061d73c2102e0328121a637ab78#128
subclass of: http://lodlaundromat.org/.well-known/genid/49b69061d73c2102e0328121a637ab78#96
subclass of: http://lodlaundromat.org/.well-known/genid/49b69061d73c2102e0328121a637ab78#44
subclass of: http://lodlaundromat.org/.well-known/genid/49b69061d73c2102e0328121a637ab78#81
subclass of: http://lodlaundromat.org/.well-known/genid/49b69061d73c2102e0328121a637ab78#72
subclass of: http://lodlaundromat.org/.well-known/genid/49b69061d73c2102e0328121a637ab78#132
subclass of: http://lodlaundromat.org/.well-known/genid/49b69061d73c2102e0328121a637ab78#2
subclass of: http://lodlaundromat.org/.well-known/genid/49b69061d73c2102e0328121a637ab78#136
subclass of: http://lodlaundromat.org/.well-known/genid/49b69061d73c2102e0328121a637ab78#99

Portrays
range: Thing
domain: Thing
type: ObjectProperty
comment: This property specifies what entity or event is being portrayed
domain: http://lodlaundromat.org/.well-known/genid/49b69061d73c2102e0328121a637ab78#110
range: http://lodlaundromat.org/.well-known/genid/49b69061d73c2102e0328121a637ab78#116
sub property of: is-linked-to
inverse of: portrayed-by
type: Property
domain: Resource
range: Resource

Deal Broker
range: Thing
domain: Thing
type: ObjectProperty
comment: This property specifies the broker of the deal
domain: Deal
range: http://lodlaundromat.org/.well-known/genid/49b69061d73c2102e0328121a637ab78#107
type: Property
domain: Bond
domain: Resource
domain: Abstract-Item
range: Resource

Wears
range: Thing
domain: Thing
type: ObjectProperty
comment: This property specifies an item worn by the being
domain: Physical-Item
range: Alphabet
type: Property
domain: Resource
domain: http://lodlaundromat.org/.well-known/genid/49b69061d73c2102e0328121a637ab78#122
domain: http://lodlaundromat.org/.well-known/genid/49b69061d73c2102e0328121a637ab78#128
domain: http://lodlaundromat.org/.well-known/genid/49b69061d73c2102e0328121a637ab78#132
domain: http://lodlaundromat.org/.well-known/genid/49b69061d73c2102e0328121a637ab78#6
domain: http://lodlaundromat.org/.well-known/genid/49b69061d73c2102e0328121a637ab78#116
domain: http://lodlaundromat.org/.well-known/genid/49b69061d73c2102e0328121a637ab78#59
domain: http://lodlaundromat.org/.well-known/genid/49b69061d73c2102e0328121a637ab78#63
domain: http://lodlaundromat.org/.well-known/genid/49b69061d73c2102e0328121a637ab78#110
domain: http://lodlaundromat.org/.well-known/genid/49b69061d73c2102e0328121a637ab78#136
range: Resource

Profession
subclass of: http://lodlaundromat.org/.well-known/genid/49b69061d73c2102e0328121a637ab78#67
subclass of: http://lodlaundromat.org/.well-known/genid/49b69061d73c2102e0328121a637ab78#81
subclass of: http://lodlaundromat.org/.well-known/genid/49b69061d73c2102e0328121a637ab78#34
subclass of: http://lodlaundromat.org/.well-known/genid/49b69061d73c2102e0328121a637ab78#86
subclass of: http://lodlaundromat.org/.well-known/genid/49b69061d73c2102e0328121a637ab78#72
subclass of: Thing
type: Class
subclass of: http://lodlaundromat.org/.well-known/genid/49b69061d73c2102e0328121a637ab78#91
subclass of: http://lodlaundromat.org/.well-known/genid/49b69061d73c2102e0328121a637ab78#76
subclass of: http://lodlaundromat.org/.well-known/genid/49b69061d73c2102e0328121a637ab78#37
subclass of: Resource
subclass of: http://lodlaundromat.org/.well-known/genid/49b69061d73c2102e0328121a637ab78#54
comment: This class represents a profession
subclass of: Abstract-Item

Physical Injury
range: Thing
domain: Thing
type: ObjectProperty
comment: This property specifies the emotional well-being of a being
domain: Being
range: Physical Injury
type: Property
domain: Resource
domain: Entity
domain: http://lodlaundromat.org/.well-known/genid/49b69061d73c2102e0328121a637ab78#128
domain: http://lodlaundromat.org/.well-known/genid/49b69061d73c2102e0328121a637ab78#44
domain: http://lodlaundromat.org/.well-known/genid/49b69061d73c2102e0328121a637ab78#110
domain: http://lodlaundromat.org/.well-known/genid/49b69061d73c2102e0328121a637ab78#132
domain: http://lodlaundromat.org/.well-known/genid/49b69061d73c2102e0328121a637ab78#99
domain: http://lodlaundromat.org/.well-known/genid/49b69061d73c2102e0328121a637ab78#107
domain: http://lodlaundromat.org/.well-known/genid/49b69061d73c2102e0328121a637ab78#122
domain: http://lodlaundromat.org/.well-known/genid/49b69061d73c2102e0328121a637ab78#104
domain: http://lodlaundromat.org/.well-known/genid/49b69061d73c2102e0328121a637ab78#86
domain: http://lodlaundromat.org/.well-known/genid/49b69061d73c2102e0328121a637ab78#136
domain: http://lodlaundromat.org/.well-known/genid/49b69061d73c2102e0328121a637ab78#96
domain: Person
domain: http://lodlaundromat.org/.well-known/genid/49b69061d73c2102e0328121a637ab78#2
domain: http://lodlaundromat.org/.well-known/genid/49b69061d73c2102e0328121a637ab78#67
domain: http://lodlaundromat.org/.well-known/genid/49b69061d73c2102e0328121a637ab78#91
domain: http://lodlaundromat.org/.well-known/genid/49b69061d73c2102e0328121a637ab78#54
domain: http://lodlaundromat.org/.well-known/genid/49b69061d73c2102e0328121a637ab78#76
domain: http://lodlaundromat.org/.well-known/genid/49b69061d73c2102e0328121a637ab78#81
domain: http://lodlaundromat.org/.well-known/genid/49b69061d73c2102e0328121a637ab78#72
range: http://lodlaundromat.org/.well-known/genid/49b69061d73c2102e0328121a637ab78#12
range: Resource
range: http://lodlaundromat.org/.well-known/genid/49b69061d73c2102e0328121a637ab78#8
range: http://lodlaundromat.org/.well-known/genid/49b69061d73c2102e0328121a637ab78#17
range: http://lodlaundromat.org/.well-known/genid/49b69061d73c2102e0328121a637ab78#22
range: http://lodlaundromat.org/.well-known/genid/49b69061d73c2102e0328121a637ab78#26
range: Abstract-Item

Used By
range: Thing
domain: Thing
type: ObjectProperty
comment: This property specifies who/what an entity is typically used by
domain: http://lodlaundromat.org/.well-known/genid/49b69061d73c2102e0328121a637ab78#63
range: http://lodlaundromat.org/.well-known/genid/49b69061d73c2102e0328121a637ab78#67
type: Property
domain: Resource
range: Resource

Is Not A
range: Thing
domain: Thing
type: ObjectProperty
comment: This property represents a pledge that the entity is not the named thing
domain: Pledge
range: Entity
type: Property
domain: Resource
domain: Abstract-Item
domain: Bond
range: Resource

Mental Health
range: Thing
domain: Thing
type: ObjectProperty
comment: This property specifies the emotional well-being of a being
domain: Being
range: Mental Illness
type: Property
domain: Resource
domain: Entity
domain: http://lodlaundromat.org/.well-known/genid/49b69061d73c2102e0328121a637ab78#128
domain: http://lodlaundromat.org/.well-known/genid/49b69061d73c2102e0328121a637ab78#44
domain: http://lodlaundromat.org/.well-known/genid/49b69061d73c2102e0328121a637ab78#110
domain: http://lodlaundromat.org/.well-known/genid/49b69061d73c2102e0328121a637ab78#132
domain: http://lodlaundromat.org/.well-known/genid/49b69061d73c2102e0328121a637ab78#99
domain: http://lodlaundromat.org/.well-known/genid/49b69061d73c2102e0328121a637ab78#107
domain: http://lodlaundromat.org/.well-known/genid/49b69061d73c2102e0328121a637ab78#122
domain: http://lodlaundromat.org/.well-known/genid/49b69061d73c2102e0328121a637ab78#104
domain: http://lodlaundromat.org/.well-known/genid/49b69061d73c2102e0328121a637ab78#86
domain: http://lodlaundromat.org/.well-known/genid/49b69061d73c2102e0328121a637ab78#136
domain: http://lodlaundromat.org/.well-known/genid/49b69061d73c2102e0328121a637ab78#96
domain: Person
domain: http://lodlaundromat.org/.well-known/genid/49b69061d73c2102e0328121a637ab78#2
domain: http://lodlaundromat.org/.well-known/genid/49b69061d73c2102e0328121a637ab78#67
domain: http://lodlaundromat.org/.well-known/genid/49b69061d73c2102e0328121a637ab78#91
domain: http://lodlaundromat.org/.well-known/genid/49b69061d73c2102e0328121a637ab78#54
domain: http://lodlaundromat.org/.well-known/genid/49b69061d73c2102e0328121a637ab78#76
domain: http://lodlaundromat.org/.well-known/genid/49b69061d73c2102e0328121a637ab78#81
domain: http://lodlaundromat.org/.well-known/genid/49b69061d73c2102e0328121a637ab78#72
range: http://lodlaundromat.org/.well-known/genid/49b69061d73c2102e0328121a637ab78#12
range: Resource
range: http://lodlaundromat.org/.well-known/genid/49b69061d73c2102e0328121a637ab78#8
range: http://lodlaundromat.org/.well-known/genid/49b69061d73c2102e0328121a637ab78#31
range: http://lodlaundromat.org/.well-known/genid/49b69061d73c2102e0328121a637ab78#22
range: http://lodlaundromat.org/.well-known/genid/49b69061d73c2102e0328121a637ab78#26
range: http://lodlaundromat.org/.well-known/genid/49b69061d73c2102e0328121a637ab78#17
range: Abstract-Item

Speaks Basic
range: Thing
domain: Thing
type: ObjectProperty
comment: This property specifies a language spoken at a basic level by the being
domain: Being
range: Language
sub property of: Speaks
type: Property
domain: Resource
domain: http://lodlaundromat.org/.well-known/genid/49b69061d73c2102e0328121a637ab78#72
domain: http://lodlaundromat.org/.well-known/genid/49b69061d73c2102e0328121a637ab78#99
domain: http://lodlaundromat.org/.well-known/genid/49b69061d73c2102e0328121a637ab78#104
domain: http://lodlaundromat.org/.well-known/genid/49b69061d73c2102e0328121a637ab78#44
domain: http://lodlaundromat.org/.well-known/genid/49b69061d73c2102e0328121a637ab78#96
domain: http://lodlaundromat.org/.well-known/genid/49b69061d73c2102e0328121a637ab78#136
domain: Person
domain: http://lodlaundromat.org/.well-known/genid/49b69061d73c2102e0328121a637ab78#76
domain: http://lodlaundromat.org/.well-known/genid/49b69061d73c2102e0328121a637ab78#81
domain: http://lodlaundromat.org/.well-known/genid/49b69061d73c2102e0328121a637ab78#54
domain: http://lodlaundromat.org/.well-known/genid/49b69061d73c2102e0328121a637ab78#91
domain: http://lodlaundromat.org/.well-known/genid/49b69061d73c2102e0328121a637ab78#122
domain: http://lodlaundromat.org/.well-known/genid/49b69061d73c2102e0328121a637ab78#132
domain: http://lodlaundromat.org/.well-known/genid/49b69061d73c2102e0328121a637ab78#67
domain: http://lodlaundromat.org/.well-known/genid/49b69061d73c2102e0328121a637ab78#86
domain: http://lodlaundromat.org/.well-known/genid/49b69061d73c2102e0328121a637ab78#128
domain: http://lodlaundromat.org/.well-known/genid/49b69061d73c2102e0328121a637ab78#2
domain: http://lodlaundromat.org/.well-known/genid/49b69061d73c2102e0328121a637ab78#110
domain: http://lodlaundromat.org/.well-known/genid/49b69061d73c2102e0328121a637ab78#107
domain: Entity
range: Resource

Resolved
range: Thing
domain: Thing
type: ObjectProperty
comment: This property specifies a crisis resolution event
domain: Emotional Crisis
range: Event
type: Property
domain: http://lodlaundromat.org/.well-known/genid/49b69061d73c2102e0328121a637ab78#26
domain: Resource
domain: http://lodlaundromat.org/.well-known/genid/49b69061d73c2102e0328121a637ab78#17
domain: http://lodlaundromat.org/.well-known/genid/49b69061d73c2102e0328121a637ab78#12
domain: Abstract-Item
range: http://lodlaundromat.org/.well-known/genid/49b69061d73c2102e0328121a637ab78#116
range: Resource
range: http://lodlaundromat.org/.well-known/genid/49b69061d73c2102e0328121a637ab78#122
range: http://lodlaundromat.org/.well-known/genid/49b69061d73c2102e0328121a637ab78#136
range: http://lodlaundromat.org/.well-known/genid/49b69061d73c2102e0328121a637ab78#110

Have Not Done
range: Thing
domain: Thing
type: ObjectProperty
comment: This property represents a pledge that the entity has not done the named thing
domain: Pledge
range: Event
type: Property
domain: Resource
domain: Abstract-Item
domain: Bond
range: http://lodlaundromat.org/.well-known/genid/49b69061d73c2102e0328121a637ab78#116
range: Resource
range: http://lodlaundromat.org/.well-known/genid/49b69061d73c2102e0328121a637ab78#122
range: http://lodlaundromat.org/.well-known/genid/49b69061d73c2102e0328121a637ab78#136
range: http://lodlaundromat.org/.well-known/genid/49b69061d73c2102e0328121a637ab78#110

Physical Illness
subclass of: Thing
subclass of: Resource
type: Class
subclass of: http://lodlaundromat.org/.well-known/genid/49b69061d73c2102e0328121a637ab78#31
subclass of: http://lodlaundromat.org/.well-known/genid/49b69061d73c2102e0328121a637ab78#26
subclass of: http://lodlaundromat.org/.well-known/genid/49b69061d73c2102e0328121a637ab78#12
subclass of: http://lodlaundromat.org/.well-known/genid/49b69061d73c2102e0328121a637ab78#17
subclass of: http://lodlaundromat.org/.well-known/genid/49b69061d73c2102e0328121a637ab78#8
subclass of: http://lodlaundromat.org/.well-known/genid/49b69061d73c2102e0328121a637ab78#22
comment: This class represents a physical illness
subclass of: Abstract-Item

Will Not Do
range: Thing
domain: Thing
type: ObjectProperty
comment: This property represents a pledge that the entity will not do the named thing
domain: Pledge
range: Event
type: Property
domain: Resource
domain: Abstract-Item
domain: Bond
range: http://lodlaundromat.org/.well-known/genid/49b69061d73c2102e0328121a637ab78#116
range: Resource
range: http://lodlaundromat.org/.well-known/genid/49b69061d73c2102e0328121a637ab78#122
range: http://lodlaundromat.org/.well-known/genid/49b69061d73c2102e0328121a637ab78#136
range: http://lodlaundromat.org/.well-known/genid/49b69061d73c2102e0328121a637ab78#110

Governed By
domain: http://lodlaundromat.org/.well-known/genid/49b69061d73c2102e0328121a637ab78#48
range: Thing
domain: Thing
type: ObjectProperty
comment: This property specifies a class of items of which the group or collection is made
domain: http://lodlaundromat.org/.well-known/genid/49b69061d73c2102e0328121a637ab78#51
range: Government
inverse of: Governs
type: Property
domain: Resource
range: Resource
range: http://lodlaundromat.org/.well-known/genid/49b69061d73c2102e0328121a637ab78#116
range: http://lodlaundromat.org/.well-known/genid/49b69061d73c2102e0328121a637ab78#51
range: http://lodlaundromat.org/.well-known/genid/49b69061d73c2102e0328121a637ab78#48
range: http://lodlaundromat.org/.well-known/genid/49b69061d73c2102e0328121a637ab78#1
range: Group
range: http://lodlaundromat.org/.well-known/genid/49b69061d73c2102e0328121a637ab78#67
range: http://lodlaundromat.org/.well-known/genid/49b69061d73c2102e0328121a637ab78#104
range: http://lodlaundromat.org/.well-known/genid/49b69061d73c2102e0328121a637ab78#54
range: http://lodlaundromat.org/.well-known/genid/49b69061d73c2102e0328121a637ab78#76
range: http://lodlaundromat.org/.well-known/genid/49b69061d73c2102e0328121a637ab78#91
range: http://lodlaundromat.org/.well-known/genid/49b69061d73c2102e0328121a637ab78#99
range: http://lodlaundromat.org/.well-known/genid/49b69061d73c2102e0328121a637ab78#72
range: http://lodlaundromat.org/.well-known/genid/49b69061d73c2102e0328121a637ab78#122
range: http://lodlaundromat.org/.well-known/genid/49b69061d73c2102e0328121a637ab78#40
range: http://lodlaundromat.org/.well-known/genid/49b69061d73c2102e0328121a637ab78#34
range: Organization
range: http://lodlaundromat.org/.well-known/genid/49b69061d73c2102e0328121a637ab78#86
range: http://lodlaundromat.org/.well-known/genid/49b69061d73c2102e0328121a637ab78#107
range: Organisation
range: http://lodlaundromat.org/.well-known/genid/49b69061d73c2102e0328121a637ab78#37
range: http://lodlaundromat.org/.well-known/genid/49b69061d73c2102e0328121a637ab78#110
range: http://lodlaundromat.org/.well-known/genid/49b69061d73c2102e0328121a637ab78#128
range: http://lodlaundromat.org/.well-known/genid/49b69061d73c2102e0328121a637ab78#132
range: http://lodlaundromat.org/.well-known/genid/49b69061d73c2102e0328121a637ab78#136
range: Collection
range: http://lodlaundromat.org/.well-known/genid/49b69061d73c2102e0328121a637ab78#81
range: http://lodlaundromat.org/.well-known/genid/49b69061d73c2102e0328121a637ab78#2
range: http://lodlaundromat.org/.well-known/genid/49b69061d73c2102e0328121a637ab78#96

Is Relation Of
range: Thing
domain: Thing
range: Family Bond
domain: Being
type: ObjectProperty
comment: This property specifies that the Being is the child of the specified Being
domain: Family Bond
range: Being
type: Property
domain: Resource
domain: Abstract-Item
domain: Bond
domain: Entity
domain: http://lodlaundromat.org/.well-known/genid/49b69061d73c2102e0328121a637ab78#128
domain: http://lodlaundromat.org/.well-known/genid/49b69061d73c2102e0328121a637ab78#44
domain: http://lodlaundromat.org/.well-known/genid/49b69061d73c2102e0328121a637ab78#110
domain: http://lodlaundromat.org/.well-known/genid/49b69061d73c2102e0328121a637ab78#132
domain: http://lodlaundromat.org/.well-known/genid/49b69061d73c2102e0328121a637ab78#99
domain: http://lodlaundromat.org/.well-known/genid/49b69061d73c2102e0328121a637ab78#107
domain: http://lodlaundromat.org/.well-known/genid/49b69061d73c2102e0328121a637ab78#122
domain: http://lodlaundromat.org/.well-known/genid/49b69061d73c2102e0328121a637ab78#104
domain: http://lodlaundromat.org/.well-known/genid/49b69061d73c2102e0328121a637ab78#86
domain: http://lodlaundromat.org/.well-known/genid/49b69061d73c2102e0328121a637ab78#136
domain: http://lodlaundromat.org/.well-known/genid/49b69061d73c2102e0328121a637ab78#96
domain: Person
domain: http://lodlaundromat.org/.well-known/genid/49b69061d73c2102e0328121a637ab78#2
domain: http://lodlaundromat.org/.well-known/genid/49b69061d73c2102e0328121a637ab78#67
domain: http://lodlaundromat.org/.well-known/genid/49b69061d73c2102e0328121a637ab78#91
domain: http://lodlaundromat.org/.well-known/genid/49b69061d73c2102e0328121a637ab78#54
domain: http://lodlaundromat.org/.well-known/genid/49b69061d73c2102e0328121a637ab78#76
domain: http://lodlaundromat.org/.well-known/genid/49b69061d73c2102e0328121a637ab78#81
domain: http://lodlaundromat.org/.well-known/genid/49b69061d73c2102e0328121a637ab78#72
range: http://lodlaundromat.org/.well-known/genid/49b69061d73c2102e0328121a637ab78#44
range: Resource
range: http://lodlaundromat.org/.well-known/genid/49b69061d73c2102e0328121a637ab78#128
range: Entity
range: http://lodlaundromat.org/.well-known/genid/49b69061d73c2102e0328121a637ab78#67
range: http://lodlaundromat.org/.well-known/genid/49b69061d73c2102e0328121a637ab78#54
range: http://lodlaundromat.org/.well-known/genid/49b69061d73c2102e0328121a637ab78#72
range: http://lodlaundromat.org/.well-known/genid/49b69061d73c2102e0328121a637ab78#2
range: http://lodlaundromat.org/.well-known/genid/49b69061d73c2102e0328121a637ab78#91
range: http://lodlaundromat.org/.well-known/genid/49b69061d73c2102e0328121a637ab78#86
range: http://lodlaundromat.org/.well-known/genid/49b69061d73c2102e0328121a637ab78#122
range: http://lodlaundromat.org/.well-known/genid/49b69061d73c2102e0328121a637ab78#96
range: http://lodlaundromat.org/.well-known/genid/49b69061d73c2102e0328121a637ab78#107
range: Person
range: http://lodlaundromat.org/.well-known/genid/49b69061d73c2102e0328121a637ab78#81
range: http://lodlaundromat.org/.well-known/genid/49b69061d73c2102e0328121a637ab78#132
range: http://lodlaundromat.org/.well-known/genid/49b69061d73c2102e0328121a637ab78#136
range: http://lodlaundromat.org/.well-known/genid/49b69061d73c2102e0328121a637ab78#110
range: http://lodlaundromat.org/.well-known/genid/49b69061d73c2102e0328121a637ab78#104
range: Bond
range: http://lodlaundromat.org/.well-known/genid/49b69061d73c2102e0328121a637ab78#76
range: http://lodlaundromat.org/.well-known/genid/49b69061d73c2102e0328121a637ab78#99
range: Abstract-Item

Government
subclass of: Resource
subclass of: Thing
type: Class
subclass of: Organization
comment: This class represents a governing group
subclass of: Organisation
subclass of: http://lodlaundromat.org/.well-known/genid/49b69061d73c2102e0328121a637ab78#1
subclass of: Group
subclass of: http://lodlaundromat.org/.well-known/genid/49b69061d73c2102e0328121a637ab78#96
subclass of: http://lodlaundromat.org/.well-known/genid/49b69061d73c2102e0328121a637ab78#37
subclass of: http://lodlaundromat.org/.well-known/genid/49b69061d73c2102e0328121a637ab78#136
subclass of: http://lodlaundromat.org/.well-known/genid/49b69061d73c2102e0328121a637ab78#116
subclass of: http://lodlaundromat.org/.well-known/genid/49b69061d73c2102e0328121a637ab78#2
subclass of: http://lodlaundromat.org/.well-known/genid/49b69061d73c2102e0328121a637ab78#81
subclass of: http://lodlaundromat.org/.well-known/genid/49b69061d73c2102e0328121a637ab78#107
subclass of: http://lodlaundromat.org/.well-known/genid/49b69061d73c2102e0328121a637ab78#54
subclass of: http://lodlaundromat.org/.well-known/genid/49b69061d73c2102e0328121a637ab78#91
subclass of: http://lodlaundromat.org/.well-known/genid/49b69061d73c2102e0328121a637ab78#51
subclass of: http://lodlaundromat.org/.well-known/genid/49b69061d73c2102e0328121a637ab78#122
subclass of: Collection
subclass of: http://lodlaundromat.org/.well-known/genid/49b69061d73c2102e0328121a637ab78#40
subclass of: http://lodlaundromat.org/.well-known/genid/49b69061d73c2102e0328121a637ab78#132
subclass of: http://lodlaundromat.org/.well-known/genid/49b69061d73c2102e0328121a637ab78#34
subclass of: http://lodlaundromat.org/.well-known/genid/49b69061d73c2102e0328121a637ab78#110
subclass of: http://lodlaundromat.org/.well-known/genid/49b69061d73c2102e0328121a637ab78#76
subclass of: http://lodlaundromat.org/.well-known/genid/49b69061d73c2102e0328121a637ab78#128
subclass of: http://lodlaundromat.org/.well-known/genid/49b69061d73c2102e0328121a637ab78#72
subclass of: http://lodlaundromat.org/.well-known/genid/49b69061d73c2102e0328121a637ab78#48
subclass of: http://lodlaundromat.org/.well-known/genid/49b69061d73c2102e0328121a637ab78#104
subclass of: http://lodlaundromat.org/.well-known/genid/49b69061d73c2102e0328121a637ab78#99
subclass of: http://lodlaundromat.org/.well-known/genid/49b69061d73c2102e0328121a637ab78#86
subclass of: http://lodlaundromat.org/.well-known/genid/49b69061d73c2102e0328121a637ab78#67

Community
subclass of: Resource
subclass of: Thing
type: Class
subclass of: Group
comment: This class represents a community
subclass of: http://lodlaundromat.org/.well-known/genid/49b69061d73c2102e0328121a637ab78#1
subclass of: http://lodlaundromat.org/.well-known/genid/49b69061d73c2102e0328121a637ab78#91
subclass of: http://lodlaundromat.org/.well-known/genid/49b69061d73c2102e0328121a637ab78#136
subclass of: http://lodlaundromat.org/.well-known/genid/49b69061d73c2102e0328121a637ab78#34
subclass of: http://lodlaundromat.org/.well-known/genid/49b69061d73c2102e0328121a637ab78#40
subclass of: http://lodlaundromat.org/.well-known/genid/49b69061d73c2102e0328121a637ab78#54
subclass of: http://lodlaundromat.org/.well-known/genid/49b69061d73c2102e0328121a637ab78#72
subclass of: http://lodlaundromat.org/.well-known/genid/49b69061d73c2102e0328121a637ab78#48
subclass of: http://lodlaundromat.org/.well-known/genid/49b69061d73c2102e0328121a637ab78#67
subclass of: http://lodlaundromat.org/.well-known/genid/49b69061d73c2102e0328121a637ab78#99
subclass of: http://lodlaundromat.org/.well-known/genid/49b69061d73c2102e0328121a637ab78#81
subclass of: http://lodlaundromat.org/.well-known/genid/49b69061d73c2102e0328121a637ab78#51
subclass of: http://lodlaundromat.org/.well-known/genid/49b69061d73c2102e0328121a637ab78#37
subclass of: http://lodlaundromat.org/.well-known/genid/49b69061d73c2102e0328121a637ab78#110
subclass of: http://lodlaundromat.org/.well-known/genid/49b69061d73c2102e0328121a637ab78#2
subclass of: http://lodlaundromat.org/.well-known/genid/49b69061d73c2102e0328121a637ab78#122
subclass of: http://lodlaundromat.org/.well-known/genid/49b69061d73c2102e0328121a637ab78#76
subclass of: http://lodlaundromat.org/.well-known/genid/49b69061d73c2102e0328121a637ab78#116
subclass of: http://lodlaundromat.org/.well-known/genid/49b69061d73c2102e0328121a637ab78#132
subclass of: Collection
subclass of: http://lodlaundromat.org/.well-known/genid/49b69061d73c2102e0328121a637ab78#107
subclass of: http://lodlaundromat.org/.well-known/genid/49b69061d73c2102e0328121a637ab78#86
subclass of: http://lodlaundromat.org/.well-known/genid/49b69061d73c2102e0328121a637ab78#128
subclass of: http://lodlaundromat.org/.well-known/genid/49b69061d73c2102e0328121a637ab78#96
subclass of: http://lodlaundromat.org/.well-known/genid/49b69061d73c2102e0328121a637ab78#104

Speaks Fluently
range: Thing
domain: Thing
type: ObjectProperty
comment: This property specifies a language spoken fluently by the being
domain: Being
range: Language
sub property of: Speaks
type: Property
domain: Resource
domain: http://lodlaundromat.org/.well-known/genid/49b69061d73c2102e0328121a637ab78#72
domain: http://lodlaundromat.org/.well-known/genid/49b69061d73c2102e0328121a637ab78#99
domain: http://lodlaundromat.org/.well-known/genid/49b69061d73c2102e0328121a637ab78#104
domain: http://lodlaundromat.org/.well-known/genid/49b69061d73c2102e0328121a637ab78#44
domain: http://lodlaundromat.org/.well-known/genid/49b69061d73c2102e0328121a637ab78#96
domain: http://lodlaundromat.org/.well-known/genid/49b69061d73c2102e0328121a637ab78#136
domain: Person
domain: http://lodlaundromat.org/.well-known/genid/49b69061d73c2102e0328121a637ab78#76
domain: http://lodlaundromat.org/.well-known/genid/49b69061d73c2102e0328121a637ab78#81
domain: http://lodlaundromat.org/.well-known/genid/49b69061d73c2102e0328121a637ab78#54
domain: http://lodlaundromat.org/.well-known/genid/49b69061d73c2102e0328121a637ab78#91
domain: http://lodlaundromat.org/.well-known/genid/49b69061d73c2102e0328121a637ab78#122
domain: http://lodlaundromat.org/.well-known/genid/49b69061d73c2102e0328121a637ab78#132
domain: http://lodlaundromat.org/.well-known/genid/49b69061d73c2102e0328121a637ab78#67
domain: http://lodlaundromat.org/.well-known/genid/49b69061d73c2102e0328121a637ab78#86
domain: http://lodlaundromat.org/.well-known/genid/49b69061d73c2102e0328121a637ab78#128
domain: http://lodlaundromat.org/.well-known/genid/49b69061d73c2102e0328121a637ab78#2
domain: http://lodlaundromat.org/.well-known/genid/49b69061d73c2102e0328121a637ab78#110
domain: http://lodlaundromat.org/.well-known/genid/49b69061d73c2102e0328121a637ab78#107
domain: Entity
range: Resource

Blood Family Bond
subclass of: Resource
subclass of: Thing
type: Class
comment: This class represents a blood bond that exists between beings or groups of beings
subclass of: Family Bond
subclass of: Bond
subclass of: Abstract-Item

Owns
range: Thing
domain: Thing
type: ObjectProperty
comment: This property specifies the ownership of an entity
domain: Possession
range: Entity
type: Property
domain: Resource
domain: Abstract-Item
domain: Bond
range: Resource

Will Not Bond To
range: Thing
domain: Thing
type: ObjectProperty
comment: This property represents a pledge that the entity will not have a bond with the named entity
domain: Pledge
range: http://lodlaundromat.org/.well-known/genid/49b69061d73c2102e0328121a637ab78#91
type: Property
domain: Resource
domain: Abstract-Item
domain: Bond
range: Resource

Deal
subclass of: Thing
subclass of: Resource
type: Class
comment: This class represents a deal that exists between beings or groups of beings
subclass of: Bond
subclass of: Abstract-Item

Works For
range: Thing
domain: Thing
type: ObjectProperty
comment: This property represents the entity being worked for
domain: Profession
range: http://lodlaundromat.org/.well-known/genid/49b69061d73c2102e0328121a637ab78#72
type: Property
domain: Resource
domain: http://lodlaundromat.org/.well-known/genid/49b69061d73c2102e0328121a637ab78#34
domain: http://lodlaundromat.org/.well-known/genid/49b69061d73c2102e0328121a637ab78#81
domain: http://lodlaundromat.org/.well-known/genid/49b69061d73c2102e0328121a637ab78#54
domain: http://lodlaundromat.org/.well-known/genid/49b69061d73c2102e0328121a637ab78#37
domain: Abstract-Item
domain: http://lodlaundromat.org/.well-known/genid/49b69061d73c2102e0328121a637ab78#72
domain: http://lodlaundromat.org/.well-known/genid/49b69061d73c2102e0328121a637ab78#91
domain: http://lodlaundromat.org/.well-known/genid/49b69061d73c2102e0328121a637ab78#76
domain: http://lodlaundromat.org/.well-known/genid/49b69061d73c2102e0328121a637ab78#86
domain: http://lodlaundromat.org/.well-known/genid/49b69061d73c2102e0328121a637ab78#67
range: Resource

Has Number Of Parts
range: Thing
domain: Thing
type: ObjectProperty
comment: This property specifies the number of parts contained by the collection
domain: Collection
range: Literal
type: Property
domain: Resource
domain: http://lodlaundromat.org/.well-known/genid/49b69061d73c2102e0328121a637ab78#40
range: Resource

Writes
range: Thing
domain: Thing
type: ObjectProperty
comment: This property specifies a language or alphabet read by the being
domain: Being
range: Alphabet
type: Property
domain: Resource
domain: Entity
domain: http://lodlaundromat.org/.well-known/genid/49b69061d73c2102e0328121a637ab78#128
domain: http://lodlaundromat.org/.well-known/genid/49b69061d73c2102e0328121a637ab78#44
domain: http://lodlaundromat.org/.well-known/genid/49b69061d73c2102e0328121a637ab78#110
domain: http://lodlaundromat.org/.well-known/genid/49b69061d73c2102e0328121a637ab78#132
domain: http://lodlaundromat.org/.well-known/genid/49b69061d73c2102e0328121a637ab78#99
domain: http://lodlaundromat.org/.well-known/genid/49b69061d73c2102e0328121a637ab78#107
domain: http://lodlaundromat.org/.well-known/genid/49b69061d73c2102e0328121a637ab78#122
domain: http://lodlaundromat.org/.well-known/genid/49b69061d73c2102e0328121a637ab78#104
domain: http://lodlaundromat.org/.well-known/genid/49b69061d73c2102e0328121a637ab78#86
domain: http://lodlaundromat.org/.well-known/genid/49b69061d73c2102e0328121a637ab78#136
domain: http://lodlaundromat.org/.well-known/genid/49b69061d73c2102e0328121a637ab78#96
domain: Person
domain: http://lodlaundromat.org/.well-known/genid/49b69061d73c2102e0328121a637ab78#2
domain: http://lodlaundromat.org/.well-known/genid/49b69061d73c2102e0328121a637ab78#67
domain: http://lodlaundromat.org/.well-known/genid/49b69061d73c2102e0328121a637ab78#91
domain: http://lodlaundromat.org/.well-known/genid/49b69061d73c2102e0328121a637ab78#54
domain: http://lodlaundromat.org/.well-known/genid/49b69061d73c2102e0328121a637ab78#76
domain: http://lodlaundromat.org/.well-known/genid/49b69061d73c2102e0328121a637ab78#81
domain: http://lodlaundromat.org/.well-known/genid/49b69061d73c2102e0328121a637ab78#72
range: Resource

Pledged Reciever
range: Thing
domain: Thing
type: ObjectProperty
comment: This property represents the reciever of the pledge
domain: Pledge
range: http://lodlaundromat.org/.well-known/genid/49b69061d73c2102e0328121a637ab78#99
type: Property
domain: Resource
domain: Abstract-Item
domain: Bond
range: Resource

Have Done
range: Thing
domain: Thing
type: ObjectProperty
comment: This property represents a pledge that the entity has done the named thing
domain: Pledge
range: Event
type: Property
domain: Resource
domain: Abstract-Item
domain: Bond
range: http://lodlaundromat.org/.well-known/genid/49b69061d73c2102e0328121a637ab78#116
range: Resource
range: http://lodlaundromat.org/.well-known/genid/49b69061d73c2102e0328121a637ab78#122
range: http://lodlaundromat.org/.well-known/genid/49b69061d73c2102e0328121a637ab78#136
range: http://lodlaundromat.org/.well-known/genid/49b69061d73c2102e0328121a637ab78#110

Household
subclass of: Resource
subclass of: Thing
type: Class
comment: This class represents a household
subclass of: Community
subclass of: http://lodlaundromat.org/.well-known/genid/49b69061d73c2102e0328121a637ab78#1
subclass of: Group
subclass of: http://lodlaundromat.org/.well-known/genid/49b69061d73c2102e0328121a637ab78#110
subclass of: http://lodlaundromat.org/.well-known/genid/49b69061d73c2102e0328121a637ab78#2
subclass of: http://lodlaundromat.org/.well-known/genid/49b69061d73c2102e0328121a637ab78#81
subclass of: http://lodlaundromat.org/.well-known/genid/49b69061d73c2102e0328121a637ab78#122
subclass of: http://lodlaundromat.org/.well-known/genid/49b69061d73c2102e0328121a637ab78#132
subclass of: http://lodlaundromat.org/.well-known/genid/49b69061d73c2102e0328121a637ab78#48
subclass of: http://lodlaundromat.org/.well-known/genid/49b69061d73c2102e0328121a637ab78#116
subclass of: http://lodlaundromat.org/.well-known/genid/49b69061d73c2102e0328121a637ab78#96
subclass of: http://lodlaundromat.org/.well-known/genid/49b69061d73c2102e0328121a637ab78#99
subclass of: http://lodlaundromat.org/.well-known/genid/49b69061d73c2102e0328121a637ab78#91
subclass of: http://lodlaundromat.org/.well-known/genid/49b69061d73c2102e0328121a637ab78#37
subclass of: http://lodlaundromat.org/.well-known/genid/49b69061d73c2102e0328121a637ab78#72
subclass of: http://lodlaundromat.org/.well-known/genid/49b69061d73c2102e0328121a637ab78#54
subclass of: http://lodlaundromat.org/.well-known/genid/49b69061d73c2102e0328121a637ab78#40
subclass of: http://lodlaundromat.org/.well-known/genid/49b69061d73c2102e0328121a637ab78#76
subclass of: http://lodlaundromat.org/.well-known/genid/49b69061d73c2102e0328121a637ab78#104
subclass of: Collection
subclass of: http://lodlaundromat.org/.well-known/genid/49b69061d73c2102e0328121a637ab78#136
subclass of: http://lodlaundromat.org/.well-known/genid/49b69061d73c2102e0328121a637ab78#86
subclass of: http://lodlaundromat.org/.well-known/genid/49b69061d73c2102e0328121a637ab78#67
subclass of: http://lodlaundromat.org/.well-known/genid/49b69061d73c2102e0328121a637ab78#34
subclass of: http://lodlaundromat.org/.well-known/genid/49b69061d73c2102e0328121a637ab78#51
subclass of: http://lodlaundromat.org/.well-known/genid/49b69061d73c2102e0328121a637ab78#128
subclass of: http://lodlaundromat.org/.well-known/genid/49b69061d73c2102e0328121a637ab78#107

Diagnosed
range: Thing
domain: Thing
type: ObjectProperty
comment: This property specifies a diagnosis event
domain: http://lodlaundromat.org/.well-known/genid/49b69061d73c2102e0328121a637ab78#26
range: Event
type: Property
domain: Resource
range: http://lodlaundromat.org/.well-known/genid/49b69061d73c2102e0328121a637ab78#116
range: Resource
range: http://lodlaundromat.org/.well-known/genid/49b69061d73c2102e0328121a637ab78#122
range: http://lodlaundromat.org/.well-known/genid/49b69061d73c2102e0328121a637ab78#136
range: http://lodlaundromat.org/.well-known/genid/49b69061d73c2102e0328121a637ab78#110

Has Crisis
range: Thing
domain: Thing
type: ObjectProperty
comment: This property specifies the emotional crisis of a being
domain: Being
range: Event
sub property of: Emotional Health
type: Property
domain: Resource
domain: http://lodlaundromat.org/.well-known/genid/49b69061d73c2102e0328121a637ab78#72
domain: http://lodlaundromat.org/.well-known/genid/49b69061d73c2102e0328121a637ab78#99
domain: http://lodlaundromat.org/.well-known/genid/49b69061d73c2102e0328121a637ab78#104
domain: http://lodlaundromat.org/.well-known/genid/49b69061d73c2102e0328121a637ab78#44
domain: http://lodlaundromat.org/.well-known/genid/49b69061d73c2102e0328121a637ab78#96
domain: http://lodlaundromat.org/.well-known/genid/49b69061d73c2102e0328121a637ab78#136
domain: Person
domain: http://lodlaundromat.org/.well-known/genid/49b69061d73c2102e0328121a637ab78#76
domain: http://lodlaundromat.org/.well-known/genid/49b69061d73c2102e0328121a637ab78#81
domain: http://lodlaundromat.org/.well-known/genid/49b69061d73c2102e0328121a637ab78#54
domain: http://lodlaundromat.org/.well-known/genid/49b69061d73c2102e0328121a637ab78#91
domain: http://lodlaundromat.org/.well-known/genid/49b69061d73c2102e0328121a637ab78#122
domain: http://lodlaundromat.org/.well-known/genid/49b69061d73c2102e0328121a637ab78#132
domain: http://lodlaundromat.org/.well-known/genid/49b69061d73c2102e0328121a637ab78#67
domain: http://lodlaundromat.org/.well-known/genid/49b69061d73c2102e0328121a637ab78#86
domain: http://lodlaundromat.org/.well-known/genid/49b69061d73c2102e0328121a637ab78#128
domain: http://lodlaundromat.org/.well-known/genid/49b69061d73c2102e0328121a637ab78#2
domain: http://lodlaundromat.org/.well-known/genid/49b69061d73c2102e0328121a637ab78#110
domain: http://lodlaundromat.org/.well-known/genid/49b69061d73c2102e0328121a637ab78#107
domain: Entity
range: Emotional Crisis
range: Resource
range: http://lodlaundromat.org/.well-known/genid/49b69061d73c2102e0328121a637ab78#17
range: http://lodlaundromat.org/.well-known/genid/49b69061d73c2102e0328121a637ab78#12
range: http://lodlaundromat.org/.well-known/genid/49b69061d73c2102e0328121a637ab78#26
range: Abstract-Item
range: http://lodlaundromat.org/.well-known/genid/49b69061d73c2102e0328121a637ab78#116
range: http://lodlaundromat.org/.well-known/genid/49b69061d73c2102e0328121a637ab78#122
range: http://lodlaundromat.org/.well-known/genid/49b69061d73c2102e0328121a637ab78#136
range: http://lodlaundromat.org/.well-known/genid/49b69061d73c2102e0328121a637ab78#110

Organisation
subclass of: Resource
subclass of: Thing
type: Class
subclass of: Group
subclass of: Organization
comment: This class represents an organisation
equivalent class: Organization
subclass of: http://lodlaundromat.org/.well-known/genid/49b69061d73c2102e0328121a637ab78#1
subclass of: http://lodlaundromat.org/.well-known/genid/49b69061d73c2102e0328121a637ab78#2
subclass of: http://lodlaundromat.org/.well-known/genid/49b69061d73c2102e0328121a637ab78#34
subclass of: http://lodlaundromat.org/.well-known/genid/49b69061d73c2102e0328121a637ab78#122
subclass of: http://lodlaundromat.org/.well-known/genid/49b69061d73c2102e0328121a637ab78#116
subclass of: Collection
subclass of: http://lodlaundromat.org/.well-known/genid/49b69061d73c2102e0328121a637ab78#54
subclass of: http://lodlaundromat.org/.well-known/genid/49b69061d73c2102e0328121a637ab78#91
subclass of: http://lodlaundromat.org/.well-known/genid/49b69061d73c2102e0328121a637ab78#67
subclass of: http://lodlaundromat.org/.well-known/genid/49b69061d73c2102e0328121a637ab78#40
subclass of: http://lodlaundromat.org/.well-known/genid/49b69061d73c2102e0328121a637ab78#76
subclass of: http://lodlaundromat.org/.well-known/genid/49b69061d73c2102e0328121a637ab78#37
subclass of: http://lodlaundromat.org/.well-known/genid/49b69061d73c2102e0328121a637ab78#110
subclass of: http://lodlaundromat.org/.well-known/genid/49b69061d73c2102e0328121a637ab78#96
subclass of: http://lodlaundromat.org/.well-known/genid/49b69061d73c2102e0328121a637ab78#128
subclass of: http://lodlaundromat.org/.well-known/genid/49b69061d73c2102e0328121a637ab78#99
subclass of: http://lodlaundromat.org/.well-known/genid/49b69061d73c2102e0328121a637ab78#48
subclass of: http://lodlaundromat.org/.well-known/genid/49b69061d73c2102e0328121a637ab78#107
subclass of: http://lodlaundromat.org/.well-known/genid/49b69061d73c2102e0328121a637ab78#72
subclass of: http://lodlaundromat.org/.well-known/genid/49b69061d73c2102e0328121a637ab78#51
subclass of: http://lodlaundromat.org/.well-known/genid/49b69061d73c2102e0328121a637ab78#81
subclass of: http://lodlaundromat.org/.well-known/genid/49b69061d73c2102e0328121a637ab78#136
subclass of: http://lodlaundromat.org/.well-known/genid/49b69061d73c2102e0328121a637ab78#132
subclass of: http://lodlaundromat.org/.well-known/genid/49b69061d73c2102e0328121a637ab78#104
subclass of: http://lodlaundromat.org/.well-known/genid/49b69061d73c2102e0328121a637ab78#86

Carries Title
range: Thing
domain: Thing
type: ObjectProperty
comment: This property specifies a title which can be used by any members of the group
domain: http://lodlaundromat.org/.well-known/genid/49b69061d73c2102e0328121a637ab78#34
range: Name
type: Property
domain: Resource
range: Resource

Have Bonded To
range: Thing
domain: Thing
type: ObjectProperty
comment: This property represents a pledge that the entity has a bond with the named entity
domain: Pledge
range: http://lodlaundromat.org/.well-known/genid/49b69061d73c2102e0328121a637ab78#76
type: Property
domain: Resource
domain: Abstract-Item
domain: Bond
range: Resource

Bonded Group
subclass of: Resource
subclass of: Thing
type: Class
comment: This class represents a bonded group
subclass of: Community
subclass of: http://lodlaundromat.org/.well-known/genid/49b69061d73c2102e0328121a637ab78#1
subclass of: Group
subclass of: http://lodlaundromat.org/.well-known/genid/49b69061d73c2102e0328121a637ab78#40
subclass of: http://lodlaundromat.org/.well-known/genid/49b69061d73c2102e0328121a637ab78#116
subclass of: http://lodlaundromat.org/.well-known/genid/49b69061d73c2102e0328121a637ab78#122
subclass of: http://lodlaundromat.org/.well-known/genid/49b69061d73c2102e0328121a637ab78#48
subclass of: http://lodlaundromat.org/.well-known/genid/49b69061d73c2102e0328121a637ab78#107
subclass of: http://lodlaundromat.org/.well-known/genid/49b69061d73c2102e0328121a637ab78#91
subclass of: http://lodlaundromat.org/.well-known/genid/49b69061d73c2102e0328121a637ab78#2
subclass of: http://lodlaundromat.org/.well-known/genid/49b69061d73c2102e0328121a637ab78#76
subclass of: http://lodlaundromat.org/.well-known/genid/49b69061d73c2102e0328121a637ab78#104
subclass of: http://lodlaundromat.org/.well-known/genid/49b69061d73c2102e0328121a637ab78#67
subclass of: http://lodlaundromat.org/.well-known/genid/49b69061d73c2102e0328121a637ab78#132
subclass of: http://lodlaundromat.org/.well-known/genid/49b69061d73c2102e0328121a637ab78#54
subclass of: http://lodlaundromat.org/.well-known/genid/49b69061d73c2102e0328121a637ab78#96
subclass of: http://lodlaundromat.org/.well-known/genid/49b69061d73c2102e0328121a637ab78#128
subclass of: http://lodlaundromat.org/.well-known/genid/49b69061d73c2102e0328121a637ab78#136
subclass of: http://lodlaundromat.org/.well-known/genid/49b69061d73c2102e0328121a637ab78#34
subclass of: http://lodlaundromat.org/.well-known/genid/49b69061d73c2102e0328121a637ab78#51
subclass of: http://lodlaundromat.org/.well-known/genid/49b69061d73c2102e0328121a637ab78#86
subclass of: http://lodlaundromat.org/.well-known/genid/49b69061d73c2102e0328121a637ab78#72
subclass of: http://lodlaundromat.org/.well-known/genid/49b69061d73c2102e0328121a637ab78#37
subclass of: http://lodlaundromat.org/.well-known/genid/49b69061d73c2102e0328121a637ab78#81
subclass of: Collection
subclass of: http://lodlaundromat.org/.well-known/genid/49b69061d73c2102e0328121a637ab78#99
subclass of: http://lodlaundromat.org/.well-known/genid/49b69061d73c2102e0328121a637ab78#110

Partnership
subclass of: Resource
subclass of: Thing
type: Class
comment: This class represents a partnership
subclass of: Bonded Group
subclass of: http://lodlaundromat.org/.well-known/genid/49b69061d73c2102e0328121a637ab78#1
subclass of: Group
subclass of: Community
subclass of: http://lodlaundromat.org/.well-known/genid/49b69061d73c2102e0328121a637ab78#116
subclass of: http://lodlaundromat.org/.well-known/genid/49b69061d73c2102e0328121a637ab78#34
subclass of: http://lodlaundromat.org/.well-known/genid/49b69061d73c2102e0328121a637ab78#136
subclass of: http://lodlaundromat.org/.well-known/genid/49b69061d73c2102e0328121a637ab78#107
subclass of: http://lodlaundromat.org/.well-known/genid/49b69061d73c2102e0328121a637ab78#51
subclass of: http://lodlaundromat.org/.well-known/genid/49b69061d73c2102e0328121a637ab78#110
subclass of: http://lodlaundromat.org/.well-known/genid/49b69061d73c2102e0328121a637ab78#104
subclass of: http://lodlaundromat.org/.well-known/genid/49b69061d73c2102e0328121a637ab78#54
subclass of: Collection
subclass of: http://lodlaundromat.org/.well-known/genid/49b69061d73c2102e0328121a637ab78#72
subclass of: http://lodlaundromat.org/.well-known/genid/49b69061d73c2102e0328121a637ab78#96
subclass of: http://lodlaundromat.org/.well-known/genid/49b69061d73c2102e0328121a637ab78#48
subclass of: http://lodlaundromat.org/.well-known/genid/49b69061d73c2102e0328121a637ab78#132
subclass of: http://lodlaundromat.org/.well-known/genid/49b69061d73c2102e0328121a637ab78#122
subclass of: http://lodlaundromat.org/.well-known/genid/49b69061d73c2102e0328121a637ab78#99
subclass of: http://lodlaundromat.org/.well-known/genid/49b69061d73c2102e0328121a637ab78#2
subclass of: http://lodlaundromat.org/.well-known/genid/49b69061d73c2102e0328121a637ab78#81
subclass of: http://lodlaundromat.org/.well-known/genid/49b69061d73c2102e0328121a637ab78#40
subclass of: http://lodlaundromat.org/.well-known/genid/49b69061d73c2102e0328121a637ab78#67
subclass of: http://lodlaundromat.org/.well-known/genid/49b69061d73c2102e0328121a637ab78#128
subclass of: http://lodlaundromat.org/.well-known/genid/49b69061d73c2102e0328121a637ab78#91
subclass of: http://lodlaundromat.org/.well-known/genid/49b69061d73c2102e0328121a637ab78#86
subclass of: http://lodlaundromat.org/.well-known/genid/49b69061d73c2102e0328121a637ab78#76
subclass of: http://lodlaundromat.org/.well-known/genid/49b69061d73c2102e0328121a637ab78#37

Emotional Health
range: Thing
domain: Thing
type: ObjectProperty
comment: This property specifies the emotional well-being of a being
domain: Being
range: Emotional Crisis
type: Property
domain: Resource
domain: Entity
domain: http://lodlaundromat.org/.well-known/genid/49b69061d73c2102e0328121a637ab78#128
domain: http://lodlaundromat.org/.well-known/genid/49b69061d73c2102e0328121a637ab78#44
domain: http://lodlaundromat.org/.well-known/genid/49b69061d73c2102e0328121a637ab78#110
domain: http://lodlaundromat.org/.well-known/genid/49b69061d73c2102e0328121a637ab78#132
domain: http://lodlaundromat.org/.well-known/genid/49b69061d73c2102e0328121a637ab78#99
domain: http://lodlaundromat.org/.well-known/genid/49b69061d73c2102e0328121a637ab78#107
domain: http://lodlaundromat.org/.well-known/genid/49b69061d73c2102e0328121a637ab78#122
domain: http://lodlaundromat.org/.well-known/genid/49b69061d73c2102e0328121a637ab78#104
domain: http://lodlaundromat.org/.well-known/genid/49b69061d73c2102e0328121a637ab78#86
domain: http://lodlaundromat.org/.well-known/genid/49b69061d73c2102e0328121a637ab78#136
domain: http://lodlaundromat.org/.well-known/genid/49b69061d73c2102e0328121a637ab78#96
domain: Person
domain: http://lodlaundromat.org/.well-known/genid/49b69061d73c2102e0328121a637ab78#2
domain: http://lodlaundromat.org/.well-known/genid/49b69061d73c2102e0328121a637ab78#67
domain: http://lodlaundromat.org/.well-known/genid/49b69061d73c2102e0328121a637ab78#91
domain: http://lodlaundromat.org/.well-known/genid/49b69061d73c2102e0328121a637ab78#54
domain: http://lodlaundromat.org/.well-known/genid/49b69061d73c2102e0328121a637ab78#76
domain: http://lodlaundromat.org/.well-known/genid/49b69061d73c2102e0328121a637ab78#81
domain: http://lodlaundromat.org/.well-known/genid/49b69061d73c2102e0328121a637ab78#72
range: http://lodlaundromat.org/.well-known/genid/49b69061d73c2102e0328121a637ab78#12
range: Resource
range: http://lodlaundromat.org/.well-known/genid/49b69061d73c2102e0328121a637ab78#17
range: http://lodlaundromat.org/.well-known/genid/49b69061d73c2102e0328121a637ab78#26
range: Abstract-Item

Is A
range: Thing
domain: Thing
type: ObjectProperty
comment: This property represents a pledge that the entity is the named thing
domain: Pledge
range: Entity
type: Property
domain: Resource
domain: Abstract-Item
domain: Bond
range: Resource

Family Bond
subclass of: Thing
subclass of: Resource
type: Class
comment: This class represents a family bond that exists between beings or groups of beings
subclass of: Bond
subclass of: Abstract-Item

Reads
range: Thing
domain: Thing
type: ObjectProperty
comment: This property specifies a language or alphabet read by the being
domain: Being
range: Alphabet
type: Property
domain: Resource
domain: Entity
domain: http://lodlaundromat.org/.well-known/genid/49b69061d73c2102e0328121a637ab78#128
domain: http://lodlaundromat.org/.well-known/genid/49b69061d73c2102e0328121a637ab78#44
domain: http://lodlaundromat.org/.well-known/genid/49b69061d73c2102e0328121a637ab78#110
domain: http://lodlaundromat.org/.well-known/genid/49b69061d73c2102e0328121a637ab78#132
domain: http://lodlaundromat.org/.well-known/genid/49b69061d73c2102e0328121a637ab78#99
domain: http://lodlaundromat.org/.well-known/genid/49b69061d73c2102e0328121a637ab78#107
domain: http://lodlaundromat.org/.well-known/genid/49b69061d73c2102e0328121a637ab78#122
domain: http://lodlaundromat.org/.well-known/genid/49b69061d73c2102e0328121a637ab78#104
domain: http://lodlaundromat.org/.well-known/genid/49b69061d73c2102e0328121a637ab78#86
domain: http://lodlaundromat.org/.well-known/genid/49b69061d73c2102e0328121a637ab78#136
domain: http://lodlaundromat.org/.well-known/genid/49b69061d73c2102e0328121a637ab78#96
domain: Person
domain: http://lodlaundromat.org/.well-known/genid/49b69061d73c2102e0328121a637ab78#2
domain: http://lodlaundromat.org/.well-known/genid/49b69061d73c2102e0328121a637ab78#67
domain: http://lodlaundromat.org/.well-known/genid/49b69061d73c2102e0328121a637ab78#91
domain: http://lodlaundromat.org/.well-known/genid/49b69061d73c2102e0328121a637ab78#54
domain: http://lodlaundromat.org/.well-known/genid/49b69061d73c2102e0328121a637ab78#76
domain: http://lodlaundromat.org/.well-known/genid/49b69061d73c2102e0328121a637ab78#81
domain: http://lodlaundromat.org/.well-known/genid/49b69061d73c2102e0328121a637ab78#72
range: Resource

Voices
sub property of: is-linked-to
range: Thing
domain: Thing
range: http://lodlaundromat.org/.well-known/genid/49b69061d73c2102e0328121a637ab78#122
domain: http://lodlaundromat.org/.well-known/genid/49b69061d73c2102e0328121a637ab78#128
type: ObjectProperty
comment: This property specifies what entity or event is being portrayed
domain: http://lodlaundromat.org/.well-known/genid/49b69061d73c2102e0328121a637ab78#132
range: http://lodlaundromat.org/.well-known/genid/49b69061d73c2102e0328121a637ab78#136
sub property of: Portrays
inverse of: Voiced By
type: Property
domain: http://lodlaundromat.org/.well-known/genid/49b69061d73c2102e0328121a637ab78#110
domain: Resource
range: http://lodlaundromat.org/.well-known/genid/49b69061d73c2102e0328121a637ab78#116
range: Resource

Emotional Crisis
subclass of: http://lodlaundromat.org/.well-known/genid/49b69061d73c2102e0328121a637ab78#17
subclass of: http://lodlaundromat.org/.well-known/genid/49b69061d73c2102e0328121a637ab78#12
subclass of: Resource
subclass of: Thing
type: Class
subclass of: http://lodlaundromat.org/.well-known/genid/49b69061d73c2102e0328121a637ab78#26
comment: This class represents a emotional crisis
subclass of: Abstract-Item

Adopted Family Bond
subclass of: Resource
subclass of: Thing
type: Class
comment: This class represents an adopted bond that exists between beings or groups of beings
subclass of: Family Bond
subclass of: Bond
subclass of: Abstract-Item

Deal Broker
range: Thing
domain: Thing
type: ObjectProperty
comment: This property specifies the broker of the deal
domain: Deal
range: http://lodlaundromat.org/.well-known/genid/49b69061d73c2102e0328121a637ab78#104
type: Property
domain: Bond
domain: Resource
domain: Abstract-Item
range: Resource

Enmity
subclass of: Resource
subclass of: Thing
type: Class
comment: This class represents an emnity that exists between beings or groups of beings
subclass of: Bond
subclass of: Abstract-Item

Foster Family Bond
subclass of: Resource
subclass of: Thing
type: Class
comment: This class represents a foster bond that exists between beings or groups of beings
subclass of: Family Bond
subclass of: Abstract-Item
subclass of: Bond

Rehabilitated
range: Thing
domain: Thing
type: ObjectProperty
comment: This property specifies a rehabilitation event
domain: http://lodlaundromat.org/.well-known/genid/49b69061d73c2102e0328121a637ab78#8
range: Event
type: Property
domain: Resource
range: http://lodlaundromat.org/.well-known/genid/49b69061d73c2102e0328121a637ab78#116
range: Resource
range: http://lodlaundromat.org/.well-known/genid/49b69061d73c2102e0328121a637ab78#122
range: http://lodlaundromat.org/.well-known/genid/49b69061d73c2102e0328121a637ab78#136
range: http://lodlaundromat.org/.well-known/genid/49b69061d73c2102e0328121a637ab78#110

Deal Conditions
range: Thing
domain: Thing
type: ObjectProperty
comment: This property specifies the conditions of the deal
domain: Deal
range: Pledge
type: Property
domain: Bond
domain: Resource
domain: Abstract-Item
range: Resource
range: Bond
range: Abstract-Item

Place of Citizenship
range: Thing
domain: Thing
type: ObjectProperty
comment: This property specifies the place that the being is a citizan of
domain: Being
range: Space
type: Property
domain: Resource
domain: Entity
domain: http://lodlaundromat.org/.well-known/genid/49b69061d73c2102e0328121a637ab78#128
domain: http://lodlaundromat.org/.well-known/genid/49b69061d73c2102e0328121a637ab78#44
domain: http://lodlaundromat.org/.well-known/genid/49b69061d73c2102e0328121a637ab78#110
domain: http://lodlaundromat.org/.well-known/genid/49b69061d73c2102e0328121a637ab78#132
domain: http://lodlaundromat.org/.well-known/genid/49b69061d73c2102e0328121a637ab78#99
domain: http://lodlaundromat.org/.well-known/genid/49b69061d73c2102e0328121a637ab78#107
domain: http://lodlaundromat.org/.well-known/genid/49b69061d73c2102e0328121a637ab78#122
domain: http://lodlaundromat.org/.well-known/genid/49b69061d73c2102e0328121a637ab78#104
domain: http://lodlaundromat.org/.well-known/genid/49b69061d73c2102e0328121a637ab78#86
domain: http://lodlaundromat.org/.well-known/genid/49b69061d73c2102e0328121a637ab78#136
domain: http://lodlaundromat.org/.well-known/genid/49b69061d73c2102e0328121a637ab78#96
domain: Person
domain: http://lodlaundromat.org/.well-known/genid/49b69061d73c2102e0328121a637ab78#2
domain: http://lodlaundromat.org/.well-known/genid/49b69061d73c2102e0328121a637ab78#67
domain: http://lodlaundromat.org/.well-known/genid/49b69061d73c2102e0328121a637ab78#91
domain: http://lodlaundromat.org/.well-known/genid/49b69061d73c2102e0328121a637ab78#54
domain: http://lodlaundromat.org/.well-known/genid/49b69061d73c2102e0328121a637ab78#76
domain: http://lodlaundromat.org/.well-known/genid/49b69061d73c2102e0328121a637ab78#81
domain: http://lodlaundromat.org/.well-known/genid/49b69061d73c2102e0328121a637ab78#72
range: http://lodlaundromat.org/.well-known/genid/49b69061d73c2102e0328121a637ab78#44
range: http://lodlaundromat.org/.well-known/genid/49b69061d73c2102e0328121a637ab78#116
range: http://lodlaundromat.org/.well-known/genid/49b69061d73c2102e0328121a637ab78#122
range: Resource
range: http://lodlaundromat.org/.well-known/genid/49b69061d73c2102e0328121a637ab78#51
range: http://lodlaundromat.org/.well-known/genid/49b69061d73c2102e0328121a637ab78#48
range: http://lodlaundromat.org/.well-known/genid/49b69061d73c2102e0328121a637ab78#110
range: http://lodlaundromat.org/.well-known/genid/49b69061d73c2102e0328121a637ab78#136
range: http://lodlaundromat.org/.well-known/genid/49b69061d73c2102e0328121a637ab78#99

Will Do
range: Thing
domain: Thing
type: ObjectProperty
comment: This property represents a pledge that the entity will do the named thing
domain: Pledge
range: Event
type: Property
domain: Resource
domain: Abstract-Item
domain: Bond
range: http://lodlaundromat.org/.well-known/genid/49b69061d73c2102e0328121a637ab78#116
range: Resource
range: http://lodlaundromat.org/.well-known/genid/49b69061d73c2102e0328121a637ab78#122
range: http://lodlaundromat.org/.well-known/genid/49b69061d73c2102e0328121a637ab78#136
range: http://lodlaundromat.org/.well-known/genid/49b69061d73c2102e0328121a637ab78#110

Step Family Bond
subclass of: Resource
subclass of: Thing
type: Class
comment: This class represents a step bond that exists between beings or groups of beings
subclass of: Family Bond
subclass of: Bond
subclass of: Abstract-Item

Speaks Pidgin
range: Thing
domain: Thing
type: ObjectProperty
comment: This property specifies a language almost spoken by the being
domain: Being
range: Language
sub property of: Speaks
type: Property
domain: Resource
domain: http://lodlaundromat.org/.well-known/genid/49b69061d73c2102e0328121a637ab78#72
domain: http://lodlaundromat.org/.well-known/genid/49b69061d73c2102e0328121a637ab78#99
domain: http://lodlaundromat.org/.well-known/genid/49b69061d73c2102e0328121a637ab78#104
domain: http://lodlaundromat.org/.well-known/genid/49b69061d73c2102e0328121a637ab78#44
domain: http://lodlaundromat.org/.well-known/genid/49b69061d73c2102e0328121a637ab78#96
domain: http://lodlaundromat.org/.well-known/genid/49b69061d73c2102e0328121a637ab78#136
domain: Person
domain: http://lodlaundromat.org/.well-known/genid/49b69061d73c2102e0328121a637ab78#76
domain: http://lodlaundromat.org/.well-known/genid/49b69061d73c2102e0328121a637ab78#81
domain: http://lodlaundromat.org/.well-known/genid/49b69061d73c2102e0328121a637ab78#54
domain: http://lodlaundromat.org/.well-known/genid/49b69061d73c2102e0328121a637ab78#91
domain: http://lodlaundromat.org/.well-known/genid/49b69061d73c2102e0328121a637ab78#122
domain: http://lodlaundromat.org/.well-known/genid/49b69061d73c2102e0328121a637ab78#132
domain: http://lodlaundromat.org/.well-known/genid/49b69061d73c2102e0328121a637ab78#67
domain: http://lodlaundromat.org/.well-known/genid/49b69061d73c2102e0328121a637ab78#86
domain: http://lodlaundromat.org/.well-known/genid/49b69061d73c2102e0328121a637ab78#128
domain: http://lodlaundromat.org/.well-known/genid/49b69061d73c2102e0328121a637ab78#2
domain: http://lodlaundromat.org/.well-known/genid/49b69061d73c2102e0328121a637ab78#110
domain: http://lodlaundromat.org/.well-known/genid/49b69061d73c2102e0328121a637ab78#107
domain: Entity
range: Resource

Physical Illness
range: Thing
domain: Thing
type: ObjectProperty
comment: This property specifies the emotional well-being of a being
domain: Being
range: Physical Illness
type: Property
domain: Resource
domain: Entity
domain: http://lodlaundromat.org/.well-known/genid/49b69061d73c2102e0328121a637ab78#128
domain: http://lodlaundromat.org/.well-known/genid/49b69061d73c2102e0328121a637ab78#44
domain: http://lodlaundromat.org/.well-known/genid/49b69061d73c2102e0328121a637ab78#110
domain: http://lodlaundromat.org/.well-known/genid/49b69061d73c2102e0328121a637ab78#132
domain: http://lodlaundromat.org/.well-known/genid/49b69061d73c2102e0328121a637ab78#99
domain: http://lodlaundromat.org/.well-known/genid/49b69061d73c2102e0328121a637ab78#107
domain: http://lodlaundromat.org/.well-known/genid/49b69061d73c2102e0328121a637ab78#122
domain: http://lodlaundromat.org/.well-known/genid/49b69061d73c2102e0328121a637ab78#104
domain: http://lodlaundromat.org/.well-known/genid/49b69061d73c2102e0328121a637ab78#86
domain: http://lodlaundromat.org/.well-known/genid/49b69061d73c2102e0328121a637ab78#136
domain: http://lodlaundromat.org/.well-known/genid/49b69061d73c2102e0328121a637ab78#96
domain: Person
domain: http://lodlaundromat.org/.well-known/genid/49b69061d73c2102e0328121a637ab78#2
domain: http://lodlaundromat.org/.well-known/genid/49b69061d73c2102e0328121a637ab78#67
domain: http://lodlaundromat.org/.well-known/genid/49b69061d73c2102e0328121a637ab78#91
domain: http://lodlaundromat.org/.well-known/genid/49b69061d73c2102e0328121a637ab78#54
domain: http://lodlaundromat.org/.well-known/genid/49b69061d73c2102e0328121a637ab78#76
domain: http://lodlaundromat.org/.well-known/genid/49b69061d73c2102e0328121a637ab78#81
domain: http://lodlaundromat.org/.well-known/genid/49b69061d73c2102e0328121a637ab78#72
range: http://lodlaundromat.org/.well-known/genid/49b69061d73c2102e0328121a637ab78#12
range: Resource
range: http://lodlaundromat.org/.well-known/genid/49b69061d73c2102e0328121a637ab78#26
range: http://lodlaundromat.org/.well-known/genid/49b69061d73c2102e0328121a637ab78#17
range: http://lodlaundromat.org/.well-known/genid/49b69061d73c2102e0328121a637ab78#22
range: http://lodlaundromat.org/.well-known/genid/49b69061d73c2102e0328121a637ab78#8
range: http://lodlaundromat.org/.well-known/genid/49b69061d73c2102e0328121a637ab78#31
range: Abstract-Item

Bond
subclass of: Resource
subclass of: Thing
type: Class
comment: This class represents a bond that exists between beings or groups of beings
subclass of: Abstract-Item

Company
subclass of: Organization
subclass of: Resource
subclass of: Thing
type: Class
comment: This class represents a company
subclass of: Organisation
subclass of: http://lodlaundromat.org/.well-known/genid/49b69061d73c2102e0328121a637ab78#1
subclass of: Group
subclass of: http://lodlaundromat.org/.well-known/genid/49b69061d73c2102e0328121a637ab78#96
subclass of: http://lodlaundromat.org/.well-known/genid/49b69061d73c2102e0328121a637ab78#91
subclass of: http://lodlaundromat.org/.well-known/genid/49b69061d73c2102e0328121a637ab78#54
subclass of: http://lodlaundromat.org/.well-known/genid/49b69061d73c2102e0328121a637ab78#122
subclass of: http://lodlaundromat.org/.well-known/genid/49b69061d73c2102e0328121a637ab78#110
subclass of: http://lodlaundromat.org/.well-known/genid/49b69061d73c2102e0328121a637ab78#34
subclass of: http://lodlaundromat.org/.well-known/genid/49b69061d73c2102e0328121a637ab78#132
subclass of: http://lodlaundromat.org/.well-known/genid/49b69061d73c2102e0328121a637ab78#2
subclass of: http://lodlaundromat.org/.well-known/genid/49b69061d73c2102e0328121a637ab78#40
subclass of: http://lodlaundromat.org/.well-known/genid/49b69061d73c2102e0328121a637ab78#72
subclass of: http://lodlaundromat.org/.well-known/genid/49b69061d73c2102e0328121a637ab78#48
subclass of: http://lodlaundromat.org/.well-known/genid/49b69061d73c2102e0328121a637ab78#76
subclass of: http://lodlaundromat.org/.well-known/genid/49b69061d73c2102e0328121a637ab78#51
subclass of: http://lodlaundromat.org/.well-known/genid/49b69061d73c2102e0328121a637ab78#116
subclass of: Collection
subclass of: http://lodlaundromat.org/.well-known/genid/49b69061d73c2102e0328121a637ab78#37
subclass of: http://lodlaundromat.org/.well-known/genid/49b69061d73c2102e0328121a637ab78#86
subclass of: http://lodlaundromat.org/.well-known/genid/49b69061d73c2102e0328121a637ab78#136
subclass of: http://lodlaundromat.org/.well-known/genid/49b69061d73c2102e0328121a637ab78#107
subclass of: http://lodlaundromat.org/.well-known/genid/49b69061d73c2102e0328121a637ab78#67
subclass of: http://lodlaundromat.org/.well-known/genid/49b69061d73c2102e0328121a637ab78#99
subclass of: http://lodlaundromat.org/.well-known/genid/49b69061d73c2102e0328121a637ab78#104
subclass of: http://lodlaundromat.org/.well-known/genid/49b69061d73c2102e0328121a637ab78#81
subclass of: http://lodlaundromat.org/.well-known/genid/49b69061d73c2102e0328121a637ab78#128

Owns
range: Thing
domain: Thing
type: ObjectProperty
comment: This property specifies ownership by an entity
domain: Possession
range: Entity
type: Property
domain: Resource
domain: Abstract-Item
domain: Bond
range: Resource

Possession
subclass of: Resource
subclass of: Thing
type: Class
comment: This class represents a the bond between two entities where one claims ownership of the other
subclass of: Bond
subclass of: Abstract-Item

Carries Uniform
range: Thing
domain: Thing
type: ObjectProperty
comment: This property specifies a uniform which is worn by any members of the group
domain: http://lodlaundromat.org/.well-known/genid/49b69061d73c2102e0328121a637ab78#37
range: Physical-Item
type: Property
domain: Resource
range: http://lodlaundromat.org/.well-known/genid/49b69061d73c2102e0328121a637ab78#116
range: Resource
range: http://lodlaundromat.org/.well-known/genid/49b69061d73c2102e0328121a637ab78#6
range: http://lodlaundromat.org/.well-known/genid/49b69061d73c2102e0328121a637ab78#132
range: http://lodlaundromat.org/.well-known/genid/49b69061d73c2102e0328121a637ab78#136
range: http://lodlaundromat.org/.well-known/genid/49b69061d73c2102e0328121a637ab78#122
range: http://lodlaundromat.org/.well-known/genid/49b69061d73c2102e0328121a637ab78#59
range: http://lodlaundromat.org/.well-known/genid/49b69061d73c2102e0328121a637ab78#110
range: http://lodlaundromat.org/.well-known/genid/49b69061d73c2102e0328121a637ab78#63
range: http://lodlaundromat.org/.well-known/genid/49b69061d73c2102e0328121a637ab78#128

Has Loco Parentis
range: Thing
domain: Thing
range: Family Bond
domain: Being
type: ObjectProperty
comment: This property specifies that the specified being acting in loco parentis of the being
domain: Family Bond
range: Being
sub property of: Is Relation Of
inverse of: In Loco Parentis
type: Property
domain: Resource
domain: http://lodlaundromat.org/.well-known/genid/49b69061d73c2102e0328121a637ab78#72
domain: http://lodlaundromat.org/.well-known/genid/49b69061d73c2102e0328121a637ab78#99
domain: http://lodlaundromat.org/.well-known/genid/49b69061d73c2102e0328121a637ab78#104
domain: http://lodlaundromat.org/.well-known/genid/49b69061d73c2102e0328121a637ab78#44
domain: http://lodlaundromat.org/.well-known/genid/49b69061d73c2102e0328121a637ab78#96
domain: http://lodlaundromat.org/.well-known/genid/49b69061d73c2102e0328121a637ab78#136
domain: Person
domain: http://lodlaundromat.org/.well-known/genid/49b69061d73c2102e0328121a637ab78#76
domain: http://lodlaundromat.org/.well-known/genid/49b69061d73c2102e0328121a637ab78#81
domain: http://lodlaundromat.org/.well-known/genid/49b69061d73c2102e0328121a637ab78#54
domain: http://lodlaundromat.org/.well-known/genid/49b69061d73c2102e0328121a637ab78#91
domain: http://lodlaundromat.org/.well-known/genid/49b69061d73c2102e0328121a637ab78#122
domain: http://lodlaundromat.org/.well-known/genid/49b69061d73c2102e0328121a637ab78#132
domain: http://lodlaundromat.org/.well-known/genid/49b69061d73c2102e0328121a637ab78#67
domain: http://lodlaundromat.org/.well-known/genid/49b69061d73c2102e0328121a637ab78#86
domain: http://lodlaundromat.org/.well-known/genid/49b69061d73c2102e0328121a637ab78#128
domain: http://lodlaundromat.org/.well-known/genid/49b69061d73c2102e0328121a637ab78#2
domain: http://lodlaundromat.org/.well-known/genid/49b69061d73c2102e0328121a637ab78#110
domain: http://lodlaundromat.org/.well-known/genid/49b69061d73c2102e0328121a637ab78#107
domain: Entity
domain: Bond
domain: Abstract-Item
range: Resource
range: Bond
range: Abstract-Item
range: http://lodlaundromat.org/.well-known/genid/49b69061d73c2102e0328121a637ab78#72
range: http://lodlaundromat.org/.well-known/genid/49b69061d73c2102e0328121a637ab78#99
range: http://lodlaundromat.org/.well-known/genid/49b69061d73c2102e0328121a637ab78#104
range: http://lodlaundromat.org/.well-known/genid/49b69061d73c2102e0328121a637ab78#44
range: http://lodlaundromat.org/.well-known/genid/49b69061d73c2102e0328121a637ab78#96
range: http://lodlaundromat.org/.well-known/genid/49b69061d73c2102e0328121a637ab78#136
range: Person
range: http://lodlaundromat.org/.well-known/genid/49b69061d73c2102e0328121a637ab78#76
range: http://lodlaundromat.org/.well-known/genid/49b69061d73c2102e0328121a637ab78#81
range: http://lodlaundromat.org/.well-known/genid/49b69061d73c2102e0328121a637ab78#54
range: http://lodlaundromat.org/.well-known/genid/49b69061d73c2102e0328121a637ab78#91
range: http://lodlaundromat.org/.well-known/genid/49b69061d73c2102e0328121a637ab78#122
range: http://lodlaundromat.org/.well-known/genid/49b69061d73c2102e0328121a637ab78#132
range: http://lodlaundromat.org/.well-known/genid/49b69061d73c2102e0328121a637ab78#67
range: http://lodlaundromat.org/.well-known/genid/49b69061d73c2102e0328121a637ab78#86
range: http://lodlaundromat.org/.well-known/genid/49b69061d73c2102e0328121a637ab78#128
range: http://lodlaundromat.org/.well-known/genid/49b69061d73c2102e0328121a637ab78#2
range: http://lodlaundromat.org/.well-known/genid/49b69061d73c2102e0328121a637ab78#110
range: http://lodlaundromat.org/.well-known/genid/49b69061d73c2102e0328121a637ab78#107
range: Entity

Voiced By
sub property of: is-linked-to
range: http://lodlaundromat.org/.well-known/genid/49b69061d73c2102e0328121a637ab78#132
domain: http://lodlaundromat.org/.well-known/genid/49b69061d73c2102e0328121a637ab78#136
range: Thing
domain: Thing
type: ObjectProperty
comment: This property specifies what the entity or event is being portrayed by
domain: http://lodlaundromat.org/.well-known/genid/49b69061d73c2102e0328121a637ab78#122
range: http://lodlaundromat.org/.well-known/genid/49b69061d73c2102e0328121a637ab78#128
sub property of: Portrays
inverse of: Voices
type: Property
domain: http://lodlaundromat.org/.well-known/genid/49b69061d73c2102e0328121a637ab78#110
domain: Resource
range: http://lodlaundromat.org/.well-known/genid/49b69061d73c2102e0328121a637ab78#116
range: Resource

Of Type
range: Thing
domain: Thing
type: ObjectProperty
comment: This property specifies a class of items of which the group or collection is made
domain: http://lodlaundromat.org/.well-known/genid/49b69061d73c2102e0328121a637ab78#40
range: http://lodlaundromat.org/.well-known/genid/49b69061d73c2102e0328121a637ab78#43
type: Property
domain: Resource
range: Resource

Have Not Bonded To
range: Thing
domain: Thing
type: ObjectProperty
comment: This property represents a pledge that the entity does not have a bond with the named entity
domain: Pledge
range: http://lodlaundromat.org/.well-known/genid/49b69061d73c2102e0328121a637ab78#81
type: Property
domain: Resource
domain: Abstract-Item
domain: Bond
range: Resource

In Loco Parentis
range: Family Bond
domain: Being
range: Thing
domain: Thing
type: ObjectProperty
comment: This property specifies that the being is acting in loco parentis of the specified being
domain: Family Bond
range: Being
sub property of: Is Relation Of
inverse of: Has Loco Parentis
type: Property
domain: Resource
domain: http://lodlaundromat.org/.well-known/genid/49b69061d73c2102e0328121a637ab78#72
domain: http://lodlaundromat.org/.well-known/genid/49b69061d73c2102e0328121a637ab78#99
domain: http://lodlaundromat.org/.well-known/genid/49b69061d73c2102e0328121a637ab78#104
domain: http://lodlaundromat.org/.well-known/genid/49b69061d73c2102e0328121a637ab78#44
domain: http://lodlaundromat.org/.well-known/genid/49b69061d73c2102e0328121a637ab78#96
domain: http://lodlaundromat.org/.well-known/genid/49b69061d73c2102e0328121a637ab78#136
domain: Person
domain: http://lodlaundromat.org/.well-known/genid/49b69061d73c2102e0328121a637ab78#76
domain: http://lodlaundromat.org/.well-known/genid/49b69061d73c2102e0328121a637ab78#81
domain: http://lodlaundromat.org/.well-known/genid/49b69061d73c2102e0328121a637ab78#54
domain: http://lodlaundromat.org/.well-known/genid/49b69061d73c2102e0328121a637ab78#91
domain: http://lodlaundromat.org/.well-known/genid/49b69061d73c2102e0328121a637ab78#122
domain: http://lodlaundromat.org/.well-known/genid/49b69061d73c2102e0328121a637ab78#132
domain: http://lodlaundromat.org/.well-known/genid/49b69061d73c2102e0328121a637ab78#67
domain: http://lodlaundromat.org/.well-known/genid/49b69061d73c2102e0328121a637ab78#86
domain: http://lodlaundromat.org/.well-known/genid/49b69061d73c2102e0328121a637ab78#128
domain: http://lodlaundromat.org/.well-known/genid/49b69061d73c2102e0328121a637ab78#2
domain: http://lodlaundromat.org/.well-known/genid/49b69061d73c2102e0328121a637ab78#110
domain: http://lodlaundromat.org/.well-known/genid/49b69061d73c2102e0328121a637ab78#107
domain: Entity
domain: Bond
domain: Abstract-Item
range: Resource
range: Bond
range: Abstract-Item
range: http://lodlaundromat.org/.well-known/genid/49b69061d73c2102e0328121a637ab78#72
range: http://lodlaundromat.org/.well-known/genid/49b69061d73c2102e0328121a637ab78#99
range: http://lodlaundromat.org/.well-known/genid/49b69061d73c2102e0328121a637ab78#104
range: http://lodlaundromat.org/.well-known/genid/49b69061d73c2102e0328121a637ab78#44
range: http://lodlaundromat.org/.well-known/genid/49b69061d73c2102e0328121a637ab78#96
range: http://lodlaundromat.org/.well-known/genid/49b69061d73c2102e0328121a637ab78#136
range: Person
range: http://lodlaundromat.org/.well-known/genid/49b69061d73c2102e0328121a637ab78#76
range: http://lodlaundromat.org/.well-known/genid/49b69061d73c2102e0328121a637ab78#81
range: http://lodlaundromat.org/.well-known/genid/49b69061d73c2102e0328121a637ab78#54
range: http://lodlaundromat.org/.well-known/genid/49b69061d73c2102e0328121a637ab78#91
range: http://lodlaundromat.org/.well-known/genid/49b69061d73c2102e0328121a637ab78#122
range: http://lodlaundromat.org/.well-known/genid/49b69061d73c2102e0328121a637ab78#132
range: http://lodlaundromat.org/.well-known/genid/49b69061d73c2102e0328121a637ab78#67
range: http://lodlaundromat.org/.well-known/genid/49b69061d73c2102e0328121a637ab78#86
range: http://lodlaundromat.org/.well-known/genid/49b69061d73c2102e0328121a637ab78#128
range: http://lodlaundromat.org/.well-known/genid/49b69061d73c2102e0328121a637ab78#2
range: http://lodlaundromat.org/.well-known/genid/49b69061d73c2102e0328121a637ab78#110
range: http://lodlaundromat.org/.well-known/genid/49b69061d73c2102e0328121a637ab78#107
range: Entity

Pledge Maker
range: Thing
domain: Thing
type: ObjectProperty
comment: This property the entity making the pledge
domain: Pledge
range: http://lodlaundromat.org/.well-known/genid/49b69061d73c2102e0328121a637ab78#96
type: Property
domain: Resource
domain: Abstract-Item
domain: Bond
range: Resource

Mental Illness
subclass of: http://lodlaundromat.org/.well-known/genid/49b69061d73c2102e0328121a637ab78#31
subclass of: Thing
subclass of: http://lodlaundromat.org/.well-known/genid/49b69061d73c2102e0328121a637ab78#17
subclass of: http://lodlaundromat.org/.well-known/genid/49b69061d73c2102e0328121a637ab78#26
subclass of: Resource
subclass of: http://lodlaundromat.org/.well-known/genid/49b69061d73c2102e0328121a637ab78#12
subclass of: http://lodlaundromat.org/.well-known/genid/49b69061d73c2102e0328121a637ab78#8
type: Class
subclass of: http://lodlaundromat.org/.well-known/genid/49b69061d73c2102e0328121a637ab78#22
comment: This class represents a mental illness
subclass of: Abstract-Item

Sibling Of
range: Thing
domain: Thing
range: Family Bond
domain: Being
type: ObjectProperty
comment: This property specifies that the being is a sibling of the specified being
domain: Family Bond
range: Being
sub property of: Is Relation Of
type: Property
domain: Resource
domain: http://lodlaundromat.org/.well-known/genid/49b69061d73c2102e0328121a637ab78#72
domain: http://lodlaundromat.org/.well-known/genid/49b69061d73c2102e0328121a637ab78#99
domain: http://lodlaundromat.org/.well-known/genid/49b69061d73c2102e0328121a637ab78#104
domain: http://lodlaundromat.org/.well-known/genid/49b69061d73c2102e0328121a637ab78#44
domain: http://lodlaundromat.org/.well-known/genid/49b69061d73c2102e0328121a637ab78#96
domain: http://lodlaundromat.org/.well-known/genid/49b69061d73c2102e0328121a637ab78#136
domain: Person
domain: http://lodlaundromat.org/.well-known/genid/49b69061d73c2102e0328121a637ab78#76
domain: http://lodlaundromat.org/.well-known/genid/49b69061d73c2102e0328121a637ab78#81
domain: http://lodlaundromat.org/.well-known/genid/49b69061d73c2102e0328121a637ab78#54
domain: http://lodlaundromat.org/.well-known/genid/49b69061d73c2102e0328121a637ab78#91
domain: http://lodlaundromat.org/.well-known/genid/49b69061d73c2102e0328121a637ab78#122
domain: http://lodlaundromat.org/.well-known/genid/49b69061d73c2102e0328121a637ab78#132
domain: http://lodlaundromat.org/.well-known/genid/49b69061d73c2102e0328121a637ab78#67
domain: http://lodlaundromat.org/.well-known/genid/49b69061d73c2102e0328121a637ab78#86
domain: http://lodlaundromat.org/.well-known/genid/49b69061d73c2102e0328121a637ab78#128
domain: http://lodlaundromat.org/.well-known/genid/49b69061d73c2102e0328121a637ab78#2
domain: http://lodlaundromat.org/.well-known/genid/49b69061d73c2102e0328121a637ab78#110
domain: http://lodlaundromat.org/.well-known/genid/49b69061d73c2102e0328121a637ab78#107
domain: Entity
domain: Bond
domain: Abstract-Item
range: Resource
range: Bond
range: Abstract-Item
range: http://lodlaundromat.org/.well-known/genid/49b69061d73c2102e0328121a637ab78#72
range: http://lodlaundromat.org/.well-known/genid/49b69061d73c2102e0328121a637ab78#99
range: http://lodlaundromat.org/.well-known/genid/49b69061d73c2102e0328121a637ab78#104
range: http://lodlaundromat.org/.well-known/genid/49b69061d73c2102e0328121a637ab78#44
range: http://lodlaundromat.org/.well-known/genid/49b69061d73c2102e0328121a637ab78#96
range: http://lodlaundromat.org/.well-known/genid/49b69061d73c2102e0328121a637ab78#136
range: Person
range: http://lodlaundromat.org/.well-known/genid/49b69061d73c2102e0328121a637ab78#76
range: http://lodlaundromat.org/.well-known/genid/49b69061d73c2102e0328121a637ab78#81
range: http://lodlaundromat.org/.well-known/genid/49b69061d73c2102e0328121a637ab78#54
range: http://lodlaundromat.org/.well-known/genid/49b69061d73c2102e0328121a637ab78#91
range: http://lodlaundromat.org/.well-known/genid/49b69061d73c2102e0328121a637ab78#122
range: http://lodlaundromat.org/.well-known/genid/49b69061d73c2102e0328121a637ab78#132
range: http://lodlaundromat.org/.well-known/genid/49b69061d73c2102e0328121a637ab78#67
range: http://lodlaundromat.org/.well-known/genid/49b69061d73c2102e0328121a637ab78#86
range: http://lodlaundromat.org/.well-known/genid/49b69061d73c2102e0328121a637ab78#128
range: http://lodlaundromat.org/.well-known/genid/49b69061d73c2102e0328121a637ab78#2
range: http://lodlaundromat.org/.well-known/genid/49b69061d73c2102e0328121a637ab78#110
range: http://lodlaundromat.org/.well-known/genid/49b69061d73c2102e0328121a637ab78#107
range: Entity

Entered Remission
range: Thing
domain: Thing
type: ObjectProperty
comment: This property specifies an entering remission event
domain: http://lodlaundromat.org/.well-known/genid/49b69061d73c2102e0328121a637ab78#31
range: Event
type: Property
domain: Resource
range: http://lodlaundromat.org/.well-known/genid/49b69061d73c2102e0328121a637ab78#116
range: Resource
range: http://lodlaundromat.org/.well-known/genid/49b69061d73c2102e0328121a637ab78#122
range: http://lodlaundromat.org/.well-known/genid/49b69061d73c2102e0328121a637ab78#136
range: http://lodlaundromat.org/.well-known/genid/49b69061d73c2102e0328121a637ab78#110

Treated
range: Thing
domain: Thing
type: ObjectProperty
comment: This property specifies a treatment event
domain: http://lodlaundromat.org/.well-known/genid/49b69061d73c2102e0328121a637ab78#12
range: Event
type: Property
domain: Resource
range: http://lodlaundromat.org/.well-known/genid/49b69061d73c2102e0328121a637ab78#116
range: Resource
range: http://lodlaundromat.org/.well-known/genid/49b69061d73c2102e0328121a637ab78#122
range: http://lodlaundromat.org/.well-known/genid/49b69061d73c2102e0328121a637ab78#136
range: http://lodlaundromat.org/.well-known/genid/49b69061d73c2102e0328121a637ab78#110

Speaks
range: Thing
domain: Thing
type: ObjectProperty
comment: This property specifies a language spoken by the being
domain: Being
range: Language
type: Property
domain: Resource
domain: Entity
domain: http://lodlaundromat.org/.well-known/genid/49b69061d73c2102e0328121a637ab78#128
domain: http://lodlaundromat.org/.well-known/genid/49b69061d73c2102e0328121a637ab78#44
domain: http://lodlaundromat.org/.well-known/genid/49b69061d73c2102e0328121a637ab78#110
domain: http://lodlaundromat.org/.well-known/genid/49b69061d73c2102e0328121a637ab78#132
domain: http://lodlaundromat.org/.well-known/genid/49b69061d73c2102e0328121a637ab78#99
domain: http://lodlaundromat.org/.well-known/genid/49b69061d73c2102e0328121a637ab78#107
domain: http://lodlaundromat.org/.well-known/genid/49b69061d73c2102e0328121a637ab78#122
domain: http://lodlaundromat.org/.well-known/genid/49b69061d73c2102e0328121a637ab78#104
domain: http://lodlaundromat.org/.well-known/genid/49b69061d73c2102e0328121a637ab78#86
domain: http://lodlaundromat.org/.well-known/genid/49b69061d73c2102e0328121a637ab78#136
domain: http://lodlaundromat.org/.well-known/genid/49b69061d73c2102e0328121a637ab78#96
domain: Person
domain: http://lodlaundromat.org/.well-known/genid/49b69061d73c2102e0328121a637ab78#2
domain: http://lodlaundromat.org/.well-known/genid/49b69061d73c2102e0328121a637ab78#67
domain: http://lodlaundromat.org/.well-known/genid/49b69061d73c2102e0328121a637ab78#91
domain: http://lodlaundromat.org/.well-known/genid/49b69061d73c2102e0328121a637ab78#54
domain: http://lodlaundromat.org/.well-known/genid/49b69061d73c2102e0328121a637ab78#76
domain: http://lodlaundromat.org/.well-known/genid/49b69061d73c2102e0328121a637ab78#81
domain: http://lodlaundromat.org/.well-known/genid/49b69061d73c2102e0328121a637ab78#72
range: Resource

Uses
range: Thing
domain: Thing
type: ObjectProperty
comment: This property specifies an entity typically used by the refering entity
domain: http://lodlaundromat.org/.well-known/genid/49b69061d73c2102e0328121a637ab78#54
range: http://lodlaundromat.org/.well-known/genid/49b69061d73c2102e0328121a637ab78#59
type: Property
domain: Resource
range: Resource

Wears Type
range: Thing
domain: Thing
type: ObjectProperty
comment: This property specifies a class of items worn by the being
domain: Being
range: http://lodlaundromat.org/.well-known/genid/49b69061d73c2102e0328121a637ab78#5
type: Property
domain: Resource
domain: Entity
domain: http://lodlaundromat.org/.well-known/genid/49b69061d73c2102e0328121a637ab78#128
domain: http://lodlaundromat.org/.well-known/genid/49b69061d73c2102e0328121a637ab78#44
domain: http://lodlaundromat.org/.well-known/genid/49b69061d73c2102e0328121a637ab78#110
domain: http://lodlaundromat.org/.well-known/genid/49b69061d73c2102e0328121a637ab78#132
domain: http://lodlaundromat.org/.well-known/genid/49b69061d73c2102e0328121a637ab78#99
domain: http://lodlaundromat.org/.well-known/genid/49b69061d73c2102e0328121a637ab78#107
domain: http://lodlaundromat.org/.well-known/genid/49b69061d73c2102e0328121a637ab78#122
domain: http://lodlaundromat.org/.well-known/genid/49b69061d73c2102e0328121a637ab78#104
domain: http://lodlaundromat.org/.well-known/genid/49b69061d73c2102e0328121a637ab78#86
domain: http://lodlaundromat.org/.well-known/genid/49b69061d73c2102e0328121a637ab78#136
domain: http://lodlaundromat.org/.well-known/genid/49b69061d73c2102e0328121a637ab78#96
domain: Person
domain: http://lodlaundromat.org/.well-known/genid/49b69061d73c2102e0328121a637ab78#2
domain: http://lodlaundromat.org/.well-known/genid/49b69061d73c2102e0328121a637ab78#67
domain: http://lodlaundromat.org/.well-known/genid/49b69061d73c2102e0328121a637ab78#91
domain: http://lodlaundromat.org/.well-known/genid/49b69061d73c2102e0328121a637ab78#54
domain: http://lodlaundromat.org/.well-known/genid/49b69061d73c2102e0328121a637ab78#76
domain: http://lodlaundromat.org/.well-known/genid/49b69061d73c2102e0328121a637ab78#81
domain: http://lodlaundromat.org/.well-known/genid/49b69061d73c2102e0328121a637ab78#72
range: Resource

Is Parent Of
range: Family Bond
domain: Being
range: Thing
domain: Thing
type: ObjectProperty
comment: This property specifies that the being is the parent of the specified being
domain: Family Bond
range: Being
sub property of: Is Relation Of
inverse of: Is Child Of
type: Property
domain: Resource
domain: http://lodlaundromat.org/.well-known/genid/49b69061d73c2102e0328121a637ab78#72
domain: http://lodlaundromat.org/.well-known/genid/49b69061d73c2102e0328121a637ab78#99
domain: http://lodlaundromat.org/.well-known/genid/49b69061d73c2102e0328121a637ab78#104
domain: http://lodlaundromat.org/.well-known/genid/49b69061d73c2102e0328121a637ab78#44
domain: http://lodlaundromat.org/.well-known/genid/49b69061d73c2102e0328121a637ab78#96
domain: http://lodlaundromat.org/.well-known/genid/49b69061d73c2102e0328121a637ab78#136
domain: Person
domain: http://lodlaundromat.org/.well-known/genid/49b69061d73c2102e0328121a637ab78#76
domain: http://lodlaundromat.org/.well-known/genid/49b69061d73c2102e0328121a637ab78#81
domain: http://lodlaundromat.org/.well-known/genid/49b69061d73c2102e0328121a637ab78#54
domain: http://lodlaundromat.org/.well-known/genid/49b69061d73c2102e0328121a637ab78#91
domain: http://lodlaundromat.org/.well-known/genid/49b69061d73c2102e0328121a637ab78#122
domain: http://lodlaundromat.org/.well-known/genid/49b69061d73c2102e0328121a637ab78#132
domain: http://lodlaundromat.org/.well-known/genid/49b69061d73c2102e0328121a637ab78#67
domain: http://lodlaundromat.org/.well-known/genid/49b69061d73c2102e0328121a637ab78#86
domain: http://lodlaundromat.org/.well-known/genid/49b69061d73c2102e0328121a637ab78#128
domain: http://lodlaundromat.org/.well-known/genid/49b69061d73c2102e0328121a637ab78#2
domain: http://lodlaundromat.org/.well-known/genid/49b69061d73c2102e0328121a637ab78#110
domain: http://lodlaundromat.org/.well-known/genid/49b69061d73c2102e0328121a637ab78#107
domain: Entity
domain: Bond
domain: Abstract-Item
range: Resource
range: Bond
range: Abstract-Item
range: http://lodlaundromat.org/.well-known/genid/49b69061d73c2102e0328121a637ab78#72
range: http://lodlaundromat.org/.well-known/genid/49b69061d73c2102e0328121a637ab78#99
range: http://lodlaundromat.org/.well-known/genid/49b69061d73c2102e0328121a637ab78#104
range: http://lodlaundromat.org/.well-known/genid/49b69061d73c2102e0328121a637ab78#44
range: http://lodlaundromat.org/.well-known/genid/49b69061d73c2102e0328121a637ab78#96
range: http://lodlaundromat.org/.well-known/genid/49b69061d73c2102e0328121a637ab78#136
range: Person
range: http://lodlaundromat.org/.well-known/genid/49b69061d73c2102e0328121a637ab78#76
range: http://lodlaundromat.org/.well-known/genid/49b69061d73c2102e0328121a637ab78#81
range: http://lodlaundromat.org/.well-known/genid/49b69061d73c2102e0328121a637ab78#54
range: http://lodlaundromat.org/.well-known/genid/49b69061d73c2102e0328121a637ab78#91
range: http://lodlaundromat.org/.well-known/genid/49b69061d73c2102e0328121a637ab78#122
range: http://lodlaundromat.org/.well-known/genid/49b69061d73c2102e0328121a637ab78#132
range: http://lodlaundromat.org/.well-known/genid/49b69061d73c2102e0328121a637ab78#67
range: http://lodlaundromat.org/.well-known/genid/49b69061d73c2102e0328121a637ab78#86
range: http://lodlaundromat.org/.well-known/genid/49b69061d73c2102e0328121a637ab78#128
range: http://lodlaundromat.org/.well-known/genid/49b69061d73c2102e0328121a637ab78#2
range: http://lodlaundromat.org/.well-known/genid/49b69061d73c2102e0328121a637ab78#110
range: http://lodlaundromat.org/.well-known/genid/49b69061d73c2102e0328121a637ab78#107
range: Entity

Alliance
subclass of: Resource
subclass of: Thing
type: Class
comment: This class represents an alliance that exists between beings or groups of beings
subclass of: Bond
subclass of: Abstract-Item

Will Bond To
range: Thing
domain: Thing
type: ObjectProperty
comment: This property represents a pledge that the entity will bond with the named entity
domain: Pledge
range: http://lodlaundromat.org/.well-known/genid/49b69061d73c2102e0328121a637ab78#86
type: Property
domain: Resource
domain: Abstract-Item
domain: Bond
range: Resource

Group
subclass of: Thing
subclass of: http://lodlaundromat.org/.well-known/genid/49b69061d73c2102e0328121a637ab78#48
subclass of: http://lodlaundromat.org/.well-known/genid/49b69061d73c2102e0328121a637ab78#86
subclass of: http://lodlaundromat.org/.well-known/genid/49b69061d73c2102e0328121a637ab78#107
subclass of: http://lodlaundromat.org/.well-known/genid/49b69061d73c2102e0328121a637ab78#136
subclass of: http://lodlaundromat.org/.well-known/genid/49b69061d73c2102e0328121a637ab78#104
subclass of: http://lodlaundromat.org/.well-known/genid/49b69061d73c2102e0328121a637ab78#91
subclass of: http://lodlaundromat.org/.well-known/genid/49b69061d73c2102e0328121a637ab78#76
subclass of: http://lodlaundromat.org/.well-known/genid/49b69061d73c2102e0328121a637ab78#67
subclass of: http://lodlaundromat.org/.well-known/genid/49b69061d73c2102e0328121a637ab78#110
subclass of: http://lodlaundromat.org/.well-known/genid/49b69061d73c2102e0328121a637ab78#37
subclass of: http://lodlaundromat.org/.well-known/genid/49b69061d73c2102e0328121a637ab78#99
subclass of: http://lodlaundromat.org/.well-known/genid/49b69061d73c2102e0328121a637ab78#81
subclass of: http://lodlaundromat.org/.well-known/genid/49b69061d73c2102e0328121a637ab78#116
subclass of: http://lodlaundromat.org/.well-known/genid/49b69061d73c2102e0328121a637ab78#34
subclass of: http://lodlaundromat.org/.well-known/genid/49b69061d73c2102e0328121a637ab78#2
subclass of: http://lodlaundromat.org/.well-known/genid/49b69061d73c2102e0328121a637ab78#72
subclass of: http://lodlaundromat.org/.well-known/genid/49b69061d73c2102e0328121a637ab78#96
subclass of: Group
subclass of: http://lodlaundromat.org/.well-known/genid/49b69061d73c2102e0328121a637ab78#51
type: Class
subclass of: http://lodlaundromat.org/.well-known/genid/49b69061d73c2102e0328121a637ab78#132
subclass of: http://lodlaundromat.org/.well-known/genid/49b69061d73c2102e0328121a637ab78#122
subclass of: http://lodlaundromat.org/.well-known/genid/49b69061d73c2102e0328121a637ab78#54
subclass of: http://lodlaundromat.org/.well-known/genid/49b69061d73c2102e0328121a637ab78#40
subclass of: http://lodlaundromat.org/.well-known/genid/49b69061d73c2102e0328121a637ab78#128
subclass of: Resource
comment: This class represents a group of beings
subclass of: Collection
subclass of: http://lodlaundromat.org/.well-known/genid/49b69061d73c2102e0328121a637ab78#1
equivalent class: Group

Physical Injury
subclass of: http://lodlaundromat.org/.well-known/genid/49b69061d73c2102e0328121a637ab78#8
subclass of: Thing
subclass of: http://lodlaundromat.org/.well-known/genid/49b69061d73c2102e0328121a637ab78#17
subclass of: http://lodlaundromat.org/.well-known/genid/49b69061d73c2102e0328121a637ab78#22
type: Class
subclass of: Resource
subclass of: http://lodlaundromat.org/.well-known/genid/49b69061d73c2102e0328121a637ab78#26
subclass of: http://lodlaundromat.org/.well-known/genid/49b69061d73c2102e0328121a637ab78#12
comment: This class represents a physical injury
subclass of: Abstract-Item

Pledge
subclass of: Resource
subclass of: Thing
type: Class
comment: This class represents a promise that exists between beings or groups of beings
subclass of: Bond
subclass of: Abstract-Item

Being
subclass of: Resource
subclass of: http://lodlaundromat.org/.well-known/genid/49b69061d73c2102e0328121a637ab78#72
subclass of: http://lodlaundromat.org/.well-known/genid/49b69061d73c2102e0328121a637ab78#99
subclass of: Thing
subclass of: http://lodlaundromat.org/.well-known/genid/49b69061d73c2102e0328121a637ab78#104
subclass of: http://lodlaundromat.org/.well-known/genid/49b69061d73c2102e0328121a637ab78#44
subclass of: http://lodlaundromat.org/.well-known/genid/49b69061d73c2102e0328121a637ab78#96
subclass of: http://lodlaundromat.org/.well-known/genid/49b69061d73c2102e0328121a637ab78#136
subclass of: Person
subclass of: http://lodlaundromat.org/.well-known/genid/49b69061d73c2102e0328121a637ab78#76
subclass of: http://lodlaundromat.org/.well-known/genid/49b69061d73c2102e0328121a637ab78#81
type: Class
subclass of: http://lodlaundromat.org/.well-known/genid/49b69061d73c2102e0328121a637ab78#54
subclass of: http://lodlaundromat.org/.well-known/genid/49b69061d73c2102e0328121a637ab78#91
subclass of: http://lodlaundromat.org/.well-known/genid/49b69061d73c2102e0328121a637ab78#122
subclass of: http://lodlaundromat.org/.well-known/genid/49b69061d73c2102e0328121a637ab78#132
subclass of: http://lodlaundromat.org/.well-known/genid/49b69061d73c2102e0328121a637ab78#67
subclass of: http://lodlaundromat.org/.well-known/genid/49b69061d73c2102e0328121a637ab78#86
subclass of: http://lodlaundromat.org/.well-known/genid/49b69061d73c2102e0328121a637ab78#128
subclass of: http://lodlaundromat.org/.well-known/genid/49b69061d73c2102e0328121a637ab78#2
subclass of: http://lodlaundromat.org/.well-known/genid/49b69061d73c2102e0328121a637ab78#110
subclass of: http://lodlaundromat.org/.well-known/genid/49b69061d73c2102e0328121a637ab78#107
comment: This class represents an Entity with a personality
subclass of: Entity
equivalent class: Person

Cured
range: Thing
domain: Thing
type: ObjectProperty
comment: This property specifies a cure event
domain: http://lodlaundromat.org/.well-known/genid/49b69061d73c2102e0328121a637ab78#22
range: Event
type: Property
domain: Resource
range: http://lodlaundromat.org/.well-known/genid/49b69061d73c2102e0328121a637ab78#116
range: Resource
range: http://lodlaundromat.org/.well-known/genid/49b69061d73c2102e0328121a637ab78#122
range: http://lodlaundromat.org/.well-known/genid/49b69061d73c2102e0328121a637ab78#136
range: http://lodlaundromat.org/.well-known/genid/49b69061d73c2102e0328121a637ab78#110

Friendship
subclass of: Resource
subclass of: Thing
type: Class
comment: This class represents an friendship that exists between beings or groups of beings
subclass of: Alliance
subclass of: Bond
subclass of: Abstract-Item

Character
subclass of: http://lodlaundromat.org/.well-known/genid/49b69061d73c2102e0328121a637ab78#116
subclass of: Person
subclass of: Resource
subclass of: Thing
type: Class
comment: This class represents an fictionalised contruction of an entity with a personality
subclass of: Being
subclass of: http://lodlaundromat.org/.well-known/genid/49b69061d73c2102e0328121a637ab78#107
subclass of: http://lodlaundromat.org/.well-known/genid/49b69061d73c2102e0328121a637ab78#44
subclass of: http://lodlaundromat.org/.well-known/genid/49b69061d73c2102e0328121a637ab78#132
subclass of: http://lodlaundromat.org/.well-known/genid/49b69061d73c2102e0328121a637ab78#110
subclass of: http://lodlaundromat.org/.well-known/genid/49b69061d73c2102e0328121a637ab78#2
subclass of: http://lodlaundromat.org/.well-known/genid/49b69061d73c2102e0328121a637ab78#67
subclass of: http://lodlaundromat.org/.well-known/genid/49b69061d73c2102e0328121a637ab78#86
subclass of: http://lodlaundromat.org/.well-known/genid/49b69061d73c2102e0328121a637ab78#96
subclass of: http://lodlaundromat.org/.well-known/genid/49b69061d73c2102e0328121a637ab78#54
subclass of: http://lodlaundromat.org/.well-known/genid/49b69061d73c2102e0328121a637ab78#136
subclass of: http://lodlaundromat.org/.well-known/genid/49b69061d73c2102e0328121a637ab78#72
subclass of: http://lodlaundromat.org/.well-known/genid/49b69061d73c2102e0328121a637ab78#81
subclass of: http://lodlaundromat.org/.well-known/genid/49b69061d73c2102e0328121a637ab78#91
subclass of: http://lodlaundromat.org/.well-known/genid/49b69061d73c2102e0328121a637ab78#122
subclass of: http://lodlaundromat.org/.well-known/genid/49b69061d73c2102e0328121a637ab78#128
subclass of: Entity
subclass of: http://lodlaundromat.org/.well-known/genid/49b69061d73c2102e0328121a637ab78#104
subclass of: http://lodlaundromat.org/.well-known/genid/49b69061d73c2102e0328121a637ab78#99
subclass of: http://lodlaundromat.org/.well-known/genid/49b69061d73c2102e0328121a637ab78#76

Place of Birth
type: FunctionalProperty
comment: This property specifies the place the being was born or created
domain: Being
range: Space
type: Property
domain: Resource
domain: Entity
domain: http://lodlaundromat.org/.well-known/genid/49b69061d73c2102e0328121a637ab78#128
domain: Thing
domain: http://lodlaundromat.org/.well-known/genid/49b69061d73c2102e0328121a637ab78#44
domain: http://lodlaundromat.org/.well-known/genid/49b69061d73c2102e0328121a637ab78#110
domain: http://lodlaundromat.org/.well-known/genid/49b69061d73c2102e0328121a637ab78#132
domain: http://lodlaundromat.org/.well-known/genid/49b69061d73c2102e0328121a637ab78#99
domain: http://lodlaundromat.org/.well-known/genid/49b69061d73c2102e0328121a637ab78#107
domain: http://lodlaundromat.org/.well-known/genid/49b69061d73c2102e0328121a637ab78#122
domain: http://lodlaundromat.org/.well-known/genid/49b69061d73c2102e0328121a637ab78#104
domain: http://lodlaundromat.org/.well-known/genid/49b69061d73c2102e0328121a637ab78#86
domain: http://lodlaundromat.org/.well-known/genid/49b69061d73c2102e0328121a637ab78#136
domain: http://lodlaundromat.org/.well-known/genid/49b69061d73c2102e0328121a637ab78#96
domain: Person
domain: http://lodlaundromat.org/.well-known/genid/49b69061d73c2102e0328121a637ab78#2
domain: http://lodlaundromat.org/.well-known/genid/49b69061d73c2102e0328121a637ab78#67
domain: http://lodlaundromat.org/.well-known/genid/49b69061d73c2102e0328121a637ab78#91
domain: http://lodlaundromat.org/.well-known/genid/49b69061d73c2102e0328121a637ab78#54
domain: http://lodlaundromat.org/.well-known/genid/49b69061d73c2102e0328121a637ab78#76
domain: http://lodlaundromat.org/.well-known/genid/49b69061d73c2102e0328121a637ab78#81
domain: http://lodlaundromat.org/.well-known/genid/49b69061d73c2102e0328121a637ab78#72
range: http://lodlaundromat.org/.well-known/genid/49b69061d73c2102e0328121a637ab78#44
range: http://lodlaundromat.org/.well-known/genid/49b69061d73c2102e0328121a637ab78#116
range: http://lodlaundromat.org/.well-known/genid/49b69061d73c2102e0328121a637ab78#122
range: Resource
range: Thing
range: http://lodlaundromat.org/.well-known/genid/49b69061d73c2102e0328121a637ab78#51
range: http://lodlaundromat.org/.well-known/genid/49b69061d73c2102e0328121a637ab78#48
range: http://lodlaundromat.org/.well-known/genid/49b69061d73c2102e0328121a637ab78#110
range: http://lodlaundromat.org/.well-known/genid/49b69061d73c2102e0328121a637ab78#136
range: http://lodlaundromat.org/.well-known/genid/49b69061d73c2102e0328121a637ab78#99

OntoMedia Being Representation
creator: K Faith Lawrence (mailto:kf03r@ecs.soton.ac.uk)
created: 2005-05-11
type: Ontology
imports: http://xmlns.com/foaf/0.1/
description: OntoMedia (Ontology for Media) has been designed to describe the interactions occurring in multimedia.
version info: 0.25
creator: Michael O. Jewell (mailto:moj@ecs.soton.ac.uk)
creator: Mischa M Tuffield (mailto:mmt04r@ecs.soton.ac.uk)