Clip
subclass of: Resource
subclass of: Thing
type: Class
comment: The Clips subclass of programmes produced by the BBC.
subclass of: Programme
deprecated: true
subclass of: CreativeWork

Programme
subclass of: Resource
subclass of: Thing
type: Class
comment: The class of programmes produced by the BBC
subclass of: CreativeWork
deprecated: true

tag
range: Thing
domain: Thing
type: ObjectProperty
comment: Indicates that the creative work is tagged with tag concept
domain: CreativeWork
type: Property
range: Resource
domain: Resource

LiveCoverage
subclass of: Resource
subclass of: Thing
type: Class
comment: This class is used to describe that creative works which are coverage of a live event. (Note that this isn't meant to describe the fact that the event is live currently. An example of a Live Coverage creative work is the live event page covering live the England VS Australia cricket match, last saturday's football matches or last year's elections)
subclass of: CreativeWork
deprecated: true

Thumbnail
subclass of: Resource
type: Class
comment: Used to associate a Creative Work with the canonical location of the thumbnail. The URI of each of its instances is the full canonical location of the thumbnail
subclass of: Thing

LiveEventPage
subclass of: Resource
subclass of: Thing
type: Class
comment: This class is created to support the LiveEventPages from CPS. This will be soon deprecated for the sake of LiveCoverage
subclass of: CreativeWork
deprecated: true

category
range: Thing
domain: Thing
type: ObjectProperty
comment: The category property is another mid term solution for maintaining the functionality supporting individual clients. For example, the type of gossip is something that the sports pal use for the moment. The values of the property are decided by the client teams in collaboration with LDP
domain: CreativeWork
range: Category
type: Property
range: Resource
domain: Resource

Format
subclass of: Resource
type: Class
comment: The primary format of the CreativeWork and it can be one of the five instances. This is needed for selecting the appropriate icon with which to overlay the preview thumbnail of the creative work.
subclass of: Thing

CreativeWork
subclass of: Resource
type: Class
comment: The class of creative works produced by the BBC.
subclass of: Thing

audience
range: Thing
domain: Thing
type: ObjectProperty
comment: Associates the Creative Work with an audience instance
domain: CreativeWork
range: Audience
type: Property
range: Resource
domain: Resource

thumbnailType
range: Thing
domain: Thing
type: ObjectProperty
comment: Associates the Thumbnail instance with a Thumbnail type
domain: Thumbnail
range: ThumbnailType
type: Property
range: Resource
domain: Resource

BlogPost
subclass of: Resource
subclass of: Thing
type: Class
comment: This is the class of creative works that are associated with particular journalists or correspondents. The analysis, commentary and personal viewpoint of the creator is reflected on the blog post and the blog post is usually associated prominently with the name of the creator. BlogPost can have different types of formats.
subclass of: CreativeWork
deprecated: true

mentions
range: Thing
domain: Thing
type: ObjectProperty
comment: Indicates that the creative work mentions a tag concept
domain: CreativeWork
sub property of: tag
type: Property
range: Resource
domain: Resource

thumbnail
range: Thing
domain: Thing
type: ObjectProperty
comment: Associates the Creative Work with the Thumbnail instance
domain: CreativeWork
range: Thumbnail
type: Property
range: Resource
domain: Resource

Category
subclass of: Resource
subclass of: Thing
type: Class
comment: A class to represent different categorisations of creative works from different clients. This class is instantiated in the clients' application logic models.

Episode
subclass of: Resource
subclass of: Thing
type: Class
comment: The Episodes subclass of programmes produced by the BBC.
subclass of: Programme
deprecated: true
subclass of: CreativeWork

ThumbnailType
subclass of: Resource
type: Class
comment: Enumerated class of the allowed thumbnail types
subclass of: Thing

primaryFormat
range: Thing
domain: Thing
type: ObjectProperty
comment: Associates the Creative Work with the Primary Format instance
domain: CreativeWork
range: Format
type: Property
range: Resource
domain: Resource

Audience
subclass of: Resource
subclass of: Thing
type: Class
comment: Enumerated class of the audiences the BBC creates content for.

Commentary
subclass of: Resource
subclass of: Thing
type: Class
comment: This class represents short form creative works in the shape of updates. These differ from the other types of creative works because they haven't got independent URLs as (primaryContentOf) from which they can be retrieved.
subclass of: CreativeWork
deprecated: true

about
range: Thing
domain: Thing
type: ObjectProperty
comment: Indicates that the creative work is about a tag concept
domain: CreativeWork
sub property of: tag
type: Property
range: Resource
domain: Resource

NewsItem
subclass of: Resource
subclass of: Thing
type: Class
comment: The class of all news items that the BBC produces. They can be textual articles, or media asset pages (audio or video) or live coverage of events (use the liveCoverage property).
subclass of: CreativeWork
deprecated: true

createdBy
range: Thing
domain: Thing
type: ObjectProperty
comment: associate a creative work with its creator
domain: CreativeWork
type: Property
range: Resource
domain: Resource

InternationalAudience
type: Audience
comment: The international (non UK) audience. The creative works linked to this instance are *only available to the international audience*.
type: Thing

FixedSize464Thumbnail
type: ThumbnailType
comment: Fixed size thumbnail
deprecated: true
type: Thing

shortTitle
type: DatatypeProperty
comment: The sort title of the Creative Work
domain: CreativeWork
range: string
type: Property
range: Resource
domain: Thing
domain: Resource

dateCreated
type: DatatypeProperty
comment: Date created of CreativeWork
domain: CreativeWork
range: date
type: Property
range: Resource
domain: Thing
domain: Resource

NationalAudience
type: Audience
comment: The national audience. The creative works linked to this instance are *only available to the national audience*.
type: Thing

CloseUpThumbnail
type: ThumbnailType
comment: A 16x9 image, focused and zoomed in one part of the image, usually when the standard thumbnail is very small to be meaningful (e.g., in mobile).
type: Thing

PictureGalleryFormat
type: Format
comment: Used to represent that the primary format of a CreativeWork is of PictureGallery (this is a mid-term solution for the modelling of galleries)
type: Thing

FixedSize224Thumbnail
type: ThumbnailType
comment: Fixed size thumbnail
deprecated: true
type: Thing

FixedSize144Thumbnail
type: ThumbnailType
comment: Fixed size thumbnail
deprecated: true
type: Thing

Creative Work Ontology
version: 1.7
date: 2012-12-01
provided: 2015-02-11T17:17:25Z
version IRI: http://www.bbc.co.uk/ontologies/creativework/1.7
license: http://creativecommons.org/licenses/by/4.0/
imports: provenance
prior version: http://www.bbc.co.uk/ontologies/creativework/1.6
version info: 1.7
type: Ontology
public: true
canonical location: https://github.com/bbc-fm-nk-core-eng/ontologies/blob/master/core/creativework.ttl
imports: http://purl.org/dc/elements/1.1/
slug: creativework
comment: This is the model we use to express the minimum metadata necessary to express a piece of creative content in the platform. The creative work ontology is continuously evolving based on our clients' requirements. There is a core class in this model, which is the CreativeWork class and properties that support information the LDP clients need to build their products such as title, thumbnail, URL e.t.c.
imports: terms
change reason: Adding language support.

altText
type: DatatypeProperty
comment: The alternative text for a thumbnail in case the URL is not resolved
domain: Thumbnail
range: string
type: Property
range: Resource
domain: Thing
domain: Resource

FixedSize66Thumbnail
type: ThumbnailType
comment: Fixed size thumbnail
deprecated: true
type: Thing

description
type: DatatypeProperty
comment: The description of the Creative Work
domain: CreativeWork
range: string
type: Property
range: Resource
domain: Thing
domain: Resource

AudioFormat
type: Format
comment: Used to represent that the primary format of a CreativeWork is Audio.
type: Thing

ImageFormat
type: Format
comment: Used to represent that the primary format of a CreativeWork is Image
type: Thing

title
type: DatatypeProperty
comment: The title of the Creative Work
domain: CreativeWork
range: string
type: Property
range: Resource
domain: Thing
domain: Resource

dateModified
type: DatatypeProperty
comment: Date modified of CreativeWork
domain: CreativeWork
range: date
type: Property
range: Resource
domain: Thing
domain: Resource

StandardThumbnail
type: ThumbnailType
comment: A 16x9 image used in most occasions
type: Thing

InteractiveFormat
type: Format
comment: Used to represent that the primary format of a CreativeWork is Interactive
type: Thing

FixedSize226Thumbnail
type: ThumbnailType
comment: Fixed size thumbnail
deprecated: true
type: Thing

VideoFormat
type: Format
comment: Used to represent that the primary format of a CreativeWork is Video
type: Thing

language
type: DatatypeProperty
comment: The language of the creative work, please use BCP47 https://tools.ietf.org/html/bcp47
domain: CreativeWork
range: language
type: Property
range: Resource
domain: Thing
domain: Resource

TextualFormat
type: Format
comment: Used to represent that the primary format of a CreativeWork is Text
type: Thing