intervalDuring
range: Thing
domain: Thing
linked concept: intervalDuring
type: ObjectProperty
comment: Indicates that one time interval (the subject) occurs during the other (object) time interval, i.e. it begins after the object time interval has begun and ends before the object interval ends.
domain: Time interval
range: Time interval
type: Property
range: Resource
range: Abstract
range: Entity
range: http://lodlaundromat.org/.well-known/genid/42cfc11f96a345388c7f4bc5aaadec29#15
range: Region
range: Temporal region
domain: Resource
domain: Region
domain: Entity
domain: Temporal region
domain: Abstract
domain: http://lodlaundromat.org/.well-known/genid/42cfc11f96a345388c7f4bc5aaadec29#15

Instant
subclass of: Resource
subclass of: Thing
type: Class
linked concept: Instant
comment: A point in time. Can have either a hasBeginning or hasEnding value, if it has both they should be the same.
subclass of: Temporal region
subclass of: http://lodlaundromat.org/.well-known/genid/42cfc11f96a345388c7f4bc5aaadec29#15
subclass of: Region
subclass of: Abstract
subclass of: Entity

after
range: Thing
domain: Thing
type: ObjectProperty
comment: Indicates that one interval (the subject) starts after another (the object) ends.
domain: Temporal region
range: Temporal region
type: Property
range: Resource
range: Entity
range: Abstract
range: Region
range: http://lodlaundromat.org/.well-known/genid/42cfc11f96a345388c7f4bc5aaadec29#15
domain: Resource
domain: Region
domain: Entity
domain: Abstract
domain: http://lodlaundromat.org/.well-known/genid/42cfc11f96a345388c7f4bc5aaadec29#15

Division
subclass of: Resource
subclass of: Thing
type: Class
linked concept: Division
comment: Branch, division, department, laboratory, etc. within an organisation. Usually, not an independent legal entity.
subclass of: Organization
subclass of: http://lodlaundromat.org/.well-known/genid/42cfc11f96a345388c7f4bc5aaadec29#1
subclass of: http://lodlaundromat.org/.well-known/genid/42cfc11f96a345388c7f4bc5aaadec29#2
subclass of: Group
subclass of: Agent
subclass of: Endurant
subclass of: Object
subclass of: Entity

Country
subclass of: Thing
subclass of: Resource
type: Class
linked concept: Country
comment: A country, normally designated by a GeoNames URI.
subclass of: Geographic Location
subclass of: http://lodlaundromat.org/.well-known/genid/42cfc11f96a345388c7f4bc5aaadec29#2
subclass of: http://lodlaundromat.org/.well-known/genid/42cfc11f96a345388c7f4bc5aaadec29#1
subclass of: Endurant
subclass of: Object
subclass of: Entity

definitive source
range: Thing
domain: Thing
type: ObjectProperty
comment: Indicates the definitive source from which this resource was, or could be, obtained.
sub property of: has source
type: Property
range: Information source
range: Resource
range: Information resource
range: http://lodlaundromat.org/.well-known/genid/42cfc11f96a345388c7f4bc5aaadec29#10
range: http://lodlaundromat.org/.well-known/genid/42cfc11f96a345388c7f4bc5aaadec29#6
range: http://lodlaundromat.org/.well-known/genid/42cfc11f96a345388c7f4bc5aaadec29#7
range: http://lodlaundromat.org/.well-known/genid/42cfc11f96a345388c7f4bc5aaadec29#8
range: Object
range: http://lodlaundromat.org/.well-known/genid/42cfc11f96a345388c7f4bc5aaadec29#9
range: http://lodlaundromat.org/.well-known/genid/42cfc11f96a345388c7f4bc5aaadec29#2
range: http://lodlaundromat.org/.well-known/genid/42cfc11f96a345388c7f4bc5aaadec29#1
range: Endurant
range: Entity
domain: Information resource
domain: Resource
domain: http://lodlaundromat.org/.well-known/genid/42cfc11f96a345388c7f4bc5aaadec29#6
domain: Object
domain: http://lodlaundromat.org/.well-known/genid/42cfc11f96a345388c7f4bc5aaadec29#8
domain: http://lodlaundromat.org/.well-known/genid/42cfc11f96a345388c7f4bc5aaadec29#7
domain: http://lodlaundromat.org/.well-known/genid/42cfc11f96a345388c7f4bc5aaadec29#10
domain: http://lodlaundromat.org/.well-known/genid/42cfc11f96a345388c7f4bc5aaadec29#9
domain: http://lodlaundromat.org/.well-known/genid/42cfc11f96a345388c7f4bc5aaadec29#2
domain: http://lodlaundromat.org/.well-known/genid/42cfc11f96a345388c7f4bc5aaadec29#1
domain: Endurant
domain: Entity

Relation
subclass of: Resource
subclass of: Thing
type: Class
linked concept: Relation
comment: Class of relations. Mostly used for when we are reifiying complex relations as objects and so does not itself break the DL constraints, could be used as a category of general relations as done in SUMO in which case we would be forced into OWL/full.
subclass of: Abstract
subclass of: Entity

Amount of matter
subclass of: Resource
subclass of: Thing
type: Class
linked concept: amount-of-matter
comment: Things like "water", "clay" which have no unity (the combination of two amounts of clay is just a single amount of clay), aka "stuff".
subclass of: http://lodlaundromat.org/.well-known/genid/42cfc11f96a345388c7f4bc5aaadec29#3
subclass of: Endurant
disjoint with: Object
disjoint with: Object feature
subclass of: Entity

Time interval
subclass of: Thing
subclass of: Resource
type: Class
linked concept: time-interval
linked concept: TimeInterval
linked concept: Interval
comment: An interval of time. Note that a TimeInterval has both an extent and a location on a timeline. Note too that a TimeInterval has no gaps, i.e. this class contains only convex time intervals.
subclass of: Temporal region
subclass of: http://lodlaundromat.org/.well-known/genid/42cfc11f96a345388c7f4bc5aaadec29#15
subclass of: Abstract
subclass of: Entity
subclass of: Region

occurs at time
range: Thing
domain: Thing
type: ObjectProperty
comment: The time or time interval at which an event or process takes place.
domain: Perdurant
range: Temporal region
type: Property
range: Resource
range: Entity
range: Abstract
range: Region
range: http://lodlaundromat.org/.well-known/genid/42cfc11f96a345388c7f4bc5aaadec29#15
domain: Resource
domain: Entity

Group
subclass of: Resource
subclass of: Thing
type: Class
linked concept: Group
comment: A Collection of Agents, e.g. a flock of sheep, a herd of goats, or the local Boy Scout troop.
subclass of: Agent
disjoint with: Person
subclass of: http://lodlaundromat.org/.well-known/genid/42cfc11f96a345388c7f4bc5aaadec29#2
subclass of: http://lodlaundromat.org/.well-known/genid/42cfc11f96a345388c7f4bc5aaadec29#1
subclass of: Object
subclass of: Endurant
subclass of: Entity

Corporation
subclass of: Resource
subclass of: Thing
type: Class
linked concept: BusinessEntity
linked concept: CorporateBody
linked concept: Corporation
comment: An Organization that has a special legal status that allows a group of persons to act as a CommercialAgent and that insulates the owners (shareholders) from many liabilities that might result from the corporation's operation.
subclass of: Organization
subclass of: http://lodlaundromat.org/.well-known/genid/42cfc11f96a345388c7f4bc5aaadec29#1
subclass of: http://lodlaundromat.org/.well-known/genid/42cfc11f96a345388c7f4bc5aaadec29#2
subclass of: Group
subclass of: Agent
subclass of: Endurant
subclass of: Object
subclass of: Entity

N-ary relation
subclass of: Thing
subclass of: Resource
type: Class
comment: Superclass of all types of reified n-ary relations. Instances link to the participating objects via hasArgument properties.
subclass of: Relation
subclass of: Abstract
subclass of: Entity

Man
subclass of: Resource
subclass of: Thing
type: Class
linked concept: Man
comment: Class of male persons.
subclass of: Person
subclass of: http://lodlaundromat.org/.well-known/genid/42cfc11f96a345388c7f4bc5aaadec29#2
subclass of: http://lodlaundromat.org/.well-known/genid/42cfc11f96a345388c7f4bc5aaadec29#1
subclass of: Agent
subclass of: Object
subclass of: Endurant
subclass of: Entity

Person
subclass of: Resource
subclass of: Thing
type: Class
linked concept: Person
linked concept: Human
comment: An individual, a human being
subclass of: Agent
disjoint with: Group
subclass of: http://lodlaundromat.org/.well-known/genid/42cfc11f96a345388c7f4bc5aaadec29#1
subclass of: http://lodlaundromat.org/.well-known/genid/42cfc11f96a345388c7f4bc5aaadec29#2
subclass of: Endurant
subclass of: Object
subclass of: Entity

Agent
subclass of: Thing
subclass of: Resource
type: Class
linked concept: Agent
disjoint with: Geographic Location
disjoint with: ProductInstance
disjoint with: Information resource
comment: Something or someone that can act on its own and produce changes in the world.
subclass of: Object
subclass of: http://lodlaundromat.org/.well-known/genid/42cfc11f96a345388c7f4bc5aaadec29#2
subclass of: http://lodlaundromat.org/.well-known/genid/42cfc11f96a345388c7f4bc5aaadec29#1
subclass of: Endurant
subclass of: Entity

object value
range: Thing
domain: Thing
type: ObjectProperty
comment: Gives an object (aka Individual) valued argument for an n-ary relationship, such as a weighted relation.
domain: N-ary relation
sub property of: has argument
type: Property
domain: Resource
domain: Relation
domain: Abstract
domain: Entity
range: Resource

Document
subclass of: Thing
subclass of: Resource
type: Class
linked concept: Document
comment: A document, does not distinguish electronic and physical copies. Not limited to text documents.
subclass of: Information resource
subclass of: http://lodlaundromat.org/.well-known/genid/42cfc11f96a345388c7f4bc5aaadec29#9
subclass of: http://lodlaundromat.org/.well-known/genid/42cfc11f96a345388c7f4bc5aaadec29#7
subclass of: http://lodlaundromat.org/.well-known/genid/42cfc11f96a345388c7f4bc5aaadec29#2
subclass of: http://lodlaundromat.org/.well-known/genid/42cfc11f96a345388c7f4bc5aaadec29#1
subclass of: http://lodlaundromat.org/.well-known/genid/42cfc11f96a345388c7f4bc5aaadec29#8
subclass of: http://lodlaundromat.org/.well-known/genid/42cfc11f96a345388c7f4bc5aaadec29#6
subclass of: http://lodlaundromat.org/.well-known/genid/42cfc11f96a345388c7f4bc5aaadec29#10
subclass of: Object
subclass of: Endurant
subclass of: Entity

intervalFinishes
range: Thing
domain: Thing
linked concept: intervalFinishes
type: ObjectProperty
comment: Indicates that one time interval (the subject) finishes the other (object) time interval, i.e. end start at the same time but it starts after the object interval starts.
domain: Time interval
range: Time interval
type: Property
range: Resource
range: Abstract
range: Entity
range: http://lodlaundromat.org/.well-known/genid/42cfc11f96a345388c7f4bc5aaadec29#15
range: Region
range: Temporal region
domain: Resource
domain: Region
domain: Entity
domain: Temporal region
domain: Abstract
domain: http://lodlaundromat.org/.well-known/genid/42cfc11f96a345388c7f4bc5aaadec29#15

Time dependent relation
subclass of: Resource
subclass of: Thing
type: Class
comment: Reification of a time-dependent relation. A special case of a QualifiedBinaryRelation where the context should be a time interval.
subclass of: http://lodlaundromat.org/.well-known/genid/42cfc11f96a345388c7f4bc5aaadec29#14
subclass of: Qualified binary relation
subclass of: N-ary relation
subclass of: Abstract
subclass of: Relation
subclass of: Entity

Datum (integer)
subclass of: Resource
subclass of: Thing
type: Class
comment: A single (integer) value in a function (typically of time)
subclass of: http://lodlaundromat.org/.well-known/genid/42cfc11f96a345388c7f4bc5aaadec29#13
subclass of: Datum

Government organization
subclass of: Resource
subclass of: Thing
type: Class
linked concept: GovernmentOrganization
comment: GovernmentOrganization is the class of official Organizations that are concerned with the government of a GeopoliticalArea at some level. They may be a subOrganization of a government.
subclass of: Organization
subclass of: http://lodlaundromat.org/.well-known/genid/42cfc11f96a345388c7f4bc5aaadec29#2
subclass of: http://lodlaundromat.org/.well-known/genid/42cfc11f96a345388c7f4bc5aaadec29#1
subclass of: Group
subclass of: Agent
subclass of: Object
subclass of: Endurant
subclass of: Entity

Religous group
subclass of: Resource
subclass of: Thing
type: Class
linked concept: ReligiousOrganization
comment: An Organization whose members share a set of religious beliefs.
subclass of: Organization
subclass of: Group
subclass of: http://lodlaundromat.org/.well-known/genid/42cfc11f96a345388c7f4bc5aaadec29#1
subclass of: http://lodlaundromat.org/.well-known/genid/42cfc11f96a345388c7f4bc5aaadec29#2
subclass of: Agent
subclass of: Object
subclass of: Endurant
subclass of: Entity

Geo Feature
subclass of: Resource
subclass of: Thing
type: Class
linked concept: Feature
comment: A geographical feature such as a river, mountain, including man made features such as cities and bridges. Ususally designated by a Geonames URI with associated descriptive information.
subclass of: Geographic Location
subclass of: http://lodlaundromat.org/.well-known/genid/42cfc11f96a345388c7f4bc5aaadec29#2
subclass of: http://lodlaundromat.org/.well-known/genid/42cfc11f96a345388c7f4bc5aaadec29#1
subclass of: Endurant
subclass of: Object
subclass of: Entity

in country
range: Thing
domain: Thing
linked concept: inCountry
type: ObjectProperty
comment: The country in which a geographical feature is located.
domain: Geo Feature
range: Country
sub property of: located at
type: Property
range: Geographic Location
range: Resource
range: Object
range: Endurant
range: http://lodlaundromat.org/.well-known/genid/42cfc11f96a345388c7f4bc5aaadec29#2
range: http://lodlaundromat.org/.well-known/genid/42cfc11f96a345388c7f4bc5aaadec29#1
range: Entity
domain: Object
domain: Resource
domain: http://lodlaundromat.org/.well-known/genid/42cfc11f96a345388c7f4bc5aaadec29#2
domain: Endurant
domain: http://lodlaundromat.org/.well-known/genid/42cfc11f96a345388c7f4bc5aaadec29#1
domain: Entity
domain: Geographic Location

participant
range: Endurant
domain: Perdurant
inverse of: participates in
range: Thing
domain: Thing
type: ObjectProperty
comment: Indicates some person or object that partipates in a process or event.
type: Property
range: Entity
range: Resource
domain: Resource
domain: Entity

Information source
subclass of: Resource
type: Class
subclass of: Thing
comment: A storage system, content management system, or other source from which information resources like Documents can be obtained. The aggregate can itself be regarded as an InformationResource though metadata on the InformationSource should be used to describe the name and authorship of the source rather of the union of the contained resources.
subclass of: Information resource
subclass of: http://lodlaundromat.org/.well-known/genid/42cfc11f96a345388c7f4bc5aaadec29#10
subclass of: http://lodlaundromat.org/.well-known/genid/42cfc11f96a345388c7f4bc5aaadec29#6
subclass of: http://lodlaundromat.org/.well-known/genid/42cfc11f96a345388c7f4bc5aaadec29#7
subclass of: http://lodlaundromat.org/.well-known/genid/42cfc11f96a345388c7f4bc5aaadec29#8
subclass of: Object
subclass of: http://lodlaundromat.org/.well-known/genid/42cfc11f96a345388c7f4bc5aaadec29#9
subclass of: http://lodlaundromat.org/.well-known/genid/42cfc11f96a345388c7f4bc5aaadec29#2
subclass of: http://lodlaundromat.org/.well-known/genid/42cfc11f96a345388c7f4bc5aaadec29#1
subclass of: Endurant
subclass of: Entity

Weighted relation
subclass of: Thing
subclass of: Resource
type: Class
comment: A relation containing a weight (e.g. an associated probablilty) and an object or literal value.
subclass of: http://lodlaundromat.org/.well-known/genid/42cfc11f96a345388c7f4bc5aaadec29#11
subclass of: N-ary relation
subclass of: Relation
subclass of: Abstract
subclass of: Entity

Woman
subclass of: Resource
subclass of: Thing
type: Class
linked concept: Woman
comment: Class of female persons.
subclass of: Person
subclass of: http://lodlaundromat.org/.well-known/genid/42cfc11f96a345388c7f4bc5aaadec29#2
subclass of: http://lodlaundromat.org/.well-known/genid/42cfc11f96a345388c7f4bc5aaadec29#1
subclass of: Endurant
subclass of: Object
subclass of: Agent
subclass of: Entity

Educational organization
subclass of: Resource
subclass of: Thing
type: Class
linked concept: EducationalOrganization
comment: A EducationalOrganization is an institution of learning. Some examples are public and private K-12 schools, and colleges and universities.
subclass of: Organization
subclass of: http://lodlaundromat.org/.well-known/genid/42cfc11f96a345388c7f4bc5aaadec29#2
subclass of: http://lodlaundromat.org/.well-known/genid/42cfc11f96a345388c7f4bc5aaadec29#1
subclass of: Group
subclass of: Agent
subclass of: Endurant
subclass of: Object
subclass of: Entity

has source
range: Thing
domain: Thing
type: ObjectProperty
comment: Indicates an information source from which the subject resource could be obtained.
domain: Information resource
range: Information source
type: Property
range: http://lodlaundromat.org/.well-known/genid/42cfc11f96a345388c7f4bc5aaadec29#8
range: http://lodlaundromat.org/.well-known/genid/42cfc11f96a345388c7f4bc5aaadec29#2
range: http://lodlaundromat.org/.well-known/genid/42cfc11f96a345388c7f4bc5aaadec29#6
range: http://lodlaundromat.org/.well-known/genid/42cfc11f96a345388c7f4bc5aaadec29#9
range: Resource
range: http://lodlaundromat.org/.well-known/genid/42cfc11f96a345388c7f4bc5aaadec29#7
range: Entity
range: Endurant
range: http://lodlaundromat.org/.well-known/genid/42cfc11f96a345388c7f4bc5aaadec29#1
range: Object
range: Information resource
range: http://lodlaundromat.org/.well-known/genid/42cfc11f96a345388c7f4bc5aaadec29#10
domain: Resource
domain: http://lodlaundromat.org/.well-known/genid/42cfc11f96a345388c7f4bc5aaadec29#1
domain: http://lodlaundromat.org/.well-known/genid/42cfc11f96a345388c7f4bc5aaadec29#2
domain: http://lodlaundromat.org/.well-known/genid/42cfc11f96a345388c7f4bc5aaadec29#8
domain: http://lodlaundromat.org/.well-known/genid/42cfc11f96a345388c7f4bc5aaadec29#10
domain: http://lodlaundromat.org/.well-known/genid/42cfc11f96a345388c7f4bc5aaadec29#6
domain: http://lodlaundromat.org/.well-known/genid/42cfc11f96a345388c7f4bc5aaadec29#9
domain: Entity
domain: Endurant
domain: Object
domain: http://lodlaundromat.org/.well-known/genid/42cfc11f96a345388c7f4bc5aaadec29#7

contact details
range: Thing
domain: Thing
type: ObjectProperty
domain: Agent
range: VCard
type: Property
range: Resource
domain: http://lodlaundromat.org/.well-known/genid/42cfc11f96a345388c7f4bc5aaadec29#2
domain: Object
domain: Resource
domain: http://lodlaundromat.org/.well-known/genid/42cfc11f96a345388c7f4bc5aaadec29#1
domain: Entity
domain: Endurant

Information resource
subclass of: Resource
type: Class
subclass of: Thing
recommended Property: creator
subclass of: http://lodlaundromat.org/.well-known/genid/42cfc11f96a345388c7f4bc5aaadec29#6
recommended Property: date
recommended Property: title
linked concept: InformationResource
subclass of: Object
disjoint with: ProductInstance
disjoint with: Agent
subclass of: http://lodlaundromat.org/.well-known/genid/42cfc11f96a345388c7f4bc5aaadec29#8
recommended Property: source
recommended Property: subject
recommended Property: rights
recommended Property: format
comment: InformationResource denotes an information resource with identity, as defined in Dublin Core (DC2003ISO). A document (physical or electronic), message or other information object. We recommend use of Dublic Core elements for basic descriptive metadata and guide usage by restricting the range of some dc elements.
recommended Property: type
subclass of: http://lodlaundromat.org/.well-known/genid/42cfc11f96a345388c7f4bc5aaadec29#7
subclass of: http://lodlaundromat.org/.well-known/genid/42cfc11f96a345388c7f4bc5aaadec29#10
disjoint with: Geographic Location
subclass of: http://lodlaundromat.org/.well-known/genid/42cfc11f96a345388c7f4bc5aaadec29#9
recommended Property: contributor
subclass of: http://lodlaundromat.org/.well-known/genid/42cfc11f96a345388c7f4bc5aaadec29#2
subclass of: http://lodlaundromat.org/.well-known/genid/42cfc11f96a345388c7f4bc5aaadec29#1
subclass of: Endurant
subclass of: Entity

located at
range: Thing
domain: Thing
linked concept: locatedIn
type: ObjectProperty
comment: The location at which a thing exists or is currently situated.
domain: Object
range: Geographic Location
type: Property
range: Entity
range: Endurant
range: Resource
range: Object
range: http://lodlaundromat.org/.well-known/genid/42cfc11f96a345388c7f4bc5aaadec29#1
range: http://lodlaundromat.org/.well-known/genid/42cfc11f96a345388c7f4bc5aaadec29#2
domain: Resource
domain: http://lodlaundromat.org/.well-known/genid/42cfc11f96a345388c7f4bc5aaadec29#1
domain: http://lodlaundromat.org/.well-known/genid/42cfc11f96a345388c7f4bc5aaadec29#2
domain: Entity
domain: Endurant

part of
range: Thing
domain: Thing
type: ObjectProperty
comment: General mereology relation of one thing being part of another.
domain: Entity
range: Entity
type: Property
range: Resource
domain: Resource

before
range: Thing
domain: Thing
type: ObjectProperty
comment: Indicates that one interval (the subject) ends before another (the object) begins.
domain: Temporal region
range: Temporal region
type: Property
range: Resource
range: Entity
range: Abstract
range: Region
range: http://lodlaundromat.org/.well-known/genid/42cfc11f96a345388c7f4bc5aaadec29#15
domain: Resource
domain: Region
domain: Entity
domain: Abstract
domain: http://lodlaundromat.org/.well-known/genid/42cfc11f96a345388c7f4bc5aaadec29#15

version of
range: Thing
domain: Thing
type: ObjectProperty
comment: Indicates that one InformationResource is a a version of some other resource. Note this is more restricted relation that dc:source, dc:source could indicate some set of primary references works used in the generation of a wholly new InformationResource whereas versionOf would only be used betweens successive refinements or copies of the essentially the same resource.
domain: Information resource
range: Information resource
type: Property
range: Resource
range: Object
range: http://lodlaundromat.org/.well-known/genid/42cfc11f96a345388c7f4bc5aaadec29#10
range: Endurant
range: http://lodlaundromat.org/.well-known/genid/42cfc11f96a345388c7f4bc5aaadec29#1
range: http://lodlaundromat.org/.well-known/genid/42cfc11f96a345388c7f4bc5aaadec29#2
range: Entity
range: http://lodlaundromat.org/.well-known/genid/42cfc11f96a345388c7f4bc5aaadec29#8
range: http://lodlaundromat.org/.well-known/genid/42cfc11f96a345388c7f4bc5aaadec29#9
range: http://lodlaundromat.org/.well-known/genid/42cfc11f96a345388c7f4bc5aaadec29#6
range: http://lodlaundromat.org/.well-known/genid/42cfc11f96a345388c7f4bc5aaadec29#7
domain: Resource
domain: http://lodlaundromat.org/.well-known/genid/42cfc11f96a345388c7f4bc5aaadec29#1
domain: http://lodlaundromat.org/.well-known/genid/42cfc11f96a345388c7f4bc5aaadec29#2
domain: http://lodlaundromat.org/.well-known/genid/42cfc11f96a345388c7f4bc5aaadec29#8
domain: http://lodlaundromat.org/.well-known/genid/42cfc11f96a345388c7f4bc5aaadec29#10
domain: http://lodlaundromat.org/.well-known/genid/42cfc11f96a345388c7f4bc5aaadec29#6
domain: http://lodlaundromat.org/.well-known/genid/42cfc11f96a345388c7f4bc5aaadec29#9
domain: Entity
domain: Endurant
domain: Object
domain: http://lodlaundromat.org/.well-known/genid/42cfc11f96a345388c7f4bc5aaadec29#7

Temporal region
subclass of: Thing
subclass of: Resource
type: Class
linked concept: temporal-region
linked concept: TemporalEntity
comment: A region of time such as a specific instant or time interval. Can also be used for things like Geological ages.
subclass of: http://lodlaundromat.org/.well-known/genid/42cfc11f96a345388c7f4bc5aaadec29#15
subclass of: Region
subclass of: Abstract
subclass of: Entity

Abstract
subclass of: Resource
subclass of: Thing
type: Class
linked concept: abstract
comment: Something, which neither happens nor exists. The main characteristic of abstract entities is that they do not have spatial nor temporal qualities, and they are not qualities themselves.
subclass of: Entity

Object feature
subclass of: Resource
subclass of: Thing
type: Class
linked concept: feature
comment: Something which can't exist on its own but is a feature of some physical object, e.g. a bump, hole, region, spot.
subclass of: http://lodlaundromat.org/.well-known/genid/42cfc11f96a345388c7f4bc5aaadec29#1
subclass of: Endurant
disjoint with: Amount of matter
disjoint with: Object
subclass of: http://lodlaundromat.org/.well-known/genid/42cfc11f96a345388c7f4bc5aaadec29#2
subclass of: Entity

child organization of
range: Thing
domain: Thing
linked concept: childOrganizationOf
type: ObjectProperty
comment: Indicates that some organization (such as a division) is part of some parent organization.
domain: Organization
range: Organization
sub property of: part of
type: Property
range: Entity
range: Resource
domain: Entity
domain: Resource
range: Endurant
range: http://lodlaundromat.org/.well-known/genid/42cfc11f96a345388c7f4bc5aaadec29#2
range: http://lodlaundromat.org/.well-known/genid/42cfc11f96a345388c7f4bc5aaadec29#1
range: Object
range: Agent
range: Group
domain: Object
domain: http://lodlaundromat.org/.well-known/genid/42cfc11f96a345388c7f4bc5aaadec29#1
domain: Endurant
domain: http://lodlaundromat.org/.well-known/genid/42cfc11f96a345388c7f4bc5aaadec29#2
domain: Agent
domain: Group

intervalStarts
range: Thing
domain: Thing
linked concept: intervalStarts
type: ObjectProperty
comment: Indicates that one time interval (the subject) starts the other (object) time interval, i.e. they start at the same time but it ends before the object interval ends.
domain: Time interval
range: Time interval
type: Property
range: Resource
range: Abstract
range: Entity
range: http://lodlaundromat.org/.well-known/genid/42cfc11f96a345388c7f4bc5aaadec29#15
range: Region
range: Temporal region
domain: Resource
domain: Region
domain: Entity
domain: Temporal region
domain: Abstract
domain: http://lodlaundromat.org/.well-known/genid/42cfc11f96a345388c7f4bc5aaadec29#15

Qualified binary relation
subclass of: Thing
subclass of: Resource
type: Class
comment: A relation which would normally be regard as binary (e.g. memberOf, hasColour) but where the value is dependent upon some context like time. We model this as an n-ary relation where the qualifying context is given by the value of the 'inContext' property and the qualified value is given by the unique 'hasArgument' value.
subclass of: N-ary relation
subclass of: Relation
subclass of: Abstract
subclass of: Entity

Datum
subclass of: Thing
subclass of: Resource
type: Class
comment: A single value in a function (typically of time)

Organization
subclass of: Resource
subclass of: Thing
type: Class
linked concept: Organization
comment: An Organization is a corporate or similar institution. The members of an Organization typically have a common purpose or function. Note that this class also covers divisions, departments, etc. of organizations. For example, both the Shell Corporation and the accounting department at Shell would both be instances of Organization.
subclass of: Group
subclass of: http://lodlaundromat.org/.well-known/genid/42cfc11f96a345388c7f4bc5aaadec29#1
subclass of: http://lodlaundromat.org/.well-known/genid/42cfc11f96a345388c7f4bc5aaadec29#2
subclass of: Agent
subclass of: Endurant
subclass of: Object
subclass of: Entity

Event
subclass of: Resource
subclass of: Thing
type: Class
linked concept: Event
linked concept: event
comment: We split perdurants into just events and processes according to atomicity. A process has some substructure to it, it extends over time and might have discrete or continuous phases, whereas as an event has no interesting substructure. This division is relative to a given viewpoint. For example a meeting could be modelled as a process if one is recording different stages of a meeting with time ordering or might be a simple event. The two viewpoints are not regarded as disjoint.
subclass of: Perdurant
subclass of: Entity

Business activity
subclass of: Resource
subclass of: Thing
type: Class
comment: Some shared business endeavour. Use for ongoing activities as opposed to projects that have clear cut start/end time courses.
subclass of: Process
subclass of: Perdurant
subclass of: Entity

intevalOverlaps
range: Thing
domain: Thing
linked concept: intervalOverlaps
type: ObjectProperty
comment: Indicates that one time interval (the subject) overlaps the other (object) time interval, i.e. it begins before the object time interval has begun and ends during the object interval ends.
domain: Time interval
range: Time interval
type: Property
range: Resource
range: Abstract
range: Entity
range: http://lodlaundromat.org/.well-known/genid/42cfc11f96a345388c7f4bc5aaadec29#15
range: Region
range: Temporal region
domain: Resource
domain: Region
domain: Entity
domain: Temporal region
domain: Abstract
domain: http://lodlaundromat.org/.well-known/genid/42cfc11f96a345388c7f4bc5aaadec29#15

occurs at
range: Thing
domain: Thing
type: ObjectProperty
comment: The location at which an event or process takes place.
domain: Perdurant
range: Geographic Location
type: Property
range: Entity
range: Endurant
range: Resource
range: Object
range: http://lodlaundromat.org/.well-known/genid/42cfc11f96a345388c7f4bc5aaadec29#1
range: http://lodlaundromat.org/.well-known/genid/42cfc11f96a345388c7f4bc5aaadec29#2
domain: Resource
domain: Entity

Spatial region
subclass of: Resource
subclass of: Thing
type: Class
linked concept: spatial-region
comment: A region of space in some measurement system including a polygonal boundary of a geographic space or a region of 3D space.
subclass of: http://lodlaundromat.org/.well-known/genid/42cfc11f96a345388c7f4bc5aaadec29#16
subclass of: Region
subclass of: Abstract
subclass of: Entity

recommended Property
type: Property
type: AnnotationProperty
comment: Used to link a class to a set of properties that might often be used on instances of the class. Used especially when the properties have an open domain and/or reside in an external namespace to show expected usage patterns that are not obvious from the pure axiom structured on the ontology.

Perdurant
subclass of: Resource
subclass of: Thing
type: Class
linked concept: perdurant
comment: Perdurants (AKA occurrences) comprise what are variously called events, processes, phenomena, activities and states. They can have temporal parts or spatial parts. For instance, the first movement of (an execution of) a symphony is a temporal part of the symphony. On the other hand, the play performed by the left side of the orchestra is a spatial part. In both cases, these parts are occurrences themselves. We assume that objects cannot be parts of occurrences, but rather they participate in them. Philosophers say that endurants are entities that are in time, while lacking temporal parts (so to speak, all their parts flow with them in time). Perdurants, on the contrary, are entities that happen in time, and can have temporal parts (all their parts are fixed in time).
subclass of: Entity
disjoint with: Endurant

intervalEquals
range: Thing
domain: Thing
linked concept: intervalEquals
type: ObjectProperty
comment: Indicates that the two time intervals are the same (same beginning and ending).
domain: Time interval
range: Time interval
type: Property
range: Resource
range: Abstract
range: Entity
range: http://lodlaundromat.org/.well-known/genid/42cfc11f96a345388c7f4bc5aaadec29#15
range: Region
range: Temporal region
domain: Resource
domain: Region
domain: Entity
domain: Temporal region
domain: Abstract
domain: http://lodlaundromat.org/.well-known/genid/42cfc11f96a345388c7f4bc5aaadec29#15

Function of time (integer)
subclass of: Resource
subclass of: Thing
type: Class
comment: Represents an integer-valued function of time
subclass of: http://lodlaundromat.org/.well-known/genid/42cfc11f96a345388c7f4bc5aaadec29#12
subclass of: Function of time

Process
subclass of: Resource
subclass of: Thing
type: Class
linked concept: process
comment: We split perdurants into just events and processes according to atomicity. A process has some substructure to it, it extends over time and might have discrete or continuous phases, whereas as an event has no interesting substructure. This division is relative to a given viewpoint. For example a meeting could be modelled as a process if one is recording different stages of a meeting with time ordering or might be a simple event. The two viewpoints are not regarded as disjoint.
subclass of: Perdurant
subclass of: Entity

participates in
range: Thing
domain: Thing
linked concept: participant-in
type: ObjectProperty
comment: General relationship between things (Endurants) and the processes (Perdurants) in which they might particpate. For example, links a person to their life history or an actor to a business process.
domain: Endurant
range: Perdurant
inverse of: participant
type: Property
range: Resource
range: Entity
domain: Resource
domain: Entity

responsible participant
range: Thing
domain: Thing
type: ObjectProperty
comment: A person (or other agent) responsible for a particular event or process like a meeting or project.
range: Agent
sub property of: participant
type: Property
range: Endurant
range: Resource
range: Entity
domain: Perdurant
domain: Resource
domain: Entity
range: Object
range: http://lodlaundromat.org/.well-known/genid/42cfc11f96a345388c7f4bc5aaadec29#1
range: http://lodlaundromat.org/.well-known/genid/42cfc11f96a345388c7f4bc5aaadec29#2

Project
subclass of: Resource
subclass of: Thing
type: Class
linked concept: Project
comment: A project or collective endeavour of some kind. Typically a project has a definite inception, set of goals and conclusion.
subclass of: http://lodlaundromat.org/.well-known/genid/42cfc11f96a345388c7f4bc5aaadec29#4
subclass of: Process
subclass of: http://lodlaundromat.org/.well-known/genid/42cfc11f96a345388c7f4bc5aaadec29#5
subclass of: Perdurant
subclass of: Entity

datum
range: Thing
domain: Thing
type: ObjectProperty
comment: links a function of time to a particular timestamped value
domain: Function of time
range: Datum
type: Property
range: Resource
domain: Resource

linked concept
type: Property
type: AnnotationProperty
comment: Used to link related concepts across ontologies. In many cases if an application can commit to both source and target ontologies then the linkedConcept relation can be treated as owl:equivalentClass or owl:equivalentProperty. However, in some cases we may not be able to commit to all of the axioms in the linked ontology, for example it might assert two concepts as disjoin where we allow a single entity to be simultaneously regarded from the perspective of both concepts. SHOULD only be used when the concepts are near equivalents, not as a shorthand for "vaguely related somehow".

Object
subclass of: Thing
subclass of: Resource
type: Class
linked concept: physical-object
comment: Physical objects. Endurants with unity and some independent existence.
subclass of: http://lodlaundromat.org/.well-known/genid/42cfc11f96a345388c7f4bc5aaadec29#2
subclass of: Endurant
disjoint with: Amount of matter
disjoint with: Object feature
subclass of: http://lodlaundromat.org/.well-known/genid/42cfc11f96a345388c7f4bc5aaadec29#1
subclass of: Entity

Function of time
subclass of: Thing
subclass of: Resource
type: Class
comment: Represents an integer-valued function of time

http://lodlaundromat.org/.well-known/genid/42cfc11f96a345388c7f4bc5aaadec29#11
type: Class
subclass of: Thing
subclass of: Resource
type: Restriction
cardinality: 1
on property: weight

Meeting
subclass of: Resource
subclass of: Thing
type: Class
linked concept: Meeting
comment: Any sort of formal or semi-formal meeting such as a business meeting.
subclass of: http://lodlaundromat.org/.well-known/genid/42cfc11f96a345388c7f4bc5aaadec29#5
subclass of: Event
subclass of: http://lodlaundromat.org/.well-known/genid/42cfc11f96a345388c7f4bc5aaadec29#4
subclass of: Perdurant
subclass of: Entity

Region
subclass of: Resource
subclass of: Thing
type: Class
linked concept: region
comment: A region of some measurement space such as a time interval, spatial region or colour space.
subclass of: Abstract
subclass of: Entity

Entity
subclass of: Thing
subclass of: Resource
type: Class
linked concept: particular
comment: Root of the foundational ontology. Includes objects, processes and abstractions.

contact person
range: Thing
domain: Thing
type: ObjectProperty
comment: Person (or other agent) who can act as a contact point for some activity or product.
range: Agent
type: Property
range: Entity
range: Object
range: Resource
range: Endurant
range: http://lodlaundromat.org/.well-known/genid/42cfc11f96a345388c7f4bc5aaadec29#1
range: http://lodlaundromat.org/.well-known/genid/42cfc11f96a345388c7f4bc5aaadec29#2
domain: Resource

Geographic Location
subclass of: Resource
subclass of: Thing
type: Class
disjoint with: Information resource
disjoint with: Agent
linked concept: Location
comment: A geospatial location, encompasses locations with extent (e.g. countries) as well as features which can be treated as point-like for some purposes (e.g. a bridge or road junction). Normally designated by a Geonames URI.
linked concept: place
disjoint with: ProductInstance
subclass of: Object
linked concept: GeographicArea
subclass of: Endurant
subclass of: http://lodlaundromat.org/.well-known/genid/42cfc11f96a345388c7f4bc5aaadec29#2
subclass of: http://lodlaundromat.org/.well-known/genid/42cfc11f96a345388c7f4bc5aaadec29#1
subclass of: Entity

intervalMeets
range: Thing
domain: Thing
linked concept: intervalMeets
type: ObjectProperty
comment: Indicates that one time interval (the subject) meets the other (object) time interval, i.e. it ends as the object interval begins.
domain: Time interval
range: Time interval
type: Property
range: Resource
range: Abstract
range: Entity
range: http://lodlaundromat.org/.well-known/genid/42cfc11f96a345388c7f4bc5aaadec29#15
range: Region
range: Temporal region
domain: Resource
domain: Region
domain: Entity
domain: Temporal region
domain: Abstract
domain: http://lodlaundromat.org/.well-known/genid/42cfc11f96a345388c7f4bc5aaadec29#15

Endurant
subclass of: Resource
subclass of: Thing
type: Class
linked concept: endurant
comment: Endurants exists in time, values of some properties might different over time but the Endurant has a constant identity. Endurants can participate in processes. Philosophically speaking they are independent essential wholes.
subclass of: Entity
disjoint with: Perdurant

member of
range: Thing
domain: Thing
type: ObjectProperty
comment: Indicates that an agent is a member of some group, for example a person being a member of an organization like a Corporation.
domain: Agent
range: Group
type: Property
range: Resource
range: Object
range: Entity
range: Endurant
range: http://lodlaundromat.org/.well-known/genid/42cfc11f96a345388c7f4bc5aaadec29#1
range: http://lodlaundromat.org/.well-known/genid/42cfc11f96a345388c7f4bc5aaadec29#2
range: Agent
domain: http://lodlaundromat.org/.well-known/genid/42cfc11f96a345388c7f4bc5aaadec29#2
domain: Object
domain: Resource
domain: http://lodlaundromat.org/.well-known/genid/42cfc11f96a345388c7f4bc5aaadec29#1
domain: Entity
domain: Endurant

at date
type: DatatypeProperty
comment: gives the time point of a datum in a time-valued function, to a resolution of 1 day
domain: Datum
range: date
type: Property
range: Resource
domain: Resource
domain: Thing

has argument
type: Property
comment: Links a reified n-ary relationship to one of its arguments. Subproperties of this can be used to indicate specific roles in the n-ary realtionship.
domain: N-ary relation
domain: Abstract
domain: Resource
domain: Thing
domain: Entity
domain: Relation

weight
type: Property
comment: Gives the probability or other weighted associated with a weighted attribute or relation.
domain: Weighted relation
range: float
sub property of: has argument
domain: N-ary relation
domain: Thing
domain: Resource
domain: Relation
domain: Abstract
domain: Entity
range: Resource
domain: http://lodlaundromat.org/.well-known/genid/42cfc11f96a345388c7f4bc5aaadec29#11

has ending
type: DatatypeProperty
type: FunctionalProperty
comment: The end of a time interval or the time value of a time instant. Optional (since the interval may be unbounded) but unique.
domain: Temporal region
range: dateTime
type: Property
range: Resource
domain: Thing
domain: Region
domain: Resource
domain: Entity
domain: Abstract
domain: http://lodlaundromat.org/.well-known/genid/42cfc11f96a345388c7f4bc5aaadec29#15

literal value
type: DatatypeProperty
comment: Gives an data valued argument for an n-ary relationship, such as a weighted relation.
domain: N-ary relation
sub property of: has argument
type: Property
domain: Thing
domain: Resource
domain: Relation
domain: Abstract
domain: Entity

at time
type: DatatypeProperty
comment: gives the time point of a datum in a time-valued function
domain: Datum
range: dateTime
type: Property
range: Resource
domain: Resource
domain: Thing

has beginning
type: DatatypeProperty
type: FunctionalProperty
comment: The beginning of a time interval or the time value of a time instant. Optional (since the interval may be unbounded) but unique.
domain: Temporal region
range: dateTime
type: Property
range: Resource
domain: Thing
domain: Region
domain: Resource
domain: Entity
domain: Abstract
domain: http://lodlaundromat.org/.well-known/genid/42cfc11f96a345388c7f4bc5aaadec29#15

Foundation
type: Ontology
comment: An example foundation ontology developed to accompany the experimental EDUBase dataset. Based on Dolce-lite. Utilizes SKOS, SKOS-XL and Dublin Core Elements. Cross links to FRBR ontology, FOAF, DOLCE-lite and Proton.
imports: http://purl.org/dc/elements/1.1/
imports: skos-xl
imports: skos

acronym
type: DatatypeProperty
comment: A special case of an alternate label where the label is an acronym for the preffered (or maybe an alt) label.
sub property of: altLabel
type: Property

in context
type: Property
comment: Gives the context of a qualified relationship, e.g. the TimeInterval during which a binary property value is valid.
domain: Qualified binary relation
domain: Thing
domain: Resource
domain: Entity
domain: Abstract
domain: Relation
domain: N-ary relation

value
type: DatatypeProperty
comment: gives the value of a datum
domain: Datum
type: Property
domain: Resource
domain: Thing