Function of time
subclass of: Resource
subclass of: Thing
type: Class
comment: Represents an integer-valued function of time

occurs at
range: Thing
domain: Thing
type: ObjectProperty
comment: The location at which an event or process takes place.
domain: Perdurant
range: Geographic Location
type: Property
domain: Resource
domain: Entity
range: Resource
range: http://lodlaundromat.org/.well-known/genid/42cfc11f96a345388c7f4bc5aaadec29#2
range: http://lodlaundromat.org/.well-known/genid/42cfc11f96a345388c7f4bc5aaadec29#1
range: Entity
range: Endurant
range: Object

has narrower transitive
range: Thing
domain: Thing
definition: skos:narrowerTransitive is a transitive superproperty of skos:narrower.
scope note: By convention, skos:narrowerTransitive is not used to make assertions. Rather, the properties can be used to draw inferences about the transitive closure of the hierarchical relation, which is useful e.g. when implementing a simple query expansion algorithm in a search application.
type: ObjectProperty
sub property of: is in semantic relation with
type: TransitiveProperty
inverse of: has broader transitive
type: Property
note: skos:narrowerTransitive is a transitive superproperty of skos:narrower.
note: By convention, skos:narrowerTransitive is not used to make assertions. Rather, the properties can be used to draw inferences about the transitive closure of the hierarchical relation, which is useful e.g. when implementing a simple query expansion algorithm in a search application.
domain: Concept
domain: Resource
domain: http://lodlaundromat.org/.well-known/genid/d8234c3b1439a879aea940e9009663be#1
range: Concept
range: Resource
range: http://lodlaundromat.org/.well-known/genid/d8234c3b1439a879aea940e9009663be#1

member
range: Thing
domain: Thing
type: ObjectProperty
change note: Initial description.
domain: Collection
definition: A member of a collection.
issued: 2008-05-xx
note: Initial description.
type: Thing
note: A member of a collection.
type: Property
domain: Entity
domain: Abstract
domain: Resource
range: Resource

semantic relation
range: Thing
domain: Thing
type: ObjectProperty
change note: Initial description.
domain: Concept
comment: This property should not be used directly, but as a super-property for all properties denoting a relationship of meaning between concepts.
range: Concept
definition: A concept related by meaning.
issued: 2008-05-xx
note: Initial description.
type: Thing
note: A concept related by meaning.
type: Property
domain: Resource
domain: Entity
domain: Abstract
range: Resource
range: Abstract
range: Entity

Document
subclass of: Thing
subclass of: Resource
type: Class
linked concept: Document
comment: A document, does not distinguish electronic and physical copies. Not limited to text documents.
subclass of: Information resource
subclass of: http://lodlaundromat.org/.well-known/genid/42cfc11f96a345388c7f4bc5aaadec29#7
subclass of: http://lodlaundromat.org/.well-known/genid/42cfc11f96a345388c7f4bc5aaadec29#6
subclass of: http://lodlaundromat.org/.well-known/genid/42cfc11f96a345388c7f4bc5aaadec29#8
subclass of: http://lodlaundromat.org/.well-known/genid/42cfc11f96a345388c7f4bc5aaadec29#9
subclass of: http://lodlaundromat.org/.well-known/genid/42cfc11f96a345388c7f4bc5aaadec29#10
subclass of: http://lodlaundromat.org/.well-known/genid/42cfc11f96a345388c7f4bc5aaadec29#1
subclass of: http://lodlaundromat.org/.well-known/genid/42cfc11f96a345388c7f4bc5aaadec29#2
subclass of: Object
subclass of: Endurant
subclass of: Entity

N-ary relation
subclass of: Thing
subclass of: Resource
type: Class
comment: Superclass of all types of reified n-ary relations. Instances link to the participating objects via hasArgument properties.
subclass of: Relation
subclass of: Abstract
subclass of: Entity

Datum (integer)
subclass of: Resource
subclass of: Thing
type: Class
comment: A single (integer) value in a function (typically of time)
subclass of: http://lodlaundromat.org/.well-known/genid/42cfc11f96a345388c7f4bc5aaadec29#13
subclass of: Datum

after
range: Thing
domain: Thing
type: ObjectProperty
comment: Indicates that one interval (the subject) starts after another (the object) ends.
domain: Temporal region
range: Temporal region
type: Property
domain: Resource
domain: http://lodlaundromat.org/.well-known/genid/42cfc11f96a345388c7f4bc5aaadec29#15
domain: Entity
domain: Abstract
domain: Region
range: http://lodlaundromat.org/.well-known/genid/42cfc11f96a345388c7f4bc5aaadec29#15
range: Resource
range: Abstract
range: Entity
range: Region

narrower match
sub property of: semantic relation
sub property of: narrower transitive
range: Thing
domain: Thing
type: ObjectProperty
sub property of: mapping relation
sub property of: has narrower
inverse of: broader match
issued: 2008-05-xx
change note: Initial description.
definition: skos:narrowMatch is used to state a hierarchical mapping link between two conceptual resources in different concept schemes.
note: Initial description.
type: Thing
note: skos:narrowMatch is used to state a hierarchical mapping link between two conceptual resources in different concept schemes.
type: Property
domain: Concept
domain: Resource
domain: Abstract
domain: Entity
range: Concept
range: Resource
range: Abstract
range: Entity

Datum
subclass of: Thing
subclass of: Resource
type: Class
comment: A single value in a function (typically of time)

intervalEquals
range: Thing
domain: Thing
linked concept: intervalEquals
type: ObjectProperty
comment: Indicates that the two time intervals are the same (same beginning and ending).
domain: Time interval
range: Time interval
type: Property
domain: Resource
domain: Entity
domain: Abstract
domain: Region
domain: Temporal region
domain: http://lodlaundromat.org/.well-known/genid/42cfc11f96a345388c7f4bc5aaadec29#15
range: http://lodlaundromat.org/.well-known/genid/42cfc11f96a345388c7f4bc5aaadec29#15
range: Resource
range: Abstract
range: Entity
range: Temporal region
range: Region

is in mapping relation with
range: Thing
domain: Thing
definition: Relates two concepts coming, by convention, from different schemes, and that have comparable meanings
comment: These concept mapping relations mirror semantic relations, and the data model defined below is similar (with the exception of skos:exactMatch) to the data model defined for semantic relations. A distinct vocabulary is provided for concept mapping relations, to provide a convenient way to differentiate links within a concept scheme from links between concept schemes. However, this pattern of usage is not a formal requirement of the SKOS data model, and relies on informal definitions of best practice.
type: ObjectProperty
sub property of: is in semantic relation with
type: Property
note: Relates two concepts coming, by convention, from different schemes, and that have comparable meanings
domain: Concept
domain: Resource
domain: http://lodlaundromat.org/.well-known/genid/d8234c3b1439a879aea940e9009663be#1
range: Concept
range: Resource
range: http://lodlaundromat.org/.well-known/genid/d8234c3b1439a879aea940e9009663be#1

Qualified binary relation
subclass of: Resource
subclass of: Thing
type: Class
comment: A relation which would normally be regard as binary (e.g. memberOf, hasColour) but where the value is dependent upon some context like time. We model this as an n-ary relation where the qualifying context is given by the value of the 'inContext' property and the qualified value is given by the unique 'hasArgument' value.
subclass of: N-ary relation
subclass of: Abstract
subclass of: Entity
subclass of: Relation

definitive source
range: Thing
domain: Thing
type: ObjectProperty
comment: Indicates the definitive source from which this resource was, or could be, obtained.
sub property of: has source
type: Property
domain: Information resource
domain: Resource
domain: http://lodlaundromat.org/.well-known/genid/42cfc11f96a345388c7f4bc5aaadec29#6
domain: Object
domain: http://lodlaundromat.org/.well-known/genid/42cfc11f96a345388c7f4bc5aaadec29#8
domain: http://lodlaundromat.org/.well-known/genid/42cfc11f96a345388c7f4bc5aaadec29#7
domain: http://lodlaundromat.org/.well-known/genid/42cfc11f96a345388c7f4bc5aaadec29#10
domain: http://lodlaundromat.org/.well-known/genid/42cfc11f96a345388c7f4bc5aaadec29#9
domain: http://lodlaundromat.org/.well-known/genid/42cfc11f96a345388c7f4bc5aaadec29#1
domain: http://lodlaundromat.org/.well-known/genid/42cfc11f96a345388c7f4bc5aaadec29#2
domain: Endurant
domain: Entity
range: Information source
range: Resource
range: Information resource
range: http://lodlaundromat.org/.well-known/genid/42cfc11f96a345388c7f4bc5aaadec29#10
range: http://lodlaundromat.org/.well-known/genid/42cfc11f96a345388c7f4bc5aaadec29#2
range: http://lodlaundromat.org/.well-known/genid/42cfc11f96a345388c7f4bc5aaadec29#1
range: http://lodlaundromat.org/.well-known/genid/42cfc11f96a345388c7f4bc5aaadec29#6
range: http://lodlaundromat.org/.well-known/genid/42cfc11f96a345388c7f4bc5aaadec29#7
range: http://lodlaundromat.org/.well-known/genid/42cfc11f96a345388c7f4bc5aaadec29#9
range: http://lodlaundromat.org/.well-known/genid/42cfc11f96a345388c7f4bc5aaadec29#8
range: Object
range: Endurant
range: Entity

has broader
sub property of: is in semantic relation with
range: Thing
domain: Thing
definition: Relates a concept to a concept that is more general in meaning.
comment: Broader concepts are typically rendered as parents in a concept hierarchy (tree).
scope note: By convention, skos:broader is only used to assert an immediate (i.e. direct) hierarchical link between two conceptual resources.
type: ObjectProperty
sub property of: has broader transitive
inverse of: has narrower
type: Property
note: Relates a concept to a concept that is more general in meaning.
note: By convention, skos:broader is only used to assert an immediate (i.e. direct) hierarchical link between two conceptual resources.
domain: Concept
domain: Resource
domain: http://lodlaundromat.org/.well-known/genid/d8234c3b1439a879aea940e9009663be#1
range: Concept
range: Resource
range: http://lodlaundromat.org/.well-known/genid/d8234c3b1439a879aea940e9009663be#1

has member
range: Thing
domain: Thing
definition: Relates a collection to one of its members.
type: ObjectProperty
domain: Collection
range: http://lodlaundromat.org/.well-known/genid/d8234c3b1439a879aea940e9009663be#1
type: Property
note: Relates a collection to one of its members.
domain: Resource
domain: http://lodlaundromat.org/.well-known/genid/d8234c3b1439a879aea940e9009663be#1
range: Resource

Region
subclass of: Resource
subclass of: Thing
type: Class
linked concept: region
comment: A region of some measurement space such as a time interval, spatial region or colour space.
subclass of: Abstract
subclass of: Entity

Concept Scheme
subclass of: Thing
subclass of: Resource
type: Class
definition: A set of concepts, optionally including statements about semantic relationships between those concepts.
scope note: A concept scheme may be defined to include concepts from different sources.
example: Thesauri, classification schemes, subject heading lists, taxonomies, 'folksonomies', and other types of controlled vocabulary are all examples of concept schemes. Concept schemes are also embedded in glossaries and terminologies.
disjoint with: Concept
note: A set of concepts, optionally including statements about semantic relationships between those concepts.
note: A concept scheme may be defined to include concepts from different sources.
note: Thesauri, classification schemes, subject heading lists, taxonomies, 'folksonomies', and other types of controlled vocabulary are all examples of concept schemes. Concept schemes are also embedded in glossaries and terminologies.
disjoint with: Label
disjoint with: Collection

before
range: Thing
domain: Thing
type: ObjectProperty
comment: Indicates that one interval (the subject) ends before another (the object) begins.
domain: Temporal region
range: Temporal region
type: Property
domain: Resource
domain: http://lodlaundromat.org/.well-known/genid/42cfc11f96a345388c7f4bc5aaadec29#15
domain: Entity
domain: Abstract
domain: Region
range: http://lodlaundromat.org/.well-known/genid/42cfc11f96a345388c7f4bc5aaadec29#15
range: Resource
range: Abstract
range: Entity
range: Region

has top concept
range: Thing
domain: Thing
definition: Relates, by convention, a concept scheme to a concept which is topmost in the broader/narrower concept hierarchies for that scheme, providing an entry point to these hierarchies.
type: ObjectProperty
domain: Concept Scheme
range: Concept
inverse of: is top concept in scheme
type: Property
note: Relates, by convention, a concept scheme to a concept which is topmost in the broader/narrower concept hierarchies for that scheme, providing an entry point to these hierarchies.
domain: Resource
range: Resource
range: http://lodlaundromat.org/.well-known/genid/d8234c3b1439a879aea940e9009663be#1

Man
subclass of: Resource
subclass of: Thing
type: Class
linked concept: Man
comment: Class of male persons.
subclass of: Person
subclass of: Agent
subclass of: http://lodlaundromat.org/.well-known/genid/42cfc11f96a345388c7f4bc5aaadec29#2
subclass of: http://lodlaundromat.org/.well-known/genid/42cfc11f96a345388c7f4bc5aaadec29#1
subclass of: Endurant
subclass of: Entity
subclass of: Object

example
range: Thing
domain: Thing
type: ObjectProperty
change note: Initial description.
sub property of: note
definition: An example of the use of a concept.
issued: 2008-05-xx
note: Initial description.
type: Thing
note: An example of the use of a concept.
type: Property
domain: Resource
range: Resource

has broader match
sub property of: is in semantic relation with
sub property of: has broader transitive
range: Thing
domain: Thing
definition: skos:broadMatch is used to state a hierarchical mapping link between two conceptual resources in different concept schemes.
type: ObjectProperty
sub property of: is in mapping relation with
sub property of: has broader
inverse of: has narrower match
type: Property
note: skos:broadMatch is used to state a hierarchical mapping link between two conceptual resources in different concept schemes.
domain: Concept
domain: Resource
domain: http://lodlaundromat.org/.well-known/genid/d8234c3b1439a879aea940e9009663be#1
range: Concept
range: Resource
range: http://lodlaundromat.org/.well-known/genid/d8234c3b1439a879aea940e9009663be#1

contact details
range: Thing
domain: Thing
type: ObjectProperty
domain: Agent
range: VCard
type: Property
domain: Resource
domain: Endurant
domain: http://lodlaundromat.org/.well-known/genid/42cfc11f96a345388c7f4bc5aaadec29#2
domain: Object
domain: http://lodlaundromat.org/.well-known/genid/42cfc11f96a345388c7f4bc5aaadec29#1
domain: Entity
range: Resource

Group
subclass of: Thing
subclass of: Resource
type: Class
linked concept: Group
comment: A Collection of Agents, e.g. a flock of sheep, a herd of goats, or the local Boy Scout troop.
subclass of: Agent
disjoint with: Person
subclass of: http://lodlaundromat.org/.well-known/genid/42cfc11f96a345388c7f4bc5aaadec29#1
subclass of: http://lodlaundromat.org/.well-known/genid/42cfc11f96a345388c7f4bc5aaadec29#2
subclass of: Entity
subclass of: Endurant
subclass of: Object

has related
range: Thing
domain: Thing
definition: Relates a concept to a concept with which there is an associative semantic relationship.
type: ObjectProperty
sub property of: is in semantic relation with
type: SymmetricProperty
comment: skos:related is disjoint with skos:broaderTransitive
type: Property
note: Relates a concept to a concept with which there is an associative semantic relationship.
domain: Concept
domain: Resource
domain: http://lodlaundromat.org/.well-known/genid/d8234c3b1439a879aea940e9009663be#1
range: Concept
range: Resource
range: http://lodlaundromat.org/.well-known/genid/d8234c3b1439a879aea940e9009663be#1

Perdurant
subclass of: Thing
subclass of: Resource
type: Class
linked concept: perdurant
comment: Perdurants (AKA occurrences) comprise what are variously called events, processes, phenomena, activities and states. They can have temporal parts or spatial parts. For instance, the first movement of (an execution of) a symphony is a temporal part of the symphony. On the other hand, the play performed by the left side of the orchestra is a spatial part. In both cases, these parts are occurrences themselves. We assume that objects cannot be parts of occurrences, but rather they participate in them. Philosophers say that endurants are entities that are in time, while lacking temporal parts (so to speak, all their parts flow with them in time). Perdurants, on the contrary, are entities that happen in time, and can have temporal parts (all their parts are fixed in time).
subclass of: Entity
disjoint with: Endurant

Amount of matter
subclass of: Resource
subclass of: Thing
type: Class
linked concept: amount-of-matter
comment: Things like "water", "clay" which have no unity (the combination of two amounts of clay is just a single amount of clay), aka "stuff".
subclass of: http://lodlaundromat.org/.well-known/genid/42cfc11f96a345388c7f4bc5aaadec29#3
subclass of: Endurant
disjoint with: Object
disjoint with: Object feature
subclass of: Entity

has top concept
range: Thing
domain: Thing
type: ObjectProperty
change note: Initial description.
domain: Concept Scheme
range: Concept
inverse of: top concept in scheme
definition: A top level concept in the concept scheme.
issued: 2008-05-xx
note: Initial description.
type: Thing
note: A top level concept in the concept scheme.
type: Property
domain: Resource
domain: Entity
domain: Abstract
range: Resource
range: Abstract
range: Entity

Process
subclass of: Resource
subclass of: Thing
type: Class
linked concept: process
comment: We split perdurants into just events and processes according to atomicity. A process has some substructure to it, it extends over time and might have discrete or continuous phases, whereas as an event has no interesting substructure. This division is relative to a given viewpoint. For example a meeting could be modelled as a process if one is recording different stages of a meeting with time ordering or might be a simple event. The two viewpoints are not regarded as disjoint.
subclass of: Perdurant
subclass of: Entity

Concept
subclass of: http://lodlaundromat.org/.well-known/genid/d8234c3b1439a879aea940e9009663be#1
subclass of: Thing
subclass of: Resource
type: Class
definition: An idea or notion; a unit of thought.
note: An idea or notion; a unit of thought.
disjoint with: Collection
disjoint with: Concept Scheme
disjoint with: Label

Information source
subclass of: Resource
type: Class
subclass of: Thing
comment: A storage system, content management system, or other source from which information resources like Documents can be obtained. The aggregate can itself be regarded as an InformationResource though metadata on the InformationSource should be used to describe the name and authorship of the source rather of the union of the contained resources.
subclass of: Information resource
subclass of: http://lodlaundromat.org/.well-known/genid/42cfc11f96a345388c7f4bc5aaadec29#10
subclass of: http://lodlaundromat.org/.well-known/genid/42cfc11f96a345388c7f4bc5aaadec29#2
subclass of: http://lodlaundromat.org/.well-known/genid/42cfc11f96a345388c7f4bc5aaadec29#1
subclass of: http://lodlaundromat.org/.well-known/genid/42cfc11f96a345388c7f4bc5aaadec29#6
subclass of: http://lodlaundromat.org/.well-known/genid/42cfc11f96a345388c7f4bc5aaadec29#7
subclass of: http://lodlaundromat.org/.well-known/genid/42cfc11f96a345388c7f4bc5aaadec29#9
subclass of: http://lodlaundromat.org/.well-known/genid/42cfc11f96a345388c7f4bc5aaadec29#8
subclass of: Object
subclass of: Endurant
subclass of: Entity

Organization
subclass of: Resource
subclass of: Thing
type: Class
linked concept: Organization
comment: An Organization is a corporate or similar institution. The members of an Organization typically have a common purpose or function. Note that this class also covers divisions, departments, etc. of organizations. For example, both the Shell Corporation and the accounting department at Shell would both be instances of Organization.
subclass of: Group
subclass of: http://lodlaundromat.org/.well-known/genid/42cfc11f96a345388c7f4bc5aaadec29#2
subclass of: http://lodlaundromat.org/.well-known/genid/42cfc11f96a345388c7f4bc5aaadec29#1
subclass of: Agent
subclass of: Object
subclass of: Entity
subclass of: Endurant

Ordered Collection
subclass of: Resource
subclass of: Thing
type: Class
change note: Initial description.
comment: Ordered collections can be used with collectable semantic relation properties, where you would like a set of concepts to be displayed in a specific order, and optionally under a 'node label'.
subclass of: Collection
definition: An ordered collection of concepts, where both the grouping and the ordering are meaningful.
issued: 2008-05-xx
note: Initial description.
type: Thing
note: An ordered collection of concepts, where both the grouping and the ordering are meaningful.
subclass of: Entity
subclass of: Abstract

has broader transitive
range: Thing
domain: Thing
definition: skos:broaderTransitive is a transitive superproperty of skos:broader.
scope note: By convention, skos:broaderTransitive is not used to make assertions. Rather, the properties can be used to draw inferences about the transitive closure of the hierarchical relation, which is useful e.g. when implementing a simple query expansion algorithm in a search application.
type: ObjectProperty
sub property of: is in semantic relation with
type: TransitiveProperty
inverse of: has narrower transitive
type: Property
note: skos:broaderTransitive is a transitive superproperty of skos:broader.
note: By convention, skos:broaderTransitive is not used to make assertions. Rather, the properties can be used to draw inferences about the transitive closure of the hierarchical relation, which is useful e.g. when implementing a simple query expansion algorithm in a search application.
domain: Concept
domain: Resource
domain: http://lodlaundromat.org/.well-known/genid/d8234c3b1439a879aea940e9009663be#1
range: Concept
range: Resource
range: http://lodlaundromat.org/.well-known/genid/d8234c3b1439a879aea940e9009663be#1

preferred label
range: Thing
domain: Thing
definition: The property skosxl:prefLabel is used to associate an skosxl:Label with a skos:Concept. The property is analogous to skos:prefLabel.
type: ObjectProperty
range: Label
comment: If C skosxl:prefLabel L and L skosxl:literalForm V, then X skos:prefLabel V.
type: Property
note: The property skosxl:prefLabel is used to associate an skosxl:Label with a skos:Concept. The property is analogous to skos:prefLabel.
domain: Resource
range: Resource
range: http://lodlaundromat.org/.well-known/genid/6cf636276d4078b836ac19854e682ea2#1

history note
range: Thing
domain: Thing
type: ObjectProperty
change note: Initial description.
sub property of: note
definition: A note about the past state/use/meaning of a concept.
issued: 2008-05-xx
note: Initial description.
type: Thing
note: A note about the past state/use/meaning of a concept.
type: Property
domain: Resource
range: Resource

intervalMeets
range: Thing
domain: Thing
linked concept: intervalMeets
type: ObjectProperty
comment: Indicates that one time interval (the subject) meets the other (object) time interval, i.e. it ends as the object interval begins.
domain: Time interval
range: Time interval
type: Property
domain: Resource
domain: Entity
domain: Abstract
domain: Region
domain: Temporal region
domain: http://lodlaundromat.org/.well-known/genid/42cfc11f96a345388c7f4bc5aaadec29#15
range: http://lodlaundromat.org/.well-known/genid/42cfc11f96a345388c7f4bc5aaadec29#15
range: Resource
range: Abstract
range: Entity
range: Temporal region
range: Region

note
range: Thing
domain: Thing
type: ObjectProperty
change note: Initial description.
comment: This property may be used directly, or as a super-property for more specific note types.
definition: A general note, for any purpose.
issued: 2008-05-xx
note: Initial description.
type: Thing
note: A general note, for any purpose.
type: Property
domain: Resource
range: Resource

Event
subclass of: Resource
subclass of: Thing
type: Class
linked concept: Event
linked concept: event
comment: We split perdurants into just events and processes according to atomicity. A process has some substructure to it, it extends over time and might have discrete or continuous phases, whereas as an event has no interesting substructure. This division is relative to a given viewpoint. For example a meeting could be modelled as a process if one is recording different stages of a meeting with time ordering or might be a simple event. The two viewpoints are not regarded as disjoint.
subclass of: Perdurant
subclass of: Entity

has narrower match
sub property of: has narrower transitive
range: Thing
domain: Thing
sub property of: is in semantic relation with
definition: skos:narrowMatch is used to state a hierarchical mapping link between two conceptual resources in different concept schemes.
type: ObjectProperty
sub property of: is in mapping relation with
sub property of: has narrower
inverse of: has broader match
type: Property
note: skos:narrowMatch is used to state a hierarchical mapping link between two conceptual resources in different concept schemes.
domain: Resource
domain: Concept
domain: http://lodlaundromat.org/.well-known/genid/d8234c3b1439a879aea940e9009663be#1
range: Resource
range: Concept
range: http://lodlaundromat.org/.well-known/genid/d8234c3b1439a879aea940e9009663be#1

child organization of
range: Thing
domain: Thing
linked concept: childOrganizationOf
type: ObjectProperty
comment: Indicates that some organization (such as a division) is part of some parent organization.
domain: Organization
range: Organization
sub property of: part of
type: Property
domain: Entity
domain: Resource
range: Entity
range: Resource
domain: Agent
domain: http://lodlaundromat.org/.well-known/genid/42cfc11f96a345388c7f4bc5aaadec29#1
domain: http://lodlaundromat.org/.well-known/genid/42cfc11f96a345388c7f4bc5aaadec29#2
domain: Endurant
domain: Object
domain: Group
range: Group
range: http://lodlaundromat.org/.well-known/genid/42cfc11f96a345388c7f4bc5aaadec29#2
range: http://lodlaundromat.org/.well-known/genid/42cfc11f96a345388c7f4bc5aaadec29#1
range: Endurant
range: Object
range: Agent

Object feature
subclass of: Resource
subclass of: Thing
type: Class
linked concept: feature
comment: Something which can't exist on its own but is a feature of some physical object, e.g. a bump, hole, region, spot.
subclass of: http://lodlaundromat.org/.well-known/genid/42cfc11f96a345388c7f4bc5aaadec29#1
subclass of: Endurant
disjoint with: Amount of matter
disjoint with: Object
subclass of: http://lodlaundromat.org/.well-known/genid/42cfc11f96a345388c7f4bc5aaadec29#2
subclass of: Entity

member list
range: Thing
domain: Thing
domain: Ordered Collection
issued: 2008-05-xx
comment: For any resource, every item in the list given as the value of the skos:memberList property is also a value of the skos:member property.
type: ObjectProperty
definition: An RDF list containing the members of an ordered collection.
range: List
type: FunctionalProperty
change note: Initial description.
note: Initial description.
type: Thing
note: An RDF list containing the members of an ordered collection.
type: Property
domain: Collection
domain: Entity
domain: Abstract
domain: Resource
range: Resource

is top concept in scheme
range: Thing
domain: Thing
definition: Relates a concept to the concept scheme that it is a top level concept of.
type: ObjectProperty
sub property of: is in scheme
inverse of: has top concept
type: Property
domain: Concept
range: Concept Scheme
note: Relates a concept to the concept scheme that it is a top level concept of.
domain: Resource
range: Resource
domain: http://lodlaundromat.org/.well-known/genid/d8234c3b1439a879aea940e9009663be#1

exact match
sub property of: mapping relation
range: Thing
domain: Thing
definition: skos:exactMatch is used to link two concepts, indicating a high degree of confidence that the concepts can be used interchangeably across a wide range of information retrieval applications. skos:exactMatch is a transitive property, and is a sub-property of skos:closeMatch.
change note: Initial description.
type: SymmetricProperty
type: TransitiveProperty
issued: 2008-05-xx
sub property of: exact match
comment: skos:exactMatch is disjoint with each of the properties skos:broadMatch and skos:relatedMatch.
type: ObjectProperty
note: Initial description.
type: Thing
note: skos:exactMatch is used to link two concepts, indicating a high degree of confidence that the concepts can be used interchangeably across a wide range of information retrieval applications. skos:exactMatch is a transitive property, and is a sub-property of skos:closeMatch.
type: Property
domain: Concept
domain: Resource
domain: Abstract
domain: Entity
range: Concept
range: Resource
range: Abstract
range: Entity

Corporation
subclass of: Resource
subclass of: Thing
type: Class
linked concept: BusinessEntity
linked concept: CorporateBody
linked concept: Corporation
comment: An Organization that has a special legal status that allows a group of persons to act as a CommercialAgent and that insulates the owners (shareholders) from many liabilities that might result from the corporation's operation.
subclass of: Organization
subclass of: http://lodlaundromat.org/.well-known/genid/42cfc11f96a345388c7f4bc5aaadec29#1
subclass of: http://lodlaundromat.org/.well-known/genid/42cfc11f96a345388c7f4bc5aaadec29#2
subclass of: Group
subclass of: Agent
subclass of: Endurant
subclass of: Entity
subclass of: Object

Geo Feature
subclass of: Thing
subclass of: Resource
type: Class
linked concept: Feature
comment: A geographical feature such as a river, mountain, including man made features such as cities and bridges. Ususally designated by a Geonames URI with associated descriptive information.
subclass of: Geographic Location
subclass of: http://lodlaundromat.org/.well-known/genid/42cfc11f96a345388c7f4bc5aaadec29#2
subclass of: http://lodlaundromat.org/.well-known/genid/42cfc11f96a345388c7f4bc5aaadec29#1
subclass of: Endurant
subclass of: Object
subclass of: Entity

related to
range: Thing
domain: Thing
type: ObjectProperty
change note: Initial description.
sub property of: semantic relation
type: SymmetricProperty
comment: skos:related is disjoint with skos:broaderTransitive
definition: A concept with which there is an associative semantic relationship.
issued: 2008-05-xx
note: Initial description.
type: Thing
note: A concept with which there is an associative semantic relationship.
type: Property
domain: Concept
domain: Resource
domain: Abstract
domain: Entity
range: Concept
range: Resource
range: Abstract
range: Entity

has source
range: Thing
domain: Thing
type: ObjectProperty
comment: Indicates an information source from which the subject resource could be obtained.
domain: Information resource
range: Information source
type: Property
domain: Resource
domain: Entity
domain: Endurant
domain: http://lodlaundromat.org/.well-known/genid/42cfc11f96a345388c7f4bc5aaadec29#7
domain: Object
domain: http://lodlaundromat.org/.well-known/genid/42cfc11f96a345388c7f4bc5aaadec29#2
domain: http://lodlaundromat.org/.well-known/genid/42cfc11f96a345388c7f4bc5aaadec29#9
domain: http://lodlaundromat.org/.well-known/genid/42cfc11f96a345388c7f4bc5aaadec29#10
domain: http://lodlaundromat.org/.well-known/genid/42cfc11f96a345388c7f4bc5aaadec29#1
domain: http://lodlaundromat.org/.well-known/genid/42cfc11f96a345388c7f4bc5aaadec29#6
domain: http://lodlaundromat.org/.well-known/genid/42cfc11f96a345388c7f4bc5aaadec29#8
range: Resource
range: http://lodlaundromat.org/.well-known/genid/42cfc11f96a345388c7f4bc5aaadec29#6
range: http://lodlaundromat.org/.well-known/genid/42cfc11f96a345388c7f4bc5aaadec29#10
range: http://lodlaundromat.org/.well-known/genid/42cfc11f96a345388c7f4bc5aaadec29#7
range: http://lodlaundromat.org/.well-known/genid/42cfc11f96a345388c7f4bc5aaadec29#2
range: Information resource
range: http://lodlaundromat.org/.well-known/genid/42cfc11f96a345388c7f4bc5aaadec29#1
range: Entity
range: http://lodlaundromat.org/.well-known/genid/42cfc11f96a345388c7f4bc5aaadec29#9
range: Endurant
range: Object
range: http://lodlaundromat.org/.well-known/genid/42cfc11f96a345388c7f4bc5aaadec29#8

has related match
range: Thing
domain: Thing
sub property of: is in semantic relation with
definition: skos:relatedMatch is used to state an associative mapping link between two conceptual resources in different concept schemes.
type: ObjectProperty
sub property of: is in mapping relation with
sub property of: has related
type: SymmetricProperty
type: Property
note: skos:relatedMatch is used to state an associative mapping link between two conceptual resources in different concept schemes.
domain: Concept
domain: Resource
domain: http://lodlaundromat.org/.well-known/genid/d8234c3b1439a879aea940e9009663be#1
range: Concept
range: Resource
range: http://lodlaundromat.org/.well-known/genid/d8234c3b1439a879aea940e9009663be#1

Woman
subclass of: Resource
subclass of: Thing
type: Class
linked concept: Woman
comment: Class of female persons.
subclass of: Person
subclass of: http://lodlaundromat.org/.well-known/genid/42cfc11f96a345388c7f4bc5aaadec29#2
subclass of: http://lodlaundromat.org/.well-known/genid/42cfc11f96a345388c7f4bc5aaadec29#1
subclass of: Agent
subclass of: Entity
subclass of: Endurant
subclass of: Object

responsible participant
range: Thing
domain: Thing
type: ObjectProperty
comment: A person (or other agent) responsible for a particular event or process like a meeting or project.
range: Agent
sub property of: participant
type: Property
domain: Perdurant
domain: Resource
domain: Entity
range: Endurant
range: Resource
range: Entity
range: http://lodlaundromat.org/.well-known/genid/42cfc11f96a345388c7f4bc5aaadec29#2
range: http://lodlaundromat.org/.well-known/genid/42cfc11f96a345388c7f4bc5aaadec29#1
range: Object

linked concept
type: Property
type: AnnotationProperty
comment: Used to link related concepts across ontologies. In many cases if an application can commit to both source and target ontologies then the linkedConcept relation can be treated as owl:equivalentClass or owl:equivalentProperty. However, in some cases we may not be able to commit to all of the axioms in the linked ontology, for example it might assert two concepts as disjoin where we allow a single entity to be simultaneously regarded from the perspective of both concepts. SHOULD only be used when the concepts are near equivalents, not as a shorthand for "vaguely related somehow".

contact person
range: Thing
domain: Thing
type: ObjectProperty
comment: Person (or other agent) who can act as a contact point for some activity or product.
range: Agent
type: Property
domain: Resource
range: Resource
range: http://lodlaundromat.org/.well-known/genid/42cfc11f96a345388c7f4bc5aaadec29#2
range: http://lodlaundromat.org/.well-known/genid/42cfc11f96a345388c7f4bc5aaadec29#1
range: Entity
range: Endurant
range: Object

narrower transitive
range: Thing
domain: Thing
definition: skos:narrowerTransitive is a transitive superproperty of skos:broader. By convention, skos:narrowerTransitive is not intended to be used in assertions, but provides a mechanism whereby the transitive closure of skos:narrower can be queried.
change note: Initial description.
issued: 2008-05-xx
inverse of: broader transitive
type: TransitiveProperty
comment: By convention, skos:narrowerTransitive is not used to make assertions. Rather, the properties can be used to draw inferences about the transitive closure of the hierarchical relation, which is useful e.g. when implementing a simple query expansion algorithm in a search application.
sub property of: semantic relation
type: ObjectProperty
note: Initial description.
type: Thing
note: skos:narrowerTransitive is a transitive superproperty of skos:broader. By convention, skos:narrowerTransitive is not intended to be used in assertions, but provides a mechanism whereby the transitive closure of skos:narrower can be queried.
type: Property
domain: Concept
domain: Resource
domain: Abstract
domain: Entity
range: Concept
range: Resource
range: Abstract
range: Entity

intervalDuring
range: Thing
domain: Thing
linked concept: intervalDuring
type: ObjectProperty
comment: Indicates that one time interval (the subject) occurs during the other (object) time interval, i.e. it begins after the object time interval has begun and ends before the object interval ends.
domain: Time interval
range: Time interval
type: Property
domain: Resource
domain: Entity
domain: Abstract
domain: Region
domain: Temporal region
domain: http://lodlaundromat.org/.well-known/genid/42cfc11f96a345388c7f4bc5aaadec29#15
range: http://lodlaundromat.org/.well-known/genid/42cfc11f96a345388c7f4bc5aaadec29#15
range: Resource
range: Abstract
range: Entity
range: Temporal region
range: Region

participates in
range: Thing
domain: Thing
linked concept: participant-in
type: ObjectProperty
comment: General relationship between things (Endurants) and the processes (Perdurants) in which they might particpate. For example, links a person to their life history or an actor to a business process.
domain: Endurant
range: Perdurant
inverse of: participant
type: Property
domain: Entity
domain: Resource
range: Resource
range: Entity

part of
range: Thing
domain: Thing
type: ObjectProperty
comment: General mereology relation of one thing being part of another.
domain: Entity
range: Entity
type: Property
domain: Resource
range: Resource

Label
subclass of: Thing
subclass of: Resource
type: Class
definition: A special class of lexical entities.
disjoint with: Concept
disjoint with: Collection
disjoint with: Concept Scheme
subclass of: http://lodlaundromat.org/.well-known/genid/6cf636276d4078b836ac19854e682ea2#1
note: A special class of lexical entities.

in scheme
range: Thing
domain: Thing
type: ObjectProperty
change note: Initial description.
comment: A concept may be a member of more than one concept scheme.
range: Concept Scheme
definition: A concept scheme in which the concept is included.
issued: 2008-05-xx
note: Initial description.
type: Thing
note: A concept scheme in which the concept is included.
type: Property
domain: Resource
range: Resource
range: Abstract
range: Entity

intevalOverlaps
range: Thing
domain: Thing
linked concept: intervalOverlaps
type: ObjectProperty
comment: Indicates that one time interval (the subject) overlaps the other (object) time interval, i.e. it begins before the object time interval has begun and ends during the object interval ends.
domain: Time interval
range: Time interval
type: Property
domain: Resource
domain: Entity
domain: Abstract
domain: Region
domain: Temporal region
domain: http://lodlaundromat.org/.well-known/genid/42cfc11f96a345388c7f4bc5aaadec29#15
range: http://lodlaundromat.org/.well-known/genid/42cfc11f96a345388c7f4bc5aaadec29#15
range: Resource
range: Abstract
range: Entity
range: Temporal region
range: Region

intervalStarts
range: Thing
domain: Thing
linked concept: intervalStarts
type: ObjectProperty
comment: Indicates that one time interval (the subject) starts the other (object) time interval, i.e. they start at the same time but it ends before the object interval ends.
domain: Time interval
range: Time interval
type: Property
domain: Resource
domain: Entity
domain: Abstract
domain: Region
domain: Temporal region
domain: http://lodlaundromat.org/.well-known/genid/42cfc11f96a345388c7f4bc5aaadec29#15
range: http://lodlaundromat.org/.well-known/genid/42cfc11f96a345388c7f4bc5aaadec29#15
range: Resource
range: Abstract
range: Entity
range: Temporal region
range: Region

exact match
range: Thing
domain: Thing
type: ObjectProperty
change note: Initial description.
sub property of: mapping relation
type: SymmetricProperty
definition: skos:closeMatch is used to link two concepts that are sufficiently similar that they can be used interchangeably in some information retrieval applications. In order to avoid the possibility of "compound errors" when combining mappings across more than two concept schemes, skos:closeMatch is not declared to be a transitive property.
issued: 2008-05-xx
note: Initial description.
type: Thing
note: skos:closeMatch is used to link two concepts that are sufficiently similar that they can be used interchangeably in some information retrieval applications. In order to avoid the possibility of "compound errors" when combining mappings across more than two concept schemes, skos:closeMatch is not declared to be a transitive property.
type: Property
domain: Concept
domain: Resource
domain: Abstract
domain: Entity
range: Concept
range: Resource
range: Abstract
range: Entity

Project
subclass of: Resource
subclass of: Thing
type: Class
linked concept: Project
comment: A project or collective endeavour of some kind. Typically a project has a definite inception, set of goals and conclusion.
subclass of: http://lodlaundromat.org/.well-known/genid/42cfc11f96a345388c7f4bc5aaadec29#4
subclass of: Process
subclass of: http://lodlaundromat.org/.well-known/genid/42cfc11f96a345388c7f4bc5aaadec29#5
subclass of: Entity
subclass of: Perdurant

Division
subclass of: Resource
subclass of: Thing
type: Class
linked concept: Division
comment: Branch, division, department, laboratory, etc. within an organisation. Usually, not an independent legal entity.
subclass of: Organization
subclass of: http://lodlaundromat.org/.well-known/genid/42cfc11f96a345388c7f4bc5aaadec29#2
subclass of: http://lodlaundromat.org/.well-known/genid/42cfc11f96a345388c7f4bc5aaadec29#1
subclass of: Group
subclass of: Endurant
subclass of: Entity
subclass of: Object
subclass of: Agent

Meeting
subclass of: Resource
subclass of: Thing
type: Class
linked concept: Meeting
comment: Any sort of formal or semi-formal meeting such as a business meeting.
subclass of: http://lodlaundromat.org/.well-known/genid/42cfc11f96a345388c7f4bc5aaadec29#5
subclass of: Event
subclass of: http://lodlaundromat.org/.well-known/genid/42cfc11f96a345388c7f4bc5aaadec29#4
subclass of: Entity
subclass of: Perdurant

related match
range: Thing
domain: Thing
sub property of: semantic relation
type: ObjectProperty
change note: Initial description.
sub property of: mapping relation
sub property of: related to
type: SymmetricProperty
definition: skos:relatedMatch is used to state an associative mapping link between two conceptual resources in different concept schemes.
issued: 2008-05-xx
note: Initial description.
type: Thing
note: skos:relatedMatch is used to state an associative mapping link between two conceptual resources in different concept schemes.
type: Property
domain: Concept
domain: Resource
domain: Abstract
domain: Entity
range: Concept
range: Resource
range: Abstract
range: Entity

Religous group
subclass of: Resource
subclass of: Thing
type: Class
linked concept: ReligiousOrganization
comment: An Organization whose members share a set of religious beliefs.
subclass of: Organization
subclass of: http://lodlaundromat.org/.well-known/genid/42cfc11f96a345388c7f4bc5aaadec29#2
subclass of: http://lodlaundromat.org/.well-known/genid/42cfc11f96a345388c7f4bc5aaadec29#1
subclass of: Group
subclass of: Object
subclass of: Entity
subclass of: Endurant
subclass of: Agent

has broader
sub property of: semantic relation
range: Thing
domain: Thing
issued: 2008-05-xx
type: ObjectProperty
sub property of: broader transitive
comment: Broader concepts are typically rendered as parents in a concept hierarchy (tree).
inverse of: has narrower
change note: Initial description.
comment: By convention, skos:broader is only used to assert an immediate (i.e. direct) hierarchical link between two conceptual resources.
definition: A concept that is more general in meaning.
note: Initial description.
type: Thing
note: A concept that is more general in meaning.
type: Property
domain: Concept
domain: Resource
domain: Abstract
domain: Entity
range: Concept
range: Resource
range: Abstract
range: Entity

hidden label
range: Thing
domain: Thing
definition: The property skosxl:hiddenLabel is used to associate an skosxl:Label with a skos:Concept. The property is analogous to skos:hiddenLabel.
type: ObjectProperty
range: Label
comment: If C skosxl:hiddenLabel L and L skosxl:literalForm V, then C skos:hiddenLabel V.
type: Property
note: The property skosxl:hiddenLabel is used to associate an skosxl:Label with a skos:Concept. The property is analogous to skos:hiddenLabel.
domain: Resource
range: Resource
range: http://lodlaundromat.org/.well-known/genid/6cf636276d4078b836ac19854e682ea2#1

Temporal region
subclass of: Thing
subclass of: Resource
type: Class
linked concept: temporal-region
linked concept: TemporalEntity
comment: A region of time such as a specific instant or time interval. Can also be used for things like Geological ages.
subclass of: http://lodlaundromat.org/.well-known/genid/42cfc11f96a345388c7f4bc5aaadec29#15
subclass of: Region
subclass of: Abstract
subclass of: Entity

Country
subclass of: Thing
subclass of: Resource
type: Class
linked concept: Country
comment: A country, normally designated by a GeoNames URI.
subclass of: Geographic Location
subclass of: http://lodlaundromat.org/.well-known/genid/42cfc11f96a345388c7f4bc5aaadec29#1
subclass of: http://lodlaundromat.org/.well-known/genid/42cfc11f96a345388c7f4bc5aaadec29#2
subclass of: Object
subclass of: Endurant
subclass of: Entity

is in scheme
range: Thing
domain: Thing
definition: Relates a resource (for example a concept) to a concept scheme in which it is included.
scope note: A concept may be a member of more than one concept scheme.
type: ObjectProperty
range: Concept Scheme
type: Property
note: Relates a resource (for example a concept) to a concept scheme in which it is included.
note: A concept may be a member of more than one concept scheme.
domain: Resource
range: Resource

has narrower
sub property of: semantic relation
range: Thing
domain: Thing
change note: Initial description.
issued: 2008-05-xx
inverse of: has broader
comment: Narrower concepts are typically rendered as children in a concept hierarchy (tree).
sub property of: narrower transitive
comment: By convention, skos:broader is only used to assert an immediate (i.e. direct) hierarchical link between two conceptual resources.
type: ObjectProperty
definition: A concept that is more specific in meaning.
note: Initial description.
type: Thing
note: A concept that is more specific in meaning.
type: Property
domain: Concept
domain: Resource
domain: Abstract
domain: Entity
range: Concept
range: Resource
range: Abstract
range: Entity

version of
range: Thing
domain: Thing
type: ObjectProperty
comment: Indicates that one InformationResource is a a version of some other resource. Note this is more restricted relation that dc:source, dc:source could indicate some set of primary references works used in the generation of a wholly new InformationResource whereas versionOf would only be used betweens successive refinements or copies of the essentially the same resource.
domain: Information resource
range: Information resource
type: Property
domain: Resource
domain: Entity
domain: Endurant
domain: http://lodlaundromat.org/.well-known/genid/42cfc11f96a345388c7f4bc5aaadec29#7
domain: Object
domain: http://lodlaundromat.org/.well-known/genid/42cfc11f96a345388c7f4bc5aaadec29#2
domain: http://lodlaundromat.org/.well-known/genid/42cfc11f96a345388c7f4bc5aaadec29#9
domain: http://lodlaundromat.org/.well-known/genid/42cfc11f96a345388c7f4bc5aaadec29#10
domain: http://lodlaundromat.org/.well-known/genid/42cfc11f96a345388c7f4bc5aaadec29#1
domain: http://lodlaundromat.org/.well-known/genid/42cfc11f96a345388c7f4bc5aaadec29#6
domain: http://lodlaundromat.org/.well-known/genid/42cfc11f96a345388c7f4bc5aaadec29#8
range: Resource
range: http://lodlaundromat.org/.well-known/genid/42cfc11f96a345388c7f4bc5aaadec29#6
range: http://lodlaundromat.org/.well-known/genid/42cfc11f96a345388c7f4bc5aaadec29#10
range: http://lodlaundromat.org/.well-known/genid/42cfc11f96a345388c7f4bc5aaadec29#7
range: http://lodlaundromat.org/.well-known/genid/42cfc11f96a345388c7f4bc5aaadec29#2
range: http://lodlaundromat.org/.well-known/genid/42cfc11f96a345388c7f4bc5aaadec29#1
range: Entity
range: http://lodlaundromat.org/.well-known/genid/42cfc11f96a345388c7f4bc5aaadec29#9
range: Endurant
range: Object
range: http://lodlaundromat.org/.well-known/genid/42cfc11f96a345388c7f4bc5aaadec29#8

located at
range: Thing
domain: Thing
linked concept: locatedIn
type: ObjectProperty
comment: The location at which a thing exists or is currently situated.
domain: Object
range: Geographic Location
type: Property
domain: Resource
domain: http://lodlaundromat.org/.well-known/genid/42cfc11f96a345388c7f4bc5aaadec29#2
domain: Entity
domain: Endurant
domain: http://lodlaundromat.org/.well-known/genid/42cfc11f96a345388c7f4bc5aaadec29#1
range: Resource
range: http://lodlaundromat.org/.well-known/genid/42cfc11f96a345388c7f4bc5aaadec29#2
range: http://lodlaundromat.org/.well-known/genid/42cfc11f96a345388c7f4bc5aaadec29#1
range: Entity
range: Endurant
range: Object

Agent
subclass of: Thing
subclass of: Resource
type: Class
linked concept: Agent
disjoint with: Geographic Location
disjoint with: ProductInstance
disjoint with: Information resource
comment: Something or someone that can act on its own and produce changes in the world.
subclass of: Object
subclass of: http://lodlaundromat.org/.well-known/genid/42cfc11f96a345388c7f4bc5aaadec29#1
subclass of: http://lodlaundromat.org/.well-known/genid/42cfc11f96a345388c7f4bc5aaadec29#2
subclass of: Endurant
subclass of: Entity

is in semantic relation with
range: Thing
domain: Thing
definition: Links a concept to a concept related by meaning.
scope note: This property should not be used directly, but as a super-property for all properties denoting a relationship of meaning between concepts.
type: ObjectProperty
domain: Concept
range: Concept
type: Property
note: Links a concept to a concept related by meaning.
note: This property should not be used directly, but as a super-property for all properties denoting a relationship of meaning between concepts.
domain: Resource
domain: http://lodlaundromat.org/.well-known/genid/d8234c3b1439a879aea940e9009663be#1
range: Resource
range: http://lodlaundromat.org/.well-known/genid/d8234c3b1439a879aea940e9009663be#1

intervalFinishes
range: Thing
domain: Thing
linked concept: intervalFinishes
type: ObjectProperty
comment: Indicates that one time interval (the subject) finishes the other (object) time interval, i.e. end start at the same time but it starts after the object interval starts.
domain: Time interval
range: Time interval
type: Property
domain: Resource
domain: Entity
domain: Abstract
domain: Region
domain: Temporal region
domain: http://lodlaundromat.org/.well-known/genid/42cfc11f96a345388c7f4bc5aaadec29#15
range: http://lodlaundromat.org/.well-known/genid/42cfc11f96a345388c7f4bc5aaadec29#15
range: Resource
range: Abstract
range: Entity
range: Temporal region
range: Region

has member list
range: Thing
domain: Thing
definition: Relates an ordered collection to the RDF list containing its members.
type: ObjectProperty
domain: Ordered Collection
type: FunctionalProperty
range: List
comment: For any resource, every item in the list given as the value of the skos:memberList property is also a value of the skos:member property.
type: Property
note: Relates an ordered collection to the RDF list containing its members.
domain: Resource
domain: http://lodlaundromat.org/.well-known/genid/d8234c3b1439a879aea940e9009663be#1
domain: Collection
range: Resource

Object
subclass of: Resource
subclass of: Thing
type: Class
linked concept: physical-object
comment: Physical objects. Endurants with unity and some independent existence.
subclass of: http://lodlaundromat.org/.well-known/genid/42cfc11f96a345388c7f4bc5aaadec29#2
subclass of: Endurant
disjoint with: Amount of matter
disjoint with: Object feature
subclass of: http://lodlaundromat.org/.well-known/genid/42cfc11f96a345388c7f4bc5aaadec29#1
subclass of: Entity

has exact match
sub property of: is in semantic relation with
sub property of: is in mapping relation with
range: Thing
domain: Thing
definition: skos:exactMatch is used to link two concepts, indicating a high degree of confidence that the concepts can be used interchangeably across a wide range of information retrieval applications. skos:exactMatch is a transitive property, and is a sub-property of skos:closeMatch.
type: ObjectProperty
sub property of: has close match
type: SymmetricProperty
type: TransitiveProperty
comment: skos:exactMatch is disjoint with each of the properties skos:broadMatch and skos:relatedMatch.
type: Property
note: skos:exactMatch is used to link two concepts, indicating a high degree of confidence that the concepts can be used interchangeably across a wide range of information retrieval applications. skos:exactMatch is a transitive property, and is a sub-property of skos:closeMatch.
domain: Resource
domain: Concept
domain: http://lodlaundromat.org/.well-known/genid/d8234c3b1439a879aea940e9009663be#1
range: Resource
range: Concept
range: http://lodlaundromat.org/.well-known/genid/d8234c3b1439a879aea940e9009663be#1

Time dependent relation
subclass of: Resource
subclass of: Thing
type: Class
comment: Reification of a time-dependent relation. A special case of a QualifiedBinaryRelation where the context should be a time interval.
subclass of: http://lodlaundromat.org/.well-known/genid/42cfc11f96a345388c7f4bc5aaadec29#14
subclass of: Qualified binary relation
subclass of: N-ary relation
subclass of: Relation
subclass of: Abstract
subclass of: Entity

Collection
subclass of: Thing
subclass of: Resource
type: Class
subclass of: Abstract
disjoint with: Concept Scheme
comment: Labelled collections can be used with collectable semantic relation properties e.g. skos:narrower, where you would like a set of concepts to be displayed under a 'node label' in the hierarchy.
issued: 2008-05-xx
definition: A meaningful collection of concepts.
disjoint with: Concept
change note: Initial description.
note: Initial description.
type: Thing
note: A meaningful collection of concepts.
subclass of: Entity

Concept
subclass of: Resource
subclass of: Thing
type: Class
change note: Initial description.
definition: An abstract idea or notion; a unit of thought.
issued: 2008-05-xx
subclass of: Abstract
note: Initial description.
type: Thing
note: An abstract idea or notion; a unit of thought.
subclass of: Entity
disjoint with: Concept Scheme
disjoint with: Collection

broader transitive
range: Thing
domain: Thing
comment: By convention, skos:broaderTransitive is not used to make assertions. Rather, the properties can be used to draw inferences about the transitive closure of the hierarchical relation, which is useful e.g. when implementing a simple query expansion algorithm in a search application.
change note: Initial description.
issued: 2008-05-xx
definition: skos:broaderTransitive is a transitive superproperty of skos:broader.
type: TransitiveProperty
type: ObjectProperty
sub property of: semantic relation
inverse of: narrower transitive
note: Initial description.
type: Thing
note: skos:broaderTransitive is a transitive superproperty of skos:broader.
type: Property
domain: Concept
domain: Resource
domain: Abstract
domain: Entity
range: Concept
range: Resource
range: Abstract
range: Entity

alternative label
range: Thing
domain: Thing
definition: The property skosxl:altLabel is used to associate an skosxl:Label with a skos:Concept. The property is analogous to skos:altLabel.
type: ObjectProperty
range: Label
comment: If C skosxl:altLabel L and L skosxl:literalForm V, then X skos:altLabel V.
type: Property
note: The property skosxl:altLabel is used to associate an skosxl:Label with a skos:Concept. The property is analogous to skos:altLabel.
domain: Resource
range: Resource
range: http://lodlaundromat.org/.well-known/genid/6cf636276d4078b836ac19854e682ea2#1

editorial note
range: Thing
domain: Thing
type: ObjectProperty
change note: Initial description.
sub property of: note
definition: A note for an editor, translator or maintainer of the vocabulary.
issued: 2008-05-xx
note: Initial description.
type: Thing
note: A note for an editor, translator or maintainer of the vocabulary.
type: Property
domain: Resource
range: Resource

Abstract
subclass of: Resource
subclass of: Thing
type: Class
linked concept: abstract
comment: Something, which neither happens nor exists. The main characteristic of abstract entities is that they do not have spatial nor temporal qualities, and they are not qualities themselves.
subclass of: Entity

Information resource
subclass of: Resource
type: Class
subclass of: Thing
recommended Property: Creator
subclass of: http://lodlaundromat.org/.well-known/genid/42cfc11f96a345388c7f4bc5aaadec29#6
recommended Property: Date
recommended Property: Title
linked concept: InformationResource
subclass of: Object
disjoint with: ProductInstance
disjoint with: Agent
subclass of: http://lodlaundromat.org/.well-known/genid/42cfc11f96a345388c7f4bc5aaadec29#8
recommended Property: Source
recommended Property: Subject
recommended Property: Rights
recommended Property: Format
comment: InformationResource denotes an information resource with identity, as defined in Dublin Core (DC2003ISO). A document (physical or electronic), message or other information object. We recommend use of Dublic Core elements for basic descriptive metadata and guide usage by restricting the range of some dc elements.
recommended Property: Type
subclass of: http://lodlaundromat.org/.well-known/genid/42cfc11f96a345388c7f4bc5aaadec29#7
subclass of: http://lodlaundromat.org/.well-known/genid/42cfc11f96a345388c7f4bc5aaadec29#10
disjoint with: Geographic Location
subclass of: http://lodlaundromat.org/.well-known/genid/42cfc11f96a345388c7f4bc5aaadec29#9
recommended Property: Contributor
subclass of: http://lodlaundromat.org/.well-known/genid/42cfc11f96a345388c7f4bc5aaadec29#1
subclass of: http://lodlaundromat.org/.well-known/genid/42cfc11f96a345388c7f4bc5aaadec29#2
subclass of: Endurant
subclass of: Entity

definition
range: Thing
domain: Thing
type: Property
type: ObjectProperty
change note: Initial description.
sub property of: note
definition: A statement or formal explanation of the meaning of a concept.
issued: 2008-05-xx
note: Initial description.
type: Thing
note: A statement or formal explanation of the meaning of a concept.
domain: Resource
range: Resource

has narrower
sub property of: is in semantic relation with
range: Thing
domain: Thing
definition: Relates a concept to a concept that is more specific in meaning.
scope note: By convention, skos:broader is only used to assert an immediate (i.e. direct) hierarchical link between two conceptual resources.
comment: Narrower concepts are typically rendered as children in a concept hierarchy (tree).
type: ObjectProperty
sub property of: has narrower transitive
inverse of: has broader
type: Property
note: Relates a concept to a concept that is more specific in meaning.
note: By convention, skos:broader is only used to assert an immediate (i.e. direct) hierarchical link between two conceptual resources.
domain: Concept
domain: Resource
domain: http://lodlaundromat.org/.well-known/genid/d8234c3b1439a879aea940e9009663be#1
range: Concept
range: Resource
range: http://lodlaundromat.org/.well-known/genid/d8234c3b1439a879aea940e9009663be#1

label relation
range: Thing
domain: Thing
definition: The property skosxl:labelRelation is used for representing binary ('direct') relations between instances of the class skosxl:Label.
scope note: skosxl:labelRelation is not intended to be used directly, but rather as the basis for a design pattern which can be refined for more specific labeling scenarios.
type: ObjectProperty
domain: Label
range: Label
type: SymmetricProperty
type: Property
note: The property skosxl:labelRelation is used for representing binary ('direct') relations between instances of the class skosxl:Label.
note: skosxl:labelRelation is not intended to be used directly, but rather as the basis for a design pattern which can be refined for more specific labeling scenarios.
domain: Resource
domain: http://lodlaundromat.org/.well-known/genid/6cf636276d4078b836ac19854e682ea2#1
range: Resource
range: http://lodlaundromat.org/.well-known/genid/6cf636276d4078b836ac19854e682ea2#1

Business activity
subclass of: Resource
subclass of: Thing
type: Class
comment: Some shared business endeavour. Use for ongoing activities as opposed to projects that have clear cut start/end time courses.
subclass of: Process
subclass of: Perdurant
subclass of: Entity

Person
subclass of: Resource
subclass of: Thing
type: Class
linked concept: Person
linked concept: Human
comment: An individual, a human being
subclass of: Agent
disjoint with: Group
subclass of: http://lodlaundromat.org/.well-known/genid/42cfc11f96a345388c7f4bc5aaadec29#2
subclass of: http://lodlaundromat.org/.well-known/genid/42cfc11f96a345388c7f4bc5aaadec29#1
subclass of: Object
subclass of: Endurant
subclass of: Entity

Time interval
subclass of: Thing
subclass of: Resource
type: Class
linked concept: time-interval
linked concept: TimeInterval
linked concept: Interval
comment: An interval of time. Note that a TimeInterval has both an extent and a location on a timeline. Note too that a TimeInterval has no gaps, i.e. this class contains only convex time intervals.
subclass of: Temporal region
subclass of: http://lodlaundromat.org/.well-known/genid/42cfc11f96a345388c7f4bc5aaadec29#15
subclass of: Region
subclass of: Abstract
subclass of: Entity

top concept in scheme
range: Thing
domain: Thing
sub property of: in scheme
inverse of: has top concept
issued: 2008-05-xx
range: Concept Scheme
definition: Relates a concept to the concept scheme that it is a top level concept of.
domain: Concept
type: ObjectProperty
change note: Initial description.
note: Initial description.
type: Thing
note: Relates a concept to the concept scheme that it is a top level concept of.
type: Property
domain: Resource
range: Resource
range: Abstract
range: Entity
domain: Entity
domain: Abstract

recommended Property
type: Property
type: AnnotationProperty
comment: Used to link a class to a set of properties that might often be used on instances of the class. Used especially when the properties have an open domain and/or reside in an external namespace to show expected usage patterns that are not obvious from the pure axiom structured on the ontology.

acronym
sub property of: label
type: DatatypeProperty
comment: A special case of an alternate label where the label is an acronym for the preffered (or maybe an alt) label.
sub property of: alternative label
type: Property

has close match
range: Thing
domain: Thing
sub property of: is in semantic relation with
definition: skos:closeMatch is used to link two concepts that are sufficiently similar that they can be used interchangeably in some information retrieval applications. In order to avoid the possibility of "compound errors" when combining mappings across more than two concept schemes, skos:closeMatch is not declared to be a transitive property.
type: ObjectProperty
sub property of: is in mapping relation with
type: SymmetricProperty
type: Property
note: skos:closeMatch is used to link two concepts that are sufficiently similar that they can be used interchangeably in some information retrieval applications. In order to avoid the possibility of "compound errors" when combining mappings across more than two concept schemes, skos:closeMatch is not declared to be a transitive property.
domain: Concept
domain: Resource
domain: http://lodlaundromat.org/.well-known/genid/d8234c3b1439a879aea940e9009663be#1
range: Concept
range: Resource
range: http://lodlaundromat.org/.well-known/genid/d8234c3b1439a879aea940e9009663be#1

Geographic Location
subclass of: Resource
subclass of: Thing
type: Class
disjoint with: Information resource
disjoint with: Agent
linked concept: Location
comment: A geospatial location, encompasses locations with extent (e.g. countries) as well as features which can be treated as point-like for some purposes (e.g. a bridge or road junction). Normally designated by a Geonames URI.
linked concept: place
disjoint with: ProductInstance
subclass of: Object
linked concept: GeographicArea
subclass of: http://lodlaundromat.org/.well-known/genid/42cfc11f96a345388c7f4bc5aaadec29#2
subclass of: http://lodlaundromat.org/.well-known/genid/42cfc11f96a345388c7f4bc5aaadec29#1
subclass of: Endurant
subclass of: Entity

Educational organization
subclass of: Resource
subclass of: Thing
type: Class
linked concept: EducationalOrganization
comment: A EducationalOrganization is an institution of learning. Some examples are public and private K-12 schools, and colleges and universities.
subclass of: Organization
subclass of: http://lodlaundromat.org/.well-known/genid/42cfc11f96a345388c7f4bc5aaadec29#1
subclass of: http://lodlaundromat.org/.well-known/genid/42cfc11f96a345388c7f4bc5aaadec29#2
subclass of: Group
subclass of: Endurant
subclass of: Entity
subclass of: Object
subclass of: Agent

http://lodlaundromat.org/.well-known/genid/42cfc11f96a345388c7f4bc5aaadec29#11
type: Class
subclass of: Thing
subclass of: Resource
type: Restriction
cardinality: 1
on property: weight

occurs at time
range: Thing
domain: Thing
type: ObjectProperty
comment: The time or time interval at which an event or process takes place.
domain: Perdurant
range: Temporal region
type: Property
domain: Resource
domain: Entity
range: http://lodlaundromat.org/.well-known/genid/42cfc11f96a345388c7f4bc5aaadec29#15
range: Resource
range: Abstract
range: Entity
range: Region

Endurant
subclass of: Resource
subclass of: Thing
type: Class
linked concept: endurant
comment: Endurants exists in time, values of some properties might different over time but the Endurant has a constant identity. Endurants can participate in processes. Philosophically speaking they are independent essential wholes.
subclass of: Entity
disjoint with: Perdurant

Spatial region
subclass of: Resource
subclass of: Thing
type: Class
linked concept: spatial-region
comment: A region of space in some measurement system including a polygonal boundary of a geographic space or a region of 3D space.
subclass of: http://lodlaundromat.org/.well-known/genid/42cfc11f96a345388c7f4bc5aaadec29#16
subclass of: Region
subclass of: Entity
subclass of: Abstract

mapping relation
range: Thing
domain: Thing
type: ObjectProperty
change note: Initial description.
domain: Concept
comment: These concept mapping relations mirror semantic relations, and the data model defined below is similar (with the exception of skos:exactMatch) to the data model defined for semantic relations. A distinct vocabulary is provided for concept mapping relations, to provide a convenient way to differentiate links within a concept scheme from links between concept schemes. However, this pattern of usage is not a formal requirement of the SKOS data model, and relies on informal definitions of best practice.
range: Concept
definition: Definition
issued: 2008-05-xx
note: Initial description.
type: Thing
note: Definition
type: Property
domain: Resource
domain: Entity
domain: Abstract
range: Resource
range: Abstract
range: Entity

scope note
range: Thing
domain: Thing
type: ObjectProperty
change note: Initial description.
sub property of: note
definition: A note that helps to clarify the meaning of a concept.
issued: 2008-05-xx
note: Initial description.
type: Thing
note: A note that helps to clarify the meaning of a concept.
type: Property
domain: Resource
range: Resource

Weighted relation
subclass of: Thing
subclass of: Resource
type: Class
comment: A relation containing a weight (e.g. an associated probablilty) and an object or literal value.
subclass of: http://lodlaundromat.org/.well-known/genid/42cfc11f96a345388c7f4bc5aaadec29#11
subclass of: N-ary relation
subclass of: Abstract
subclass of: Relation
subclass of: Entity

broader match
sub property of: semantic relation
sub property of: broader transitive
range: Thing
domain: Thing
type: ObjectProperty
change note: Initial description.
sub property of: mapping relation
sub property of: has broader
inverse of: narrower match
definition: skos:broadMatch is used to state a hierarchical mapping link between two conceptual resources in different concept schemes.
issued: 2008-05-xx
note: Initial description.
type: Thing
note: skos:broadMatch is used to state a hierarchical mapping link between two conceptual resources in different concept schemes.
type: Property
domain: Concept
domain: Resource
domain: Abstract
domain: Entity
range: Concept
range: Resource
range: Abstract
range: Entity

in country
range: Thing
domain: Thing
linked concept: inCountry
type: ObjectProperty
comment: The country in which a geographical feature is located.
domain: Geo Feature
range: Country
sub property of: located at
type: Property
domain: Object
domain: Resource
domain: http://lodlaundromat.org/.well-known/genid/42cfc11f96a345388c7f4bc5aaadec29#2
domain: Endurant
domain: http://lodlaundromat.org/.well-known/genid/42cfc11f96a345388c7f4bc5aaadec29#1
domain: Entity
range: Geographic Location
range: Resource
range: Object
range: http://lodlaundromat.org/.well-known/genid/42cfc11f96a345388c7f4bc5aaadec29#2
range: http://lodlaundromat.org/.well-known/genid/42cfc11f96a345388c7f4bc5aaadec29#1
range: Endurant
range: Entity
domain: Geographic Location

Function of time (integer)
subclass of: Resource
subclass of: Thing
type: Class
comment: Represents an integer-valued function of time
subclass of: http://lodlaundromat.org/.well-known/genid/42cfc11f96a345388c7f4bc5aaadec29#12
subclass of: Function of time

participant
range: Thing
domain: Thing
range: Endurant
domain: Perdurant
inverse of: participates in
type: ObjectProperty
comment: Indicates some person or object that partipates in a process or event.
type: Property
domain: Resource
domain: Entity
range: Resource
range: Entity

Government organization
subclass of: Resource
subclass of: Thing
type: Class
linked concept: GovernmentOrganization
comment: GovernmentOrganization is the class of official Organizations that are concerned with the government of a GeopoliticalArea at some level. They may be a subOrganization of a government.
subclass of: Organization
subclass of: http://lodlaundromat.org/.well-known/genid/42cfc11f96a345388c7f4bc5aaadec29#2
subclass of: http://lodlaundromat.org/.well-known/genid/42cfc11f96a345388c7f4bc5aaadec29#1
subclass of: Group
subclass of: Endurant
subclass of: Entity
subclass of: Object
subclass of: Agent

Ordered Collection
subclass of: Thing
subclass of: Resource
type: Class
definition: An ordered collection of concepts, where both the grouping and the ordering are meaningful.
scope note: Ordered collections can be used where you would like a set of concepts to be displayed in a specific order, and optionally under a 'node label'.
subclass of: Collection
note: An ordered collection of concepts, where both the grouping and the ordering are meaningful.
note: Ordered collections can be used where you would like a set of concepts to be displayed in a specific order, and optionally under a 'node label'.
subclass of: http://lodlaundromat.org/.well-known/genid/d8234c3b1439a879aea940e9009663be#1

Instant
subclass of: Resource
subclass of: Thing
type: Class
linked concept: Instant
comment: A point in time. Can have either a hasBeginning or hasEnding value, if it has both they should be the same.
subclass of: Temporal region
subclass of: http://lodlaundromat.org/.well-known/genid/42cfc11f96a345388c7f4bc5aaadec29#15
subclass of: Region
subclass of: Abstract
subclass of: Entity

http://lodlaundromat.org/.well-known/genid/6cf636276d4078b836ac19854e682ea2#1
subclass of: Resource
subclass of: Thing
type: Class
type: Restriction
on property: literal form
cardinality: 1

Relation
subclass of: Resource
subclass of: Thing
type: Class
linked concept: Relation
comment: Class of relations. Mostly used for when we are reifiying complex relations as objects and so does not itself break the DL constraints, could be used as a category of general relations as done in SUMO in which case we would be forced into OWL/full.
subclass of: Abstract
subclass of: Entity

Concept Scheme
subclass of: Thing
subclass of: Resource
type: Class
issued: 2008-05-xx
disjoint with: Concept
definition: A set of concepts, optionally including statements about semantic relationships between those concepts.
comment: A concept scheme may be defined to include concepts from different sources.
change note: Initial description.
comment: Thesauri, classification schemes, subject heading lists, taxonomies, 'folksonomies', and other types of controlled vocabulary are all examples of concept schemes. Concept schemes are also embedded in glossaries and terminologies.
subclass of: Abstract
note: Initial description.
type: Thing
note: A set of concepts, optionally including statements about semantic relationships between those concepts.
subclass of: Entity
disjoint with: Collection

Collection
subclass of: http://lodlaundromat.org/.well-known/genid/d8234c3b1439a879aea940e9009663be#1
subclass of: Thing
subclass of: Resource
type: Class
definition: A meaningful collection of concepts.
scope note: Labelled collections can be used where you would like a set of concepts to be displayed under a 'node label' in the hierarchy.
disjoint with: Concept
disjoint with: Concept Scheme
note: A meaningful collection of concepts.
note: Labelled collections can be used where you would like a set of concepts to be displayed under a 'node label' in the hierarchy.
disjoint with: Label

datum
range: Thing
domain: Thing
type: ObjectProperty
comment: links a function of time to a particular timestamped value
domain: Function of time
range: Datum
type: Property
domain: Resource
range: Resource

Entity
subclass of: Resource
subclass of: Thing
type: Class
linked concept: particular
comment: Root of the foundational ontology. Includes objects, processes and abstractions.

member of
range: Thing
domain: Thing
type: ObjectProperty
comment: Indicates that an agent is a member of some group, for example a person being a member of an organization like a Corporation.
domain: Agent
range: Group
type: Property
domain: Resource
domain: Endurant
domain: http://lodlaundromat.org/.well-known/genid/42cfc11f96a345388c7f4bc5aaadec29#2
domain: Object
domain: http://lodlaundromat.org/.well-known/genid/42cfc11f96a345388c7f4bc5aaadec29#1
domain: Entity
range: Resource
range: http://lodlaundromat.org/.well-known/genid/42cfc11f96a345388c7f4bc5aaadec29#2
range: http://lodlaundromat.org/.well-known/genid/42cfc11f96a345388c7f4bc5aaadec29#1
range: Entity
range: Endurant
range: Object
range: Agent

change note
range: Thing
domain: Thing
type: Property
type: ObjectProperty
change note: Initial description.
sub property of: note
definition: A note about a modification to a concept.
issued: 2008-05-xx
note: Initial description.
type: Thing
note: A note about a modification to a concept.
domain: Resource
range: Resource

object value
range: Thing
domain: Thing
type: ObjectProperty
comment: Gives an object (aka Individual) valued argument for an n-ary relationship, such as a weighted relation.
domain: N-ary relation
sub property of: has argument
type: Property
domain: Resource
domain: Relation
domain: Abstract
domain: Entity
range: Resource

Initial description.
creator: Sean Bechhofer
date: 2008-05-xx
type: Thing

change note
definition: A note about a modification to a concept.
type: AnnotationProperty
sub property of: note
type: Property
note: A note about a modification to a concept.

note
definition: A general note, for any purpose.
scope note: This property may be used directly, or as a super-property for more specific note types.
type: AnnotationProperty
type: Property
note: A general note, for any purpose.
note: This property may be used directly, or as a super-property for more specific note types.

Publisher
description: Examples of a Publisher include a person, an organization, or a service. Typically, the name of a Publisher should be used to indicate the entity.
has version: publisher-006
issued: 1999-07-02
modified: 2008-01-14
type: Property
comment: An entity responsible for making the resource available.
note: A second property with the same name as this property has been declared in the dcterms: namespace (http://purl.org/dc/terms/). See the Introduction to the document "DCMI Metadata Terms" (http://dublincore.org/documents/dcmi-terms/) for an explanation.

weight
type: Property
comment: Gives the probability or other weighted associated with a weighted attribute or relation.
domain: Weighted relation
range: float
sub property of: has argument
domain: N-ary relation
domain: Thing
domain: Resource
domain: Relation
domain: Abstract
domain: Entity
domain: http://lodlaundromat.org/.well-known/genid/42cfc11f96a345388c7f4bc5aaadec29#11
range: Resource

Initial description.
creator: Sean Bechhofer
date: 2008-05-xx
type: Thing

SKOS Vocabulary
type: Ontology
contributor: Dave Beckett
contributor: Nikki Rogers
contributor: Participants in W3C's Semantic Web Deployment Working Group.
description: An RDF vocabulary for describing the basic structure and content of concept schemes such as thesauri, classification schemes, subject heading lists, taxonomies, 'folksonomies', other types of controlled vocabulary, and also concept schemes embedded in glossaries and terminologies.
creator: Alistair Miles
creator: Sean Bechhofer

Initial description.
creator: Sean Bechhofer
date: 2008-05-xx
type: Thing

Coverage
description: Spatial topic and spatial applicability may be a named place or a location specified by its geographic coordinates. Temporal topic may be a named period, date, or date range. A jurisdiction may be a named administrative entity or a geographic place to which the resource applies. Recommended best practice is to use a controlled vocabulary such as the Thesaurus of Geographic Names [TGN]. Where appropriate, named places or time periods can be used in preference to numeric identifiers such as sets of coordinates or date ranges.
has version: coverage-006
issued: 1999-07-02
modified: 2008-01-14
type: Property
comment: The spatial or temporal topic of the resource, the spatial applicability of the resource, or the jurisdiction under which the resource is relevant.
note: A second property with the same name as this property has been declared in the dcterms: namespace (http://purl.org/dc/terms/). See the Introduction to the document "DCMI Metadata Terms" (http://dublincore.org/documents/dcmi-terms/) for an explanation.

Initial description.
creator: Sean Bechhofer
date: 2008-05-xx
type: Thing

example
definition: An example of the use of a concept.
type: AnnotationProperty
sub property of: note
type: Property
note: An example of the use of a concept.

at date
type: DatatypeProperty
comment: gives the time point of a datum in a time-valued function, to a resolution of 1 day
domain: Datum
range: date
type: Property
domain: Thing
domain: Resource
range: Resource

Initial description.
creator: Sean Bechhofer
date: 2008-05-xx
type: Thing

in context
type: Property
comment: Gives the context of a qualified relationship, e.g. the TimeInterval during which a binary property value is valid.
domain: Qualified binary relation
domain: Resource
domain: Thing
domain: Entity
domain: Abstract
domain: N-ary relation
domain: Relation

literal form
definition: The property skosxl:literalForm is used to give the literal form of an skosxl:Label.
comment: If two instances of the class skosxl:Label have the same literal form, they are not necessarily the same resource.
type: DatatypeProperty
domain: Label
comment: The range of skosxl:literalForm is the class of RDF plain literals.
type: Property
note: The property skosxl:literalForm is used to give the literal form of an skosxl:Label.
domain: Thing
domain: Resource
domain: http://lodlaundromat.org/.well-known/genid/6cf636276d4078b836ac19854e682ea2#1

Initial description.
creator: Sean Bechhofer
date: 2008-05-xx
type: Thing

Identifier
description: Recommended best practice is to identify the resource by means of a string conforming to a formal identification system.
has version: identifier-006
issued: 1999-07-02
modified: 2008-01-14
type: Property
comment: An unambiguous reference to the resource within a given context.
note: A second property with the same name as this property has been declared in the dcterms: namespace (http://purl.org/dc/terms/). See the Introduction to the document "DCMI Metadata Terms" (http://dublincore.org/documents/dcmi-terms/) for an explanation.

Language
issued: 1999-07-02
note: A second property with the same name as this property has been declared in the dcterms: namespace (http://purl.org/dc/terms/). See the Introduction to the document "DCMI Metadata Terms" (http://dublincore.org/documents/dcmi-terms/) for an explanation.
has version: language-007
description: Recommended best practice is to use a controlled vocabulary such as RFC 4646 [RFC4646].
type: Property
comment: A language of the resource.
modified: 2008-01-14

Initial description.
creator: Sean Bechhofer
date: 2008-05-xx
type: Thing

scope note
definition: A note that helps to clarify the meaning and/or the use of a concept.
type: AnnotationProperty
sub property of: note
type: Property
note: A note that helps to clarify the meaning and/or the use of a concept.

preferred label
definition: The preferred lexical label for a resource, in a given language.
type: AnnotationProperty
sub property of: label
comment: A resource has no more than one value of skos:prefLabel per language tag, and no more than one value of skos:prefLabel without language tag.
comment: The range of skos:prefLabel is the class of RDF plain literals.
comment: skos:prefLabel, skos:altLabel and skos:hiddenLabel are pairwise disjoint properties.
type: Property
note: The preferred lexical label for a resource, in a given language.

Initial description.
creator: Sean Bechhofer
date: 2008-05-xx
type: Thing

has argument
type: Property
comment: Links a reified n-ary relationship to one of its arguments. Subproperties of this can be used to indicate specific roles in the n-ary realtionship.
domain: N-ary relation
domain: Abstract
domain: Entity
domain: Relation
domain: Thing
domain: Resource

Initial description.
creator: Sean Bechhofer
date: 2008-05-xx
type: Thing

Initial description.
creator: Sean Bechhofer
date: 2008-05-xx
type: Thing

Subject
description: Typically, the subject will be represented using keywords, key phrases, or classification codes. Recommended best practice is to use a controlled vocabulary.
has version: subject-007
issued: 1999-07-02
modified: 2012-06-14
type: Property
comment: The topic of the resource.
note: A second property with the same name as this property has been declared in the dcterms: namespace (http://purl.org/dc/terms/). See the Introduction to the document "DCMI Metadata Terms" (http://dublincore.org/documents/dcmi-terms/) for an explanation.

value
type: DatatypeProperty
comment: gives the value of a datum
domain: Datum
type: Property
domain: Thing
domain: Resource

literal value
type: DatatypeProperty
comment: Gives an data valued argument for an n-ary relationship, such as a weighted relation.
domain: N-ary relation
sub property of: has argument
type: Property
domain: Thing
domain: Resource
domain: Relation
domain: Abstract
domain: Entity

Initial description.
creator: Sean Bechhofer
date: 2008-05-xx
type: Thing

alternative label
definition: An alternative lexical label for a resource.
example: Acronyms, abbreviations, spelling variants, and irregular plural/singular forms may be included among the alternative labels for a concept. Mis-spelled terms are normally included as hidden labels (see skos:hiddenLabel).
type: AnnotationProperty
sub property of: label
comment: The range of skos:altLabel is the class of RDF plain literals.
comment: skos:prefLabel, skos:altLabel and skos:hiddenLabel are pairwise disjoint properties.
type: Property
note: An alternative lexical label for a resource.
note: Acronyms, abbreviations, spelling variants, and irregular plural/singular forms may be included among the alternative labels for a concept. Mis-spelled terms are normally included as hidden labels (see skos:hiddenLabel).

Relation
description: Recommended best practice is to identify the related resource by means of a string conforming to a formal identification system.
has version: relation-006
issued: 1999-07-02
modified: 2008-01-14
type: Property
comment: A related resource.
note: A second property with the same name as this property has been declared in the dcterms: namespace (http://purl.org/dc/terms/). See the Introduction to the document "DCMI Metadata Terms" (http://dublincore.org/documents/dcmi-terms/) for an explanation.

Creator
description: Examples of a Creator include a person, an organization, or a service. Typically, the name of a Creator should be used to indicate the entity.
has version: creator-006
issued: 1999-07-02
modified: 2008-01-14
type: Property
comment: An entity primarily responsible for making the resource.
note: A second property with the same name as this property has been declared in the dcterms: namespace (http://purl.org/dc/terms/). See the Introduction to the document "DCMI Metadata Terms" (http://dublincore.org/documents/dcmi-terms/) for an explanation.

hidden label
definition: A lexical label for a resource that should be hidden when generating visual displays of the resource, but should still be accessible to free text search operations.
type: AnnotationProperty
sub property of: label
comment: The range of skos:hiddenLabel is the class of RDF plain literals.
comment: skos:prefLabel, skos:altLabel and skos:hiddenLabel are pairwise disjoint properties.
type: Property
note: A lexical label for a resource that should be hidden when generating visual displays of the resource, but should still be accessible to free text search operations.

Format
description: Examples of dimensions include size and duration. Recommended best practice is to use a controlled vocabulary such as the list of Internet Media Types [MIME].
has version: format-007
issued: 1999-07-02
modified: 2008-01-14
type: Property
comment: The file format, physical medium, or dimensions of the resource.
note: A second property with the same name as this property has been declared in the dcterms: namespace (http://purl.org/dc/terms/). See the Introduction to the document "DCMI Metadata Terms" (http://dublincore.org/documents/dcmi-terms/) for an explanation.

Initial description.
creator: Sean Bechhofer
date: 2008-05-xx
type: Thing

Initial description.
creator: Sean Bechhofer
date: 2008-05-xx
type: Thing

Initial description.
creator: Sean Bechhofer
date: 2008-05-xx
type: Thing

has beginning
type: DatatypeProperty
type: FunctionalProperty
comment: The beginning of a time interval or the time value of a time instant. Optional (since the interval may be unbounded) but unique.
domain: Temporal region
range: dateTime
type: Property
domain: http://lodlaundromat.org/.well-known/genid/42cfc11f96a345388c7f4bc5aaadec29#15
domain: Resource
domain: Entity
domain: Thing
domain: Abstract
domain: Region
range: Resource

Source
description: The described resource may be derived from the related resource in whole or in part. Recommended best practice is to identify the related resource by means of a string conforming to a formal identification system.
has version: source-006
issued: 1999-07-02
modified: 2008-01-14
type: Property
comment: A related resource from which the described resource is derived.
note: A second property with the same name as this property has been declared in the dcterms: namespace (http://purl.org/dc/terms/). See the Introduction to the document "DCMI Metadata Terms" (http://dublincore.org/documents/dcmi-terms/) for an explanation.

Description
description: Description may include but is not limited to: an abstract, a table of contents, a graphical representation, or a free-text account of the resource.
has version: description-006
issued: 1999-07-02
modified: 2008-01-14
type: Property
comment: An account of the resource.
note: A second property with the same name as this property has been declared in the dcterms: namespace (http://purl.org/dc/terms/). See the Introduction to the document "DCMI Metadata Terms" (http://dublincore.org/documents/dcmi-terms/) for an explanation.

Initial description.
creator: Sean Bechhofer
date: 2008-05-xx
type: Thing

Initial description.
creator: Sean Bechhofer
date: 2008-05-xx
type: Thing

Initial description.
creator: Sean Bechhofer
date: 2008-05-xx
type: Thing

at time
type: DatatypeProperty
comment: gives the time point of a datum in a time-valued function
domain: Datum
range: dateTime
type: Property
domain: Thing
domain: Resource
range: Resource

alternative label
definition: An alternative lexical label for a resource.
comment: Acronyms, abbreviations, spelling variants, and irregular plural/singular forms may be included among the alternative labels for a concept. Mis-spelled terms are normally included as hidden labels (see skos:hiddenLabel).
comment: skos:prefLabel, skos:altLabel and skos:hiddenLabel are pairwise disjoint properties.
issued: 2008-05-xx
sub property of: label
change note: Initial description.
type: DatatypeProperty
comment: The range of skos:altLabel is the class of RDF plain literals.
note: Initial description.
type: Thing
note: An alternative lexical label for a resource.
type: Property

Initial description.
creator: Sean Bechhofer
date: 2008-05-xx
type: Thing

Initial description.
creator: Sean Bechhofer
date: 2008-05-xx
type: Thing

SKOS Core Vocabulary
type: Ontology
Contributor: Dave Beckett
Contributor: Nikki Rogers
Contributor: Participants in W3C's Semantic Web Deployment Working Group.
description: An RDF vocabulary for describing the basic structure and content of concept schemes such as thesauri, classification schemes, subject heading lists, taxonomies, 'folksonomies', other types of controlled vocabulary, and also concept schemes embedded in glossaries and terminologies.
creator: Alistair Miles
creator: Sean Bechhofer

preferred label
change note: Initial description.
sub property of: label
comment: The range of skos:prefLabel is the class of RDF plain literals.
comment: No two concepts in the same concept scheme may have the same value for skos:prefLabel in a given language.
definition: The preferred lexical label for a resource, in a given language.
issued: 2008-05-xx
type: DatatypeProperty
comment: skos:prefLabel, skos:altLabel and skos:hiddenLabel are pairwise disjoint properties.
note: Initial description.
type: Thing
note: The preferred lexical label for a resource, in a given language.
type: Property

Initial description.
creator: Sean Bechhofer
date: 2008-05-xx
type: Thing

Contributor
description: Examples of a Contributor include a person, an organization, or a service. Typically, the name of a Contributor should be used to indicate the entity.
has version: contributor-006
issued: 1999-07-02
modified: 2008-01-14
type: Property
comment: An entity responsible for making contributions to the resource.
note: A second property with the same name as this property has been declared in the dcterms: namespace (http://purl.org/dc/terms/). See the Introduction to the document "DCMI Metadata Terms" (http://dublincore.org/documents/dcmi-terms/) for an explanation.

Initial description.
creator: Sean Bechhofer
date: 2008-05-xx
type: Thing

Initial description.
creator: Sean Bechhofer
date: 2008-05-xx
type: Thing

SKOS XL Vocabulary
type: Ontology
creator: Alistair Miles
creator: Sean Bechhofer
imports: SKOS Vocabulary
contributor: Participants in W3C's Semantic Web Deployment Working Group.
description: An RDF vocabulary extending SKOS and allowing the description and linking of lexical entities.

Date
description: Date may be used to express temporal information at any level of granularity. Recommended best practice is to use an encoding scheme, such as the W3CDTF profile of ISO 8601 [W3CDTF].
has version: date-006
issued: 1999-07-02
modified: 2008-01-14
type: Property
comment: A point or period of time associated with an event in the lifecycle of the resource.
note: A second property with the same name as this property has been declared in the dcterms: namespace (http://purl.org/dc/terms/). See the Introduction to the document "DCMI Metadata Terms" (http://dublincore.org/documents/dcmi-terms/) for an explanation.

Rights
description: Typically, rights information includes a statement about various property rights associated with the resource, including intellectual property rights.
has version: rights-006
issued: 1999-07-02
modified: 2008-01-14
type: Property
comment: Information about rights held in and over the resource.
note: A second property with the same name as this property has been declared in the dcterms: namespace (http://purl.org/dc/terms/). See the Introduction to the document "DCMI Metadata Terms" (http://dublincore.org/documents/dcmi-terms/) for an explanation.

definition
definition: A statement or formal explanation of the meaning of a concept.
type: AnnotationProperty
sub property of: note
type: Property
note: A statement or formal explanation of the meaning of a concept.

Initial description.
creator: Sean Bechhofer
date: 2008-05-xx
type: Thing

history note
definition: A note about the past state/use/meaning of a concept.
type: AnnotationProperty
sub property of: note
type: Property
note: A note about the past state/use/meaning of a concept.

hidden label
type: DatatypeProperty
sub property of: label
change note: Initial description.
comment: The range of skos:hiddenLabel is the class of RDF plain literals.
comment: skos:prefLabel, skos:altLabel and skos:hiddenLabel are pairwise disjoint properties.
definition: A lexical label for a resource that should be hidden when generating visual displays of the resource, but should still be accessible to free text search operations.
issued: 2008-05-xx
note: Initial description.
type: Thing
note: A lexical label for a resource that should be hidden when generating visual displays of the resource, but should still be accessible to free text search operations.
type: Property

notation
definition: A notation, also known as classification code, is a string of characters such as "T58.5" or "303.4833" used to uniquely identify a concept within the scope of a given concept scheme.
scope note: By convention, skos:notation is used with a typed literal in the object position of the triple.
type: DatatypeProperty
type: Property
note: A notation, also known as classification code, is a string of characters such as "T58.5" or "303.4833" used to uniquely identify a concept within the scope of a given concept scheme.
note: By convention, skos:notation is used with a typed literal in the object position of the triple.

Initial description.
creator: Sean Bechhofer
date: 2008-05-xx
type: Thing

Initial description.
creator: Sean Bechhofer
date: 2008-05-xx
type: Thing

Dublin Core Metadata Element Set, Version 1.1
modified: 2012-06-14
publisher: DCMI
type: Ontology

Initial description.
creator: Sean Bechhofer
date: 2008-05-xx
type: Thing

Title
has version: title-006
issued: 1999-07-02
modified: 2008-01-14
type: Property
comment: A name given to the resource.
note: A second property with the same name as this property has been declared in the dcterms: namespace (http://purl.org/dc/terms/). See the Introduction to the document "DCMI Metadata Terms" (http://dublincore.org/documents/dcmi-terms/) for an explanation.

Foundation
type: Ontology
comment: An example foundation ontology developed to accompany the experimental EDUBase dataset. Based on Dolce-lite. Utilizes SKOS, SKOS-XL and Dublin Core Elements. Cross links to FRBR ontology, FOAF, DOLCE-lite and Proton.
imports: Dublin Core Metadata Element Set, Version 1.1
imports: SKOS XL Vocabulary
imports: SKOS Core Vocabulary

Initial description.
creator: Alistair Miles
date: 2008-05-xx
type: Thing

Initial description.
creator: Sean Bechhofer
date: 2008-05-xx
type: Thing

Type
description: Recommended best practice is to use a controlled vocabulary such as the DCMI Type Vocabulary [DCMITYPE]. To describe the file format, physical medium, or dimensions of the resource, use the Format element.
has version: type-006
issued: 1999-07-02
modified: 2008-01-14
type: Property
comment: The nature or genre of the resource.
note: A second property with the same name as this property has been declared in the dcterms: namespace (http://purl.org/dc/terms/). See the Introduction to the document "DCMI Metadata Terms" (http://dublincore.org/documents/dcmi-terms/) for an explanation.

Initial description.
creator: Sean Bechhofer
date: 2008-05-xx
type: Thing

Initial description.
creator: Sean Bechhofer
date: 2008-05-xx
type: Thing

Initial description.
creator: Sean Bechhofer
date: 2008-05-xx
type: Thing

notation
type: DatatypeProperty
change note: Initial description.
comment: By convention, skos:notation is used with a typed literal in the object position of the triple.
definition: A notation, also known as classification code, is a string of characters such as "T58.5" or "303.4833" used to uniquely identify a concept within the scope of a given concept scheme.
issued: 2008-05-xx
note: Initial description.
type: Thing
note: A notation, also known as classification code, is a string of characters such as "T58.5" or "303.4833" used to uniquely identify a concept within the scope of a given concept scheme.
type: Property

editorial note
definition: A note for an editor, translator or maintainer of the vocabulary.
type: AnnotationProperty
sub property of: note
type: Property
note: A note for an editor, translator or maintainer of the vocabulary.

Initial description.
creator: Sean Bechhofer
date: 2008-05-xx
type: Thing

has ending
type: DatatypeProperty
type: FunctionalProperty
comment: The end of a time interval or the time value of a time instant. Optional (since the interval may be unbounded) but unique.
domain: Temporal region
range: dateTime
type: Property
domain: http://lodlaundromat.org/.well-known/genid/42cfc11f96a345388c7f4bc5aaadec29#15
domain: Resource
domain: Entity
domain: Thing
domain: Abstract
domain: Region
range: Resource