http://lodlaundromat.org/.well-known/genid/42cfc11f96a345388c7f4bc5aaadec29#11
type: Restriction
cardinality: 1
on property: weight

Foundation
type: Ontology
comment: An example foundation ontology developed to accompany the experimental EDUBase dataset. Based on Dolce-lite. Utilizes SKOS, SKOS-XL and Dublin Core Elements. Cross links to FRBR ontology, FOAF, DOLCE-lite and Proton.
imports: http://purl.org/dc/elements/1.1/
imports: skos-xl
imports: skos

Abstract
linked concept: abstract
type: Class
comment: Something, which neither happens nor exists. The main characteristic of abstract entities is that they do not have spatial nor temporal qualities, and they are not qualities themselves.
subclass of: Entity

Agent
linked concept: Agent
type: Class
comment: Something or someone that can act on its own and produce changes in the world.
subclass of: Object
disjoint with: Geographic Location
disjoint with: Information resource
disjoint with: ProductInstance

Amount of matter
linked concept: amount-of-matter
type: Class
comment: Things like "water", "clay" which have no unity (the combination of two amounts of clay is just a single amount of clay), aka "stuff".
subclass of: http://lodlaundromat.org/.well-known/genid/42cfc11f96a345388c7f4bc5aaadec29#3
subclass of: Endurant
disjoint with: Object
disjoint with: Object feature

Business activity
type: Class
comment: Some shared business endeavour. Use for ongoing activities as opposed to projects that have clear cut start/end time courses.
subclass of: Process

Corporation
linked concept: BusinessEntity
linked concept: CorporateBody
linked concept: Corporation
type: Class
comment: An Organization that has a special legal status that allows a group of persons to act as a CommercialAgent and that insulates the owners (shareholders) from many liabilities that might result from the corporation's operation.
subclass of: Organization

Country
linked concept: Country
type: Class
comment: A country, normally designated by a GeoNames URI.
subclass of: Geographic Location

Datum
type: Class
comment: A single value in a function (typically of time)

Datum (integer)
type: Class
comment: A single (integer) value in a function (typically of time)
subclass of: http://lodlaundromat.org/.well-known/genid/42cfc11f96a345388c7f4bc5aaadec29#13
subclass of: Datum

Division
linked concept: Division
type: Class
comment: Branch, division, department, laboratory, etc. within an organisation. Usually, not an independent legal entity.
subclass of: Organization

Document
linked concept: Document
type: Class
comment: A document, does not distinguish electronic and physical copies. Not limited to text documents.
subclass of: Information resource

Educational organization
linked concept: EducationalOrganization
type: Class
comment: A EducationalOrganization is an institution of learning. Some examples are public and private K-12 schools, and colleges and universities.
subclass of: Organization

Endurant
linked concept: endurant
type: Class
comment: Endurants exists in time, values of some properties might different over time but the Endurant has a constant identity. Endurants can participate in processes. Philosophically speaking they are independent essential wholes.
subclass of: Entity
disjoint with: Perdurant

Entity
linked concept: particular
type: Class
comment: Root of the foundational ontology. Includes objects, processes and abstractions.

Event
linked concept: Event
linked concept: event
type: Class
comment: We split perdurants into just events and processes according to atomicity. A process has some substructure to it, it extends over time and might have discrete or continuous phases, whereas as an event has no interesting substructure. This division is relative to a given viewpoint. For example a meeting could be modelled as a process if one is recording different stages of a meeting with time ordering or might be a simple event. The two viewpoints are not regarded as disjoint.
subclass of: Perdurant

Function of time
type: Class
comment: Represents an integer-valued function of time

Function of time (integer)
type: Class
comment: Represents an integer-valued function of time
subclass of: http://lodlaundromat.org/.well-known/genid/42cfc11f96a345388c7f4bc5aaadec29#12
subclass of: Function of time

Geo Feature
linked concept: Feature
type: Class
comment: A geographical feature such as a river, mountain, including man made features such as cities and bridges. Ususally designated by a Geonames URI with associated descriptive information.
subclass of: Geographic Location

Geographic Location
linked concept: Location
linked concept: place
linked concept: GeographicArea
type: Class
comment: A geospatial location, encompasses locations with extent (e.g. countries) as well as features which can be treated as point-like for some purposes (e.g. a bridge or road junction). Normally designated by a Geonames URI.
subclass of: Object
disjoint with: Agent
disjoint with: Information resource
disjoint with: ProductInstance

Government organization
linked concept: GovernmentOrganization
type: Class
comment: GovernmentOrganization is the class of official Organizations that are concerned with the government of a GeopoliticalArea at some level. They may be a subOrganization of a government.
subclass of: Organization

Group
linked concept: Group
type: Class
comment: A Collection of Agents, e.g. a flock of sheep, a herd of goats, or the local Boy Scout troop.
subclass of: Agent
disjoint with: Person

Information resource
linked concept: InformationResource
recommended Property: contributor
recommended Property: creator
recommended Property: date
recommended Property: format
recommended Property: rights
recommended Property: source
recommended Property: subject
recommended Property: title
recommended Property: type
type: Class
comment: InformationResource denotes an information resource with identity, as defined in Dublin Core (DC2003ISO). A document (physical or electronic), message or other information object. We recommend use of Dublic Core elements for basic descriptive metadata and guide usage by restricting the range of some dc elements.
subclass of: http://lodlaundromat.org/.well-known/genid/42cfc11f96a345388c7f4bc5aaadec29#10
subclass of: http://lodlaundromat.org/.well-known/genid/42cfc11f96a345388c7f4bc5aaadec29#6
subclass of: http://lodlaundromat.org/.well-known/genid/42cfc11f96a345388c7f4bc5aaadec29#7
subclass of: http://lodlaundromat.org/.well-known/genid/42cfc11f96a345388c7f4bc5aaadec29#8
subclass of: http://lodlaundromat.org/.well-known/genid/42cfc11f96a345388c7f4bc5aaadec29#9
subclass of: Object
disjoint with: Agent
disjoint with: Geographic Location
disjoint with: ProductInstance

Information source
type: Class
comment: A storage system, content management system, or other source from which information resources like Documents can be obtained. The aggregate can itself be regarded as an InformationResource though metadata on the InformationSource should be used to describe the name and authorship of the source rather of the union of the contained resources.
subclass of: Information resource

Instant
linked concept: Instant
type: Class
comment: A point in time. Can have either a hasBeginning or hasEnding value, if it has both they should be the same.
subclass of: Temporal region

Man
linked concept: Man
type: Class
comment: Class of male persons.
subclass of: Person

Meeting
linked concept: Meeting
type: Class
comment: Any sort of formal or semi-formal meeting such as a business meeting.
subclass of: http://lodlaundromat.org/.well-known/genid/42cfc11f96a345388c7f4bc5aaadec29#5
subclass of: Event

N-ary relation
type: Class
comment: Superclass of all types of reified n-ary relations. Instances link to the participating objects via hasArgument properties.
subclass of: Relation

Object
linked concept: physical-object
type: Class
comment: Physical objects. Endurants with unity and some independent existence.
subclass of: http://lodlaundromat.org/.well-known/genid/42cfc11f96a345388c7f4bc5aaadec29#2
subclass of: Endurant
disjoint with: Amount of matter
disjoint with: Object feature

Object feature
linked concept: feature
type: Class
comment: Something which can't exist on its own but is a feature of some physical object, e.g. a bump, hole, region, spot.
subclass of: http://lodlaundromat.org/.well-known/genid/42cfc11f96a345388c7f4bc5aaadec29#1
subclass of: Endurant
disjoint with: Amount of matter
disjoint with: Object

Organization
linked concept: Organization
type: Class
comment: An Organization is a corporate or similar institution. The members of an Organization typically have a common purpose or function. Note that this class also covers divisions, departments, etc. of organizations. For example, both the Shell Corporation and the accounting department at Shell would both be instances of Organization.
subclass of: Group

Perdurant
linked concept: perdurant
type: Class
comment: Perdurants (AKA occurrences) comprise what are variously called events, processes, phenomena, activities and states. They can have temporal parts or spatial parts. For instance, the first movement of (an execution of) a symphony is a temporal part of the symphony. On the other hand, the play performed by the left side of the orchestra is a spatial part. In both cases, these parts are occurrences themselves. We assume that objects cannot be parts of occurrences, but rather they participate in them. Philosophers say that endurants are entities that are in time, while lacking temporal parts (so to speak, all their parts flow with them in time). Perdurants, on the contrary, are entities that happen in time, and can have temporal parts (all their parts are fixed in time).
subclass of: Entity

Person
linked concept: Person
linked concept: Human
type: Class
comment: An individual, a human being
subclass of: Agent
disjoint with: Group

Process
linked concept: process
type: Class
comment: We split perdurants into just events and processes according to atomicity. A process has some substructure to it, it extends over time and might have discrete or continuous phases, whereas as an event has no interesting substructure. This division is relative to a given viewpoint. For example a meeting could be modelled as a process if one is recording different stages of a meeting with time ordering or might be a simple event. The two viewpoints are not regarded as disjoint.
subclass of: Perdurant

Project
linked concept: Project
type: Class
comment: A project or collective endeavour of some kind. Typically a project has a definite inception, set of goals and conclusion.
subclass of: http://lodlaundromat.org/.well-known/genid/42cfc11f96a345388c7f4bc5aaadec29#4
subclass of: Process

Qualified binary relation
type: Class
comment: A relation which would normally be regard as binary (e.g. memberOf, hasColour) but where the value is dependent upon some context like time. We model this as an n-ary relation where the qualifying context is given by the value of the 'inContext' property and the qualified value is given by the unique 'hasArgument' value.
subclass of: N-ary relation

Region
linked concept: region
type: Class
comment: A region of some measurement space such as a time interval, spatial region or colour space.
subclass of: Abstract

Relation
linked concept: Relation
type: Class
comment: Class of relations. Mostly used for when we are reifiying complex relations as objects and so does not itself break the DL constraints, could be used as a category of general relations as done in SUMO in which case we would be forced into OWL/full.
subclass of: Abstract

Religous group
linked concept: ReligiousOrganization
type: Class
comment: An Organization whose members share a set of religious beliefs.
subclass of: Organization

Spatial region
linked concept: spatial-region
type: Class
comment: A region of space in some measurement system including a polygonal boundary of a geographic space or a region of 3D space.
subclass of: http://lodlaundromat.org/.well-known/genid/42cfc11f96a345388c7f4bc5aaadec29#16
subclass of: Region

Temporal region
linked concept: temporal-region
linked concept: TemporalEntity
type: Class
comment: A region of time such as a specific instant or time interval. Can also be used for things like Geological ages.
subclass of: http://lodlaundromat.org/.well-known/genid/42cfc11f96a345388c7f4bc5aaadec29#15
subclass of: Region

Time dependent relation
type: Class
comment: Reification of a time-dependent relation. A special case of a QualifiedBinaryRelation where the context should be a time interval.
subclass of: http://lodlaundromat.org/.well-known/genid/42cfc11f96a345388c7f4bc5aaadec29#14
subclass of: Qualified binary relation

Time interval
linked concept: time-interval
linked concept: TimeInterval
linked concept: Interval
type: Class
comment: An interval of time. Note that a TimeInterval has both an extent and a location on a timeline. Note too that a TimeInterval has no gaps, i.e. this class contains only convex time intervals.
subclass of: Temporal region

Weighted relation
type: Class
comment: A relation containing a weight (e.g. an associated probablilty) and an object or literal value.
subclass of: http://lodlaundromat.org/.well-known/genid/42cfc11f96a345388c7f4bc5aaadec29#11
subclass of: N-ary relation

Woman
linked concept: Woman
type: Class
comment: Class of female persons.
subclass of: Person

acronym
type: DatatypeProperty
comment: A special case of an alternate label where the label is an acronym for the preffered (or maybe an alt) label.
sub property of: altLabel

after
type: ObjectProperty
comment: Indicates that one interval (the subject) starts after another (the object) ends.
domain: Temporal region
range: Temporal region

before
type: ObjectProperty
comment: Indicates that one interval (the subject) ends before another (the object) begins.
domain: Temporal region
range: Temporal region

child organization of
linked concept: childOrganizationOf
type: ObjectProperty
comment: Indicates that some organization (such as a division) is part of some parent organization.
domain: Organization
range: Organization
sub property of: part of

contact details
type: ObjectProperty
domain: Agent
range: VCard

contact person
type: ObjectProperty
comment: Person (or other agent) who can act as a contact point for some activity or product.
range: Agent

at date
type: DatatypeProperty
comment: gives the time point of a datum in a time-valued function, to a resolution of 1 day
domain: Datum
range: date

datum
type: ObjectProperty
comment: links a function of time to a particular timestamped value
domain: Function of time
range: Datum

definitive source
type: ObjectProperty
comment: Indicates the definitive source from which this resource was, or could be, obtained.
sub property of: has source

has argument
type: Property
comment: Links a reified n-ary relationship to one of its arguments. Subproperties of this can be used to indicate specific roles in the n-ary realtionship.
domain: N-ary relation

has beginning
type: DatatypeProperty
type: FunctionalProperty
comment: The beginning of a time interval or the time value of a time instant. Optional (since the interval may be unbounded) but unique.
domain: Temporal region
range: dateTime

has ending
type: DatatypeProperty
type: FunctionalProperty
comment: The end of a time interval or the time value of a time instant. Optional (since the interval may be unbounded) but unique.
domain: Temporal region
range: dateTime

has source
type: ObjectProperty
comment: Indicates an information source from which the subject resource could be obtained.
domain: Information resource
range: Information source

in context
type: Property
comment: Gives the context of a qualified relationship, e.g. the TimeInterval during which a binary property value is valid.
domain: Qualified binary relation

in country
linked concept: inCountry
type: ObjectProperty
comment: The country in which a geographical feature is located.
domain: Geo Feature
range: Country
sub property of: located at

intervalDuring
linked concept: intervalDuring
type: ObjectProperty
comment: Indicates that one time interval (the subject) occurs during the other (object) time interval, i.e. it begins after the object time interval has begun and ends before the object interval ends.
domain: Time interval
range: Time interval

intervalEquals
linked concept: intervalEquals
type: ObjectProperty
comment: Indicates that the two time intervals are the same (same beginning and ending).
domain: Time interval
range: Time interval

intervalFinishes
linked concept: intervalFinishes
type: ObjectProperty
comment: Indicates that one time interval (the subject) finishes the other (object) time interval, i.e. end start at the same time but it starts after the object interval starts.
domain: Time interval
range: Time interval

intervalMeets
linked concept: intervalMeets
type: ObjectProperty
comment: Indicates that one time interval (the subject) meets the other (object) time interval, i.e. it ends as the object interval begins.
domain: Time interval
range: Time interval

intevalOverlaps
linked concept: intervalOverlaps
type: ObjectProperty
comment: Indicates that one time interval (the subject) overlaps the other (object) time interval, i.e. it begins before the object time interval has begun and ends during the object interval ends.
domain: Time interval
range: Time interval

intervalStarts
linked concept: intervalStarts
type: ObjectProperty
comment: Indicates that one time interval (the subject) starts the other (object) time interval, i.e. they start at the same time but it ends before the object interval ends.
domain: Time interval
range: Time interval

linked concept
type: AnnotationProperty
comment: Used to link related concepts across ontologies. In many cases if an application can commit to both source and target ontologies then the linkedConcept relation can be treated as owl:equivalentClass or owl:equivalentProperty. However, in some cases we may not be able to commit to all of the axioms in the linked ontology, for example it might assert two concepts as disjoin where we allow a single entity to be simultaneously regarded from the perspective of both concepts. SHOULD only be used when the concepts are near equivalents, not as a shorthand for "vaguely related somehow".

literal value
type: DatatypeProperty
comment: Gives an data valued argument for an n-ary relationship, such as a weighted relation.
domain: N-ary relation
sub property of: has argument

located at
linked concept: locatedIn
type: ObjectProperty
comment: The location at which a thing exists or is currently situated.
domain: Object
range: Geographic Location

member of
type: ObjectProperty
comment: Indicates that an agent is a member of some group, for example a person being a member of an organization like a Corporation.
domain: Agent
range: Group

object value
type: ObjectProperty
comment: Gives an object (aka Individual) valued argument for an n-ary relationship, such as a weighted relation.
domain: N-ary relation
sub property of: has argument

occurs at
type: ObjectProperty
comment: The location at which an event or process takes place.
domain: Perdurant
range: Geographic Location

occurs at time
type: ObjectProperty
comment: The time or time interval at which an event or process takes place.
domain: Perdurant
range: Temporal region

part of
type: ObjectProperty
comment: General mereology relation of one thing being part of another.
domain: Entity
range: Entity

participant
type: ObjectProperty
comment: Indicates some person or object that partipates in a process or event.

participates in
linked concept: participant-in
type: ObjectProperty
comment: General relationship between things (Endurants) and the processes (Perdurants) in which they might particpate. For example, links a person to their life history or an actor to a business process.
domain: Endurant
range: Perdurant
inverse of: participant

recommended Property
type: AnnotationProperty
comment: Used to link a class to a set of properties that might often be used on instances of the class. Used especially when the properties have an open domain and/or reside in an external namespace to show expected usage patterns that are not obvious from the pure axiom structured on the ontology.

responsible participant
type: ObjectProperty
comment: A person (or other agent) responsible for a particular event or process like a meeting or project.
range: Agent
sub property of: participant

at time
type: DatatypeProperty
comment: gives the time point of a datum in a time-valued function
domain: Datum
range: dateTime

value
type: DatatypeProperty
comment: gives the value of a datum
domain: Datum

version of
type: ObjectProperty
comment: Indicates that one InformationResource is a a version of some other resource. Note this is more restricted relation that dc:source, dc:source could indicate some set of primary references works used in the generation of a wholly new InformationResource whereas versionOf would only be used betweens successive refinements or copies of the essentially the same resource.
domain: Information resource
range: Information resource

weight
type: Property
comment: Gives the probability or other weighted associated with a weighted attribute or relation.
domain: Weighted relation
range: float
sub property of: has argument