Location
range: Thing
domain: Thing
comment: Lage in Bezug auf Länge, Breite oder Attribut geonames oder physikalische Adresse. @de
label: Emplacement @fr
range: location
range: string
label: Lage @de
domain: Monument
domain: Dead people
type: ObjectProperty
term status: testing
comment: Location in terms of longitude, latitude or geonames or street address.
range: ontology
range: wgs84 pos
domain: Grave
comment: Emplacement en terme de longitude, latitude ou attribut geonames ou addresse physique. @fr
domain: http://dbpedia.org/resource/Grave
type: Property
domain: Resource
range: Resource

Statue
subclass of: Resource
subclass of: Thing
type: Class
sub class of: Monument

Tumulus
subclass of: Resource
subclass of: Thing
type: Class
comment: Tumulus is actually the Latin word, but unclear what the appropriate English label is here.
label: Hügelgrab @de
sub class of: Monument

Archaeological dig site
subclass of: Resource
subclass of: Thing
type: Class
comment: A physical location under the administration of an Archaeological organization where graves are being exhumed.
comment: Eine archäologische Ausgrabungsstätte unter der Kontrolle von einer Arbeitsgruppe, wo Ausgrabungen stattfinden. @de
comment: Un site archéologiques sous le controle d'un groupe de recherche où des fouilles prennent place. @fr
label: Archäologische Ausgrabungsstätte @de
label: Site de fouilles archéologiques @fr
sub class of: Dead people
term status: testing

Crypt
subclass of: Resource
subclass of: Thing
type: Class
label: Crypte @fr
label: Krypta @de
sub class of: Monument

Empty Grave
type: Class
equivalent class: http://dbpedia.org/resource/Mass_grave
subclass of: Thing
subclass of: Resource
subclass of: http://dbpedia.org/resource/Mass_grave
equivalent class: Mass Grave
subclass of: Mass Grave
term status: unstable
sub class of: http://lodlaundromat.org/.well-known/genid/3d30c7521bd86ef0d59e4e298ba4f993#2
comment: Vrai si la tombe ne contient pas de depouille. @fr
comment: True if the grave contains no humain remains.
label: ? @de
label: Tombe vide @fr
sub class of: Container of human remains
sub class of: http://lodlaundromat.org/.well-known/genid/3d30c7521bd86ef0d59e4e298ba4f993#1
label: Charnier @fr
label: Beinhaus @de
comment: True if the grave contains more than the remains of one person. This limit is arbitrary and needs debate.
comment: Vrai si la tombe contient plus d'un corps. Cette limite est arbitraire et doit être discuté. @fr
comment: True, wenn das Grab enthält mehr als ein Körper. Diese Grenze ist willkürlich und sollte diskutiert werden. @de
label: Mass Grave
type: Thing
disjoint with: Cemetery
disjoint with: http://dbpedia.org/resource/Cemetery

Mass Grave
subclass of: Resource
equivalent class: http://dbpedia.org/resource/Mass_grave
subclass of: Thing
equivalent class: Empty Grave
subclass of: Empty Grave
subclass of: http://dbpedia.org/resource/Mass_grave
type: Class
sub class of: http://lodlaundromat.org/.well-known/genid/3d30c7521bd86ef0d59e4e298ba4f993#1
label: Charnier @fr
label: Beinhaus @de
comment: True if the grave contains more than the remains of one person. This limit is arbitrary and needs debate.
comment: Vrai si la tombe contient plus d'un corps. Cette limite est arbitraire et doit être discuté. @fr
comment: True, wenn das Grab enthält mehr als ein Körper. Diese Grenze ist willkürlich und sollte diskutiert werden. @de
term status: unstable
sub class of: Container of human remains
label: Empty Grave
sub class of: http://lodlaundromat.org/.well-known/genid/3d30c7521bd86ef0d59e4e298ba4f993#2
comment: Vrai si la tombe ne contient pas de depouille. @fr
comment: True if the grave contains no humain remains.
label: ? @de
label: Tombe vide @fr
type: Thing
disjoint with: http://dbpedia.org/resource/Cemetery
disjoint with: Cemetery

Commemorative plaque
subclass of: Resource
subclass of: Thing
type: Class
comment: A plaque commemorating a deceased person.
label: Gedenktafel @de
label: Plaque commémorative @fr
sub class of: Monument
term status: testing

Monument
subclass of: Thing
subclass of: Resource
type: Class
comment: A physical feature commemorating something or someone.
term status: testing

Remains of this Person
inverse of: Person has remains
range: Thing
domain: Thing
label: Die Überreste dieser Person @de
label: Les restes de cette personne @fr
range: person
comment: A place holder for any information related to the identity of the remains.
type: ObjectProperty
comment: Une reference a l'identité de la personne a qui la depouille appartient. @fr
range: Agent
domain: Human remains
comment: Ein Verweis auf die Identität der Person, die den Körper gehört. @de
type: Property
domain: Resource
range: Resource

Skeleton.
subclass of: Resource
subclass of: Thing
type: Class
label: Un squelette complet. @fr
term status: testing
disjoint with: Partial remains
comment: Diese Eigenschaft bezieht sich auf die Tatsache, dass der Körper all der großen Knochen des menschlichen Skeletts enthält, obwohl einige kleine Knochen fehlt. Die Knochen eines Mitglieds des menschlichen Körpers, ohne ein Skelett oder Schädel-Klassen nicht in dieser Eigenschaft werden. @de
sub class of: Human remains
label: Ein Skelett complet. @de
comment: Cette propriété rapporte le fait que la dépouille comprend tout les gros os du squelette humain, même si quelques petit os manque. Les os d'un membre du corps humain ou un squelette sans crane ne serait pas classes dans cette propriété. @fr
comment: This property is meant to record that all of the larger bones of the skeleton were present. A body part seperatly buried or a skeleton missing a cranium would not be an instance of this property.

Person has remains
range: Thing
domain: Thing
type: ObjectProperty
domain: person
domain: Agent
label: La personne a ces restes @fr
label: Person hat, bleibt @de
range: Human remains
inverse of: Remains of this Person
type: Property
domain: Resource
range: Resource

Human remains
subclass of: Thing
subclass of: Resource
type: Class
label: Die Überreste eines Menschen. @de
label: Restes Humains @fr
term status: testing

http://lodlaundromat.org/.well-known/genid/3d30c7521bd86ef0d59e4e298ba4f993#2
subclass of: Resource
subclass of: Thing
type: Class
type: Restriction
max cardinality: com.hp.hpl.jena.datatypes.BaseDatatype$TypedValue@70a6a3bd
on property: Grave contains remains

Sarcophagus
subclass of: Resource
subclass of: Thing
type: Class
label: Sarcophage @fr
label: Sarkophag @de
sub class of: Monument
term status: testing

Shrine
subclass of: Resource
subclass of: Thing
type: Class
label: Sanctuaire @fr
label: Schrein @de
sub class of: Monument

Cenotaph
subclass of: Resource
subclass of: Thing
type: Class
label: Cénotaphe @fr
label: Kenotaph @de
disjoint with: Tombstone
sub class of: Monument
term status: testing
disjoint with: Headstone
disjoint with: Gravestone

Cemetery
subclass of: http://dbpedia.org/resource/Cemetery
subclass of: Resource
subclass of: Thing
type: Class
equivalent class: http://dbpedia.org/resource/Cemetery
comment: Eine Sammlung von Gräbern in einer administrativen Einheit (keine Masse). @de
label: Friedhof @de
term status: testing
comment: A collection of graves in a single administrative unit. Distinct from a mass-grave.
disjoint with: Mass Grave
label: Cimetière @fr
sub class of: Dead people
comment: Une collection de tombes dans une unitée administrative (et non pas un charnier). @fr
disjoint with: http://dbpedia.org/resource/Mass_grave
disjoint with: Empty Grave
type: Thing

Remains are in Grave
range: Thing
domain: Thing
type: ObjectProperty
domain: Human remains
label: Les restes dans la tombe @fr
label: bleibt, sind in Grab @de
range: Container of human remains
inverse of: Grave contains remains
type: Property
domain: Resource
range: Resource

Grave
subclass of: http://dbpedia.org/resource/Grave
equivalent class: http://dbpedia.org/resource/Grave
subclass of: Thing
subclass of: Resource
type: Class
comment: Ein Grab aus einer oder mehreren Personen. @de
label: Grab @de
sub class of: Container of human remains
label: Tombe @fr
comment: Une tombe d'une ou de plusieurs personne. @fr
comment: A single or mass grave with the remains of human beings.
term status: testing
type: Thing

Commemorated by
range: Thing
domain: Thing
type: ObjectProperty
comment: Records any information as to the Person or Group being commemorated. Not suitable for Events.
domain: Agent
domain: person
label: Commémoré par @fr
range: Monument
label: erinnert @de
inverse of: Commemorates
domain: Container of human remains
type: Property
domain: Resource
range: Resource

contains grave
inverse of: Grave contained by
range: Thing
domain: Thing
type: ObjectProperty
domain: Dead people
label: Contient tombeau @fr
label: Grab enthielt in @de
range: Container of human remains
type: Property
domain: Resource
range: Resource

Grave contains remains
range: Thing
domain: Thing
inverse of: Remains are in Grave
type: ObjectProperty
domain: Container of human remains
label: Contient les restes @fr
label: enthält die Überreste @de
range: Human remains
type: Property
domain: Resource
range: Resource

Gravestone
equivalent class: Headstone
equivalent class: Tombstone
subclass of: Resource
type: Class
subclass of: Thing
subclass of: Headstone
subclass of: Tombstone
comment: Convinience class - redirects to #tombstone.
label: Grabstein @de
label: Pierre Tombale @fr
term status: testing
label: Headstone
type: Thing
disjoint with: Cenotaph
label: Tombstone
sub class of: Monument

Partial remains
subclass of: Resource
subclass of: Thing
type: Class
comment: Peut-être True (vrai), False (Faux) or nil (Declaré inconnue). @fr
comment: Set to True, False or nil (explicit don't know).
comment: Vielleicht True (Wahr), False (Falsch) oder null (erklärt unbekannt). @de
label: Morceau de squelette @fr
label: Teilweise bleibt @de
sub class: Human remains
term status: testing
disjoint with: Skeleton.

Date or interval when the objects were moved.
range: Thing
domain: Thing
type: ObjectProperty
domain: Moved from
label: Moved on
range: TemporalEntity
term status: testing
type: Property
domain: Resource
range: Resource

Moved from
range: Thing
range: Dead people
range: Monument
range: Human remains
range: Container of human remains
domain: Thing
subclass of: Resource
type: Class
type: ObjectProperty
comment: Use this to relate a grave or remains to its original instance elsewhere. Use this for disinterments.
domain: Container of human remains
domain: Dead people
domain: Monument
domain: Human remains
inverse of: Moved from
term status: testing
type: Property
domain: Resource
range: Resource

Grave contained by
range: Thing
domain: Thing
type: ObjectProperty
domain: Container of human remains
label: Tomb durch enthaltenen @de
label: Tombeau contenue par @fr
range: Dead people
inverse of: contains grave
type: Property
domain: Resource
range: Resource

Commemorates
range: Thing
domain: Thing
inverse of: Commemorated by
type: ObjectProperty
comment: Records any information as to the Person or Group being commemorated. Not suitable for Events.
domain: Monument
label: Commémore @fr
label: erinnert @de
range: Container of human remains
range: person
range: Agent
type: Property
domain: Resource
range: Resource

Epitaph
comment: Eine Grabinschrift, auf einem Grabstein gesetzt, der diese in das Grab gelobt. @de
type: DatatypeProperty
comment: The short text honoring the deceased person or persons.
term status: testing
comment: Une inscription funéraire, placée sur une pierre tombale, qui éloge les personne(s) dans la tombe. @fr
domain: Monument
range: string
label: Épitaphe @fr
sub property of: http://dbpedia.org/resource/Epitaph
domain: Thing
domain: Resource
range: Resource
type: Thing
type: Property

Headstone
type: Class
equivalent class: Tombstone
subclass of: Resource
equivalent class: Gravestone
subclass of: Gravestone
subclass of: Tombstone
subclass of: Thing
comment: Convinience class - redirects to #tombstone.
label: Grabstein @de
label: Pierre Tombale @fr
term status: testing
label: Gravestone
type: Thing
disjoint with: Cenotaph
label: Tombstone
sub class of: Monument

Container of human remains
subclass of: Thing
subclass of: Resource
type: Class
comment: A generic class to unify all containers of human remains.
comment: Eine generische Klasse für alle Container von menschlichen Überresten zu vereinheitlichen. @de
comment: Une classe générique pour tout les restes humains. @fr
label: Container von menschlichen Überresten @de
label: Un contenant pour des restes humains. @fr
term status: testing

Human Ashes
subclass of: Resource
subclass of: Thing
type: Class
label: Les cendres dispersées d'un corps humain. Les cendres peuvent être partielle or complète. @fr
label: Streute die Asche eines menschlichen Körpers. Die Asche kann teilweise oder vollständig. @de
sub class: Human remains
term status: testing

Moved from
range: Dead people
inverse of: Moved from
type: Class
range: Container of human remains
range: Human remains
range: Thing
subclass of: Resource
range: Monument
domain: Thing
type: ObjectProperty
comment: Use this to relate a grave or remains to its original instance elsewhere. Use this for disinterments.
domain: Container of human remains
domain: Dead people
domain: Monument
domain: Human remains
term status: testing
type: Property
domain: Resource
range: Resource

Dead people
subclass of: Thing
subclass of: Resource
type: Class
comment: A physical and administrative place with dead people in it. Of the non-zombie kind.
label: Gens mort @fr
label: Menschen starben @de
term status: testing

http://lodlaundromat.org/.well-known/genid/3d30c7521bd86ef0d59e4e298ba4f993#1
subclass of: Resource
subclass of: Thing
type: Class
type: Restriction
min cardinality: com.hp.hpl.jena.datatypes.BaseDatatype$TypedValue@5badf73f
on property: Grave contains remains

Burial_mound
subclass of: #Tumulus
subclass of: Resource
subclass of: Thing
type: Class
equivalent class: #Tumulus
type: Thing

Tombstone
subclass of: Thing
subclass of: Gravestone
subclass of: Resource
subclass of: Headstone
equivalent class: Gravestone
type: Class
equivalent class: Headstone
label: Grabstein @de
label: Pierre Tombale @fr
sub class of: Monument
term status: testing
comment: Convinience class - redirects to #tombstone.
label: Gravestone
type: Thing
disjoint with: Cenotaph
label: Headstone

Location obfuscated
type: DatatypeProperty
comment: The precision of the location informaton has been degraded but the data owner has the original information.
domain: Location
term status: testing
type: Property
domain: Resource

Monument title
range: string
label: Titre du Monument @fr
comment: Le nom du monument, à ne pas confondre avec le nom inscris sur le monument. @fr
comment: The name of the monument; distinct from the inscription on it.
comment: der Name des Denkmals, die nicht mit dem Namen auf dem Denkmal zu verwechseln beizutreten. @de
type: DatatypeProperty
label: Titel des Denkmals @de
term status: testing
domain: Monument
type: Property
domain: Thing
domain: Resource
range: Resource

Cemetery Name
comment: Le nom du cimetière. @fr
comment: Der Name des Friedhofs. @de
label: Nom du Cimetière @fr
type: DatatypeProperty
label: Name des Friedhofs @de
range: string
term status: testing
domain: Dead people
comment: The name of the cemetery.
type: Property
domain: Thing
domain: Resource
range: Resource

Monument person name
label: Nom de la personne @fr
label: Name der Person @de
domain: Monument
comment: The name of the person(s) being honored by the monument.
range: string
comment: der Name der Person / Personen ist / sind durch die Denkmal geehrt. @de
term status: testing
type: DatatypeProperty
comment: Le nom de la personne/des personnes qui est/sont honoré par le monument. @fr
type: Property
domain: Thing
domain: Resource
range: Resource

ID
type: DatatypeProperty
comment: Local ID number for non linked open data processing.
domain: Container of human remains
domain: Dead people
domain: Monument
domain: Human remains
range: string
term status: testing
type: Property
domain: Thing
domain: Resource
range: Resource

The Muninn Graves Ontology
description: The Muninn Graves Ontology is meants to deal with the remainsl of human beings.
type: Ontology
comment: The Muninn Graves Ontology is meants to deal with the remains of human beings.
imports: muninn locations.owl
version info: 0.1