sensing method used
sub property of: topObjectProperty
sub property of: Satisface
property disjoint with: bottomObjectProperty
type: ObjectProperty
source: http://www.bipm.org/en/committees/jc/jcgm/wg2.html
comment: A (measurement) procedure is a detailed description of a measurement according to one or more measurement principles and to a given measurement method, based on a measurement model and including any calculation to obtain a measurement result [VIM 2.6]
label: Método de captación utilizado

Año
disjoint with: Nothing
subclass of: Descripción de la duración
subclass of: Thing
type: Class
subclass of: http://lodlaundromat.org/.well-known/genid/a796ef3c26d6f93ac9d393f7f3ff9a98#12
subclass of: http://lodlaundromat.org/.well-known/genid/a796ef3c26d6f93ac9d393f7f3ff9a98#13
subclass of: http://lodlaundromat.org/.well-known/genid/a796ef3c26d6f93ac9d393f7f3ff9a98#10
subclass of: http://lodlaundromat.org/.well-known/genid/a796ef3c26d6f93ac9d393f7f3ff9a98#11
label: Year @en
subclass of: http://lodlaundromat.org/.well-known/genid/a796ef3c26d6f93ac9d393f7f3ff9a98#16
subclass of: http://lodlaundromat.org/.well-known/genid/a796ef3c26d6f93ac9d393f7f3ff9a98#14
subclass of: http://lodlaundromat.org/.well-known/genid/a796ef3c26d6f93ac9d393f7f3ff9a98#15

Instante
disjoint with: Nothing
disjoint with: Intervalo apropiado
disjoint with: Intervalo de fecha hora
subclass of: Entidad temporal
subclass of: Thing
type: Class
label: Instant @en

Incluye objeto
sub property of: topObjectProperty
property disjoint with: bottomObjectProperty
type: ObjectProperty
label: Includes object @en

Es localización de
sub property of: topObjectProperty
property disjoint with: bottomObjectProperty
type: ObjectProperty
label: Is location of @en

Intervalo antes
property disjoint with: Tiene comienzo
property disjoint with: Dentro
property disjoint with: En fecha hora
sub property of: topObjectProperty
property disjoint with: bottomObjectProperty
property disjoint with: Tiene final
sub property of: Antes
type: ObjectProperty
inverse of: Intervalo después
domain: Intervalo apropiado
range: Intervalo apropiado
comment: Interval before @en
label: Interval before @en

Designa el límite administrativo
sub property of: topObjectProperty
property disjoint with: bottomObjectProperty
type: ObjectProperty
label: Designates administrative limit @en

System Lifetime
disjoint with: Nothing
subclass of: Survival Property
subclass of: Calidad
subclass of: Property
subclass of: Thing
type: Class
comment: Total useful life of a sensor/system (expressed as total life since manufacture, time in use, number of operations, etc.).
label: Vida del sistema

has measurement capability
sub property of: topObjectProperty
sub property of: Tiene calidad
sub property of: has property
property disjoint with: bottomObjectProperty
type: ObjectProperty
comment: Relation from a Sensor to a MeasurementCapability describing the measurement properties of the sensor.
label: Tiene capacidad de medición

Intervalo finaliza
property disjoint with: Tiene comienzo
property disjoint with: bottomObjectProperty
property disjoint with: Dentro
property disjoint with: Tiene final
inverse of: Intervalo finalizado por
property disjoint with: En fecha hora
sub property of: topObjectProperty
type: ObjectProperty
domain: Intervalo apropiado
range: Intervalo apropiado
label: Interval finishes @en

En fecha hora
property disjoint with: Intervalo durante
sub property of: topObjectProperty
property disjoint with: Intervalo finalizado por
property disjoint with: Intervalo equivale
property disjoint with: bottomObjectProperty
property disjoint with: Intervalo finaliza
property disjoint with: Intervalo después
property disjoint with: Intervalo comienza
property disjoint with: Intervalo contiene
property disjoint with: Intervalo cumple
type: ObjectProperty
property disjoint with: Intervalo comenzado por
property disjoint with: Intervalo solapado por
property disjoint with: Intervalo antes
property disjoint with: Intervalo cumplido por
property disjoint with: Intervalo solapa
property disjoint with: Tiene descripción de fecha hora
domain: Instante
range: Descripción fecha hora
label: In date time @en

Método
disjoint with: Nothing
subclass of: Thing
type: Class
label: Method @en

Minutos
property disjoint with: Fecha hora XSD
property disjoint with: Mes
property disjoint with: Fecha hora en formato XSD
type: DatatypeProperty
property disjoint with: Año
property disjoint with: bottomDataProperty
property disjoint with: Día
sub property of: topDataProperty
property disjoint with: nombre estación
domain: Descripción de la duración
range: decimal
label: Minutes @en

location
sub property of: topObjectProperty
sub property of: based near
property disjoint with: bottomObjectProperty
sub property of: Localizado en
equivalent property: Localizado en
type: ObjectProperty
label: Location @en
comment: The relation between something and the point, or other geometrical thing in space, where it is. For example, the realtionship between a radio tower and a Point with a given lat and long. Or a relationship between a park and its outline as a closed arc of points, or a road and its location as a arc (a sequence of points). Clearly in practice there will be limit to the accuracy of any such statement, but one would expect an accuracy appropriate for the size of the object and uses such as mapping
range: SpatialThing
label: Localización

on platform
sub property of: topObjectProperty
sub property of: Tiene localización
property disjoint with: bottomObjectProperty
inverse of: attached system
type: ObjectProperty
comment: Relation between a System (e.g., a Sensor) and a Platform. The relation locates the sensor relative to other described entities entities: i.e., the Sensor s1's location is Platform p1. More precise locations for sensors in space (relative to other entities, where attached to another entity, or in 3D space) are made using DOLCE's Regions (SpaceRegion).
label: En plataforma

Semana
type: DatatypeProperty
property disjoint with: Fecha hora XSD
property disjoint with: Día
property disjoint with: bottomDataProperty
property disjoint with: nombre estación
sub property of: topDataProperty
property disjoint with: Mes
property disjoint with: Año
property disjoint with: Fecha hora en formato XSD
domain: Descripción fecha hora
range: nonNegativeInteger
label: Week @en

Output
disjoint with: Input
disjoint with: Nothing
subclass of: Thing
type: Class
comment: Any information that is reported from a process. [MMI OntDev]
source: http://marinemetadata.org/community/teams/ontdevices
label: Salida

Tiene final
property disjoint with: Intervalo finalizado por
property disjoint with: Intervalo equivale
sub property of: topObjectProperty
property disjoint with: Intervalo comienza
property disjoint with: Intervalo comenzado por
property disjoint with: Intervalo finaliza
property disjoint with: Intervalo antes
property disjoint with: Intervalo durante
type: ObjectProperty
property disjoint with: Intervalo contiene
property disjoint with: Intervalo cumplido por
property disjoint with: Intervalo solapa
property disjoint with: Intervalo solapado por
property disjoint with: Intervalo cumple
property disjoint with: Intervalo después
property disjoint with: bottomObjectProperty
domain: Entidad temporal
range: Instante
label: Has end @en

Valor del dato observado
sub property of: topDataProperty
property disjoint with: bottomDataProperty
type: DatatypeProperty
comment: En esta versión el tiempo presente (tabla 4680) se representa con literales. En la siguiente versión se refinará el modelado de esta parte.
domain: Sensor Output
label: Value of observed data @en
range: Literal

Propiedad ambiental sobre presión
disjoint with: Nothing
subclass of: Propiedad ambiental
subclass of: Calidad
subclass of: Property
subclass of: Thing
type: Class
comment: Agrupa las propiedades ambientales sobre presión.
label: Pressure ambient property @en

Sensitivity
disjoint with: Nothing
subclass of: Calidad
subclass of: Property
subclass of: Thing
subclass of: Measurement Property
type: Class
source: skos:exactMatch 'sensitivity' [VIM 4.12] http://www.bipm.org/utils/common/documents/jcgm/JCGM_200_2008.pdf
comment: Sensitivity is the quotient of the change in a result of sensor and the corresponding change in a value of a quality being observed.
label: Sensibilidad

Property
disjoint with: Nothing
subclass of: Calidad
subclass of: Thing
type: Class
subclass of: http://lodlaundromat.org/.well-known/genid/b376e9a0a07605e42f1b1bc7a2ca30eb#19
comment: An observable Quality of an Event or Object. That is, not a quality of an abstract entity as is also allowed by DUL's Quality, but rather an aspect of an entity that is intrinsic to and cannot exist without the entity and is observable by a sensor.
source: skos:exactMatch 'property' [O&M] http://www.opengeospatial.org/standards/om
label: Propiedad

System
disjoint with: Nothing
subclass of: Objeto físico
subclass of: Thing
type: Class
source: http://www.w3.org/2005/Incubator/ssn/
subclass of: http://lodlaundromat.org/.well-known/genid/b376e9a0a07605e42f1b1bc7a2ca30eb#32
subclass of: http://lodlaundromat.org/.well-known/genid/b376e9a0a07605e42f1b1bc7a2ca30eb#31
comment: System is a unit of abstraction for pieces of infrastructure (and we largely care that they are) for sensing. A system has components, its subsystems, which are other systems.
subclass of: http://lodlaundromat.org/.well-known/genid/b376e9a0a07605e42f1b1bc7a2ca30eb#27
subclass of: http://lodlaundromat.org/.well-known/genid/b376e9a0a07605e42f1b1bc7a2ca30eb#29
subclass of: http://lodlaundromat.org/.well-known/genid/b376e9a0a07605e42f1b1bc7a2ca30eb#28
subclass of: http://lodlaundromat.org/.well-known/genid/b376e9a0a07605e42f1b1bc7a2ca30eb#30
label: Sistema

Sensor
type: Class
subclass of: Sensor
subclass of: Thing
disjoint with: Nothing
subclass of: Objeto
subclass of: http://lodlaundromat.org/.well-known/genid/b376e9a0a07605e42f1b1bc7a2ca30eb#3
equivalent class: Sensor
subclass of: Objeto físico
comment: Posible punto de extensión para incluir la ontología del w3c Ssn

Día del año
property disjoint with: Año
property disjoint with: Mes
property disjoint with: Fecha hora XSD
type: DatatypeProperty
sub property of: topDataProperty
property disjoint with: Día
property disjoint with: Fecha hora en formato XSD
property disjoint with: nombre estación
property disjoint with: bottomDataProperty
domain: Descripción fecha hora
range: nonNegativeInteger
label: Day of year @en

Intervalo finalizado por
property disjoint with: Tiene comienzo
inverse of: Intervalo finaliza
property disjoint with: En fecha hora
property disjoint with: Tiene final
property disjoint with: Dentro
sub property of: topObjectProperty
property disjoint with: bottomObjectProperty
type: ObjectProperty
label: Interval finished by @en

Observado por
sub property of: topObjectProperty
sub property of: Incluye objeto
property disjoint with: bottomObjectProperty
inverse of: made observation
type: ObjectProperty
label: Observed by @en

Input
disjoint with: Nothing
disjoint with: Output
subclass of: Thing
type: Class
source: http://marinemetadata.org/community/teams/ontdevices
comment: Any information that is provided to a process for its use [MMI OntDev]
label: Entrada

deployed on platform
sub property of: topObjectProperty
sub property of: Tiene participante
property disjoint with: bottomObjectProperty
inverse of: in deployment
type: ObjectProperty
comment: Relation between a deployment and the platform on which the system was deployed.
label: Desplegado en plataforma

Intervalo cumplido por
type: ObjectProperty
property disjoint with: En fecha hora
property disjoint with: Tiene comienzo
property disjoint with: bottomObjectProperty
property disjoint with: Tiene final
sub property of: topObjectProperty
property disjoint with: Dentro
inverse of: Intervalo cumple
label: Interval met by @en

Tiene descripción de duración
sub property of: topObjectProperty
property disjoint with: bottomObjectProperty
type: ObjectProperty
domain: Entidad temporal
range: Descripción de la duración
label: Has duration description @en

SpatialThing
disjoint with: Nothing
subclass of: http://lodlaundromat.org/.well-known/genid/2e99a4ec08762bee318b267c5d104289#1
subclass of: http://lodlaundromat.org/.well-known/genid/d5e8cafd5833f18c9c214938a7904a12#1
subclass of: Thing
type: Class
label: Spatial thing @en
comment: Anything with spatial extent, i.e. size, shape, or position. e.g. people, places, bowling balls, as well as abstract areas like cubes.
label: Cosa espacial

Intervalo solapado por
property disjoint with: bottomObjectProperty
property disjoint with: En fecha hora
inverse of: Intervalo solapa
type: ObjectProperty
property disjoint with: Dentro
property disjoint with: Tiene comienzo
property disjoint with: Tiene final
sub property of: topObjectProperty
label: Interval overlapped by @en

Latency
disjoint with: Nothing
subclass of: Calidad
subclass of: Property
subclass of: Thing
subclass of: Measurement Property
type: Class
comment: The time between a request for an observation and the sensor providing a result.
label: Latencia

Accuracy
disjoint with: Nothing
subclass of: Calidad
subclass of: Property
subclass of: Thing
subclass of: Measurement Property
type: Class
source: skos:exactMatch 'measurement accuracy/accuracy' [VIM 2.13] http://www.bipm.org/utils/common/documents/jcgm/JCGM_200_2008.pdf
comment: The closeness of agreement between the value of an observation and the true value of the observed quality.
label: Precisión

Día de la semana
disjoint with: Nothing
subclass of: Thing
type: Class
one of: http://lodlaundromat.org/.well-known/genid/a796ef3c26d6f93ac9d393f7f3ff9a98#35
label: Day of week @en

in condition
sub property of: topObjectProperty
property disjoint with: bottomObjectProperty
type: ObjectProperty
comment: Describes the prevailing environmental conditions for MeasurementCapabilites, OperatingConditions and SurvivalRanges. Used for example to say that a sensor has a particular accuracy in particular conditions. (see also MeasurementCapability)
label: En condición

Platform
disjoint with: Nothing
subclass of: Objeto físico
subclass of: Thing
type: Class
subclass of: http://lodlaundromat.org/.well-known/genid/b376e9a0a07605e42f1b1bc7a2ca30eb#46
label: Plataforma
source: skos:exactMatch 'platform' [SensorML OGC-0700] http://www.opengeospatial.org/standards/sensorml
subclass of: http://lodlaundromat.org/.well-known/genid/b376e9a0a07605e42f1b1bc7a2ca30eb#47
comment: An Entity to which other Entities can be attached - particuarly Sensors and other Platforms. For example, a post might act as the Platform, a bouy might act as a Platform, or a fish might act as a Platform for an attached sensor.

Intervalo
disjoint with: Nothing
subclass of: Entidad temporal
subclass of: Thing
type: Class
label: Interval @en

Higrómetro
subclass of: http://lodlaundromat.org/.well-known/genid/b376e9a0a07605e42f1b1bc7a2ca30eb#3
subclass of: Sensor
type: Class
subclass of: Thing
subclass of: Objeto físico
subclass of: Objeto
disjoint with: Nothing
comment: Mide la humedad relativa en %
label: Hygrometer @en

Localizacion coordenadas
sub property of: topObjectProperty
sub property of: Localizado en
sub property of: location
sub property of: based near
property disjoint with: bottomObjectProperty
type: ObjectProperty
comment: Indica las coordinadas en las que está localizado un sensor.
domain: Sensor
label: Coordinates location @en
range: SpatialThing

observation result
sub property of: topObjectProperty
sub property of: Es parámetro para
property disjoint with: bottomObjectProperty
type: ObjectProperty
source: skos:closeMatch 'result' [O&M - ISO/DIS 19156] http://portal.opengeospatial.org/files/?artifact_id=41579
comment: Relation linking an Observation (i.e., a description of the context, the Situation, in which the observatioin was made) and a Result, which contains a value representing the value associated with the observed Property.
label: Resultado de observación

Measurement Capability
disjoint with: Nothing
subclass of: Calidad
subclass of: Property
subclass of: Thing
type: Class
comment: Collects together measurement properties (accuracy, range, precision, etc) and the environmental conditions in which those properties hold, representing a specification of a sensor's capability in those conditions. The conditions specified here are those that affect the measurement properties, while those in OperatingRange represent the sensor's standard operating conditions, including conditions that don't affect the observations.
label: Capacidad de medida
subclass of: http://lodlaundromat.org/.well-known/genid/b376e9a0a07605e42f1b1bc7a2ca30eb#40
subclass of: http://lodlaundromat.org/.well-known/genid/b376e9a0a07605e42f1b1bc7a2ca30eb#42
subclass of: http://lodlaundromat.org/.well-known/genid/b376e9a0a07605e42f1b1bc7a2ca30eb#41
source: Similar idea to MeasurementCapability in MMI Device Ontology http://marinemetadata.org/community/teams/ontdevices But the the two express the relationship between constraints and multiple measurement properties differently. The conditions linked to a MeasurementCapability are skos:exactMatch to 'influence quantity' [VIM 2.52] http://www.bipm.org/utils/common/documents/jcgm/JCGM_200_2008.pdf

Está descrito por
sub property of: topObjectProperty
property disjoint with: bottomObjectProperty
type: ObjectProperty
label: Is described by @en

Response time
disjoint with: Nothing
subclass of: Calidad
subclass of: Property
subclass of: Thing
subclass of: Measurement Property
type: Class
comment: The time between a (step) change inthe value of an observed quality and a sensor (possibly with specified error) 'settling' on an observed value.
source: skos:exactMatch 'step response time' [VIM 4.23] http://www.bipm.org/utils/common/documents/jcgm/JCGM_200_2008.pdf
label: Tiempo de respuesta

detection limit
disjoint with: Nothing
subclass of: Calidad
subclass of: Property
subclass of: Thing
subclass of: Measurement Property
type: Class
source: skos:exactMatch 'detection limit' [VIM 4.18] http://www.bipm.org/utils/common/documents/jcgm/JCGM_200_2008.pdf
comment: An observed value for which the probability of falsely claiming the absence of a component in a material is Î², given a probability Î± of falsely claiming its presence.
label: Límite de detección

Drift
disjoint with: Nothing
subclass of: Calidad
subclass of: Property
subclass of: Thing
subclass of: Measurement Property
type: Class
comment: A, continuous or incremental, change in the reported values of observations over time for an unchanging quality.
source: skos:exactMatch 'instrumental drift' [VIM 4.21] http://www.bipm.org/utils/common/documents/jcgm/JCGM_200_2008.pdf
label: Deriva

Deployment
disjoint with: Nothing
subclass of: Deployment-related Process
subclass of: Proceso
subclass of: Thing
type: Class
subclass of: http://lodlaundromat.org/.well-known/genid/b376e9a0a07605e42f1b1bc7a2ca30eb#44
comment: The ongoing Process of Entities (for the purposes of this ontology, mainly sensors) deployed for a particular purpose. For example, a particular Sensor deployed on a Platform, or a whole network of Sensors deployed for an observation campaign. The deployment may have sub processes, such as installation, maintenance, addition, and decomissioning and removal.
label: Despliegue
source: skos:closeMatch 'Deployment' [MMI Dev] http://marinemetadata.org/community/teams/ontdevices
subclass of: http://lodlaundromat.org/.well-known/genid/b376e9a0a07605e42f1b1bc7a2ca30eb#43

Artefacto designado
disjoint with: Nothing
subclass of: Thing
type: Class
label: Designed artifact @en

has subsystem
sub property of: topObjectProperty
sub property of: Tiene parte
property disjoint with: bottomObjectProperty
type: ObjectProperty
comment: Haspart relation between a system and its parts.
label: Tiene subsistema

Reloj
subclass of: Objeto
subclass of: Objeto físico
subclass of: http://lodlaundromat.org/.well-known/genid/b376e9a0a07605e42f1b1bc7a2ca30eb#3
subclass of: Sensor
disjoint with: Nothing
subclass of: Thing
type: Class
comment: Mide el tiempo en UTC
label: Clock @en

altitude
sub property of: topObjectProperty
property disjoint with: bottomObjectProperty
type: ObjectProperty
comment: The WGS84 altitude of a SpatialThing (decimal meters above the local reference ellipsoid).
domain: SpatialThing

geo
type: Thing
type: NamedIndividual
description: A vocabulary for representing latitude, longitude and altitude information in the WGS84 geodetic reference datum. Version $Id: wgs84_pos.rdf,v 1.22 2009/04/20 15:00:30 timbl Exp $. See http://www.w3.org/2003/01/geo/ for more details.
comment: Recent changes to this namespace: $Log: wgs84_pos.rdf,v $ Revision 1.22 2009/04/20 15:00:30 timbl Remove the time bits which have been deal with elsewhere eg in iCal. Revision 1.21 2009/04/20 12:52:47 timbl try again Revision 1.20 2009/04/20 12:42:11 timbl Add Event (edited ages ago and never checked in), and location (following discussion http://chatlogs.planetrdf.com/swig/2009-04-20#T12-36-09) Revision 1.19 2009/04/20 12:36:31 timbl Add Event (edited ages ago and never checked in), and location (following discussion http://chatlogs.planetrdf.com/swig/2009-04-20#T12-36-09) Revision 1.18 2006/02/01 22:01:04 danbri Clarified that lat and long are decimal degrees, and that alt is decimal metres about local reference ellipsoid Revision 1.17 2004/02/06 17:38:12 danbri Fixed a bad commit screwup Revision 1.15 2003/04/19 11:24:08 danbri Fixed the typo even more. Revision 1.14 2003/04/19 11:16:56 danbri fixed a typo Revision 1.13 2003/02/19 22:27:27 connolly relaxed domain constraints on lat/long/alt from Point to SpatialThing Revision 1.12 2003/01/12 01:41:41 danbri Trying local copy of XSLT doc. Revision 1.11 2003/01/12 01:20:18 danbri added a link to morten's xslt rdfs viewer. Revision 1.10 2003/01/11 18:56:49 danbri Removed datatype range from lat and long properties, since they would have required each occurance of the property to mention the datatype. Revision 1.9 2003/01/11 11:41:31 danbri Another typo; repaired rdfs:Property to rdf:Property x4 Revision 1.8 2003/01/11 11:05:02 danbri Added an rdfs:range for each lat/long/alt property, http://www.w3.org/2001/XMLSchema#float Revision 1.7 2003/01/10 20:25:16 danbri Longer rdfs:comment for Point, trying to be Earth-centric and neutral about coordinate system(s) at the same time. Feedback welcomed. Revision 1.6 2003/01/10 20:18:30 danbri Added CVS log comments into the RDF/XML as an rdfs:comment property of the vocabulary. Note that this is not common practice (but seems both harmless and potentially useful). revision 1.…
date: $Date: 2009/04/20 15:00:30 $
title: WGS84 Geo Positioning: an RDF vocabulary

Antes
sub property of: topObjectProperty
property disjoint with: bottomObjectProperty
inverse of: Después
type: TransitiveProperty
type: ObjectProperty
domain: Entidad temporal
range: Entidad temporal
comment: Before @en
label: Before @en

Heliógrafo
disjoint with: Nothing
subclass of: Thing
subclass of: http://lodlaundromat.org/.well-known/genid/b376e9a0a07605e42f1b1bc7a2ca30eb#3
subclass of: Sensor
type: Class
subclass of: Objeto
subclass of: Objeto físico
comment: Mide la duración de la insolación en horas
label: Heliograph @en

Objeto físico
disjoint with: Nothing
subclass of: Thing
type: Class
label: Physical object @en

observed property
sub property of: topObjectProperty
sub property of: Es parámetro para
property disjoint with: bottomObjectProperty
type: ObjectProperty
source: skos:exactMatch 'observedProperty' [O&M - ISO/DIS 19156]
comment: Relation linking an Observation to the Property that was observed. The observedProperty should be a Property (hasProperty) of the FeatureOfInterest (linked by featureOfInterest) of this observation.
source: skos:exactMatch 'observedProperty' [O&M - ISO/DIS 19156] http://portal.opengeospatial.org/files/?artifact_id=41579
label: Propiedad observada

Designado por el límite administrativo directamente
sub property of: topObjectProperty
property disjoint with: bottomObjectProperty
type: ObjectProperty
label: Designated directly by administrative limit @en

Intervalo de fecha hora
disjoint with: Instante
disjoint with: Nothing
subclass of: Intervalo
subclass of: Intervalo apropiado
subclass of: Entidad temporal
subclass of: Thing
type: Class
label: Date time interval @en

Observation Value
disjoint with: Nothing
subclass of: Región
subclass of: Thing
type: Class
subclass of: http://lodlaundromat.org/.well-known/genid/b376e9a0a07605e42f1b1bc7a2ca30eb#52
comment: The value of the result of an Observation. An Observation has a result which is the output of some sensor, the result is an information object that encodes some value for a Feature.
source: skos:exactMatch 'measured quantity value' [VIM 2.10] http://www.bipm.org/utils/common/documents/jcgm/JCGM_200_2008.pdf skos:exactMatch 'observed value' [SensorML OGC-0700] http://www.opengeospatial.org/standards/sensorml skos:closeMatch 'observation result' [O&M] http://www.opengeospatial.org/standards/om O&M conflates what we have as SensorOutput and ObservationValue into observation result, though the OGC standard does say "result contains a value" and "a result which has a value", which fits naturally with the model here.
label: Valor de observación

Measurement Range
disjoint with: Nothing
subclass of: Calidad
subclass of: Property
subclass of: Thing
subclass of: Measurement Property
type: Class
comment: The set of values that the sensor can return as the result of an observation under the defined conditions with the defined measurement properties. (If no conditions are specified or the conditions do not specify a range for the observed qualities, the measurement range is to be taken as the condition for the observed qualities.)
source: skos:exactMatch 'measuring interval/measurement range' [VIM 4.7] http://www.bipm.org/utils/common/documents/jcgm/JCGM_200_2008.pdf
label: Rango de medida

Area administrativa
disjoint with: Nothing
subclass of: http://lodlaundromat.org/.well-known/genid/2e99a4ec08762bee318b267c5d104289#1
subclass of: http://lodlaundromat.org/.well-known/genid/d5e8cafd5833f18c9c214938a7904a12#1
subclass of: Thing
type: Class
label: Administrative area @en
comment: Distrito delimitado para fines administrativos.

observation sampling time
sub property of: topObjectProperty
sub property of: Tiene región
property disjoint with: bottomObjectProperty
type: ObjectProperty
comment: Rebadged as phenomenon time in [O&M]. The phenomenon time shall describe the time that the result applies to the property of the feature-of-interest. This is often the time of interaction by a sampling procedure or observation procedure with a real-world feature.
source: http://www.opengeospatial.org/standards/om
comment: The sampling time is the time that the result applies to the feature-of-interest. This is the time usually required for geospatial analysis of the result.
label: Hora del muestreo de la observación

is produced by
sub property of: topObjectProperty
property disjoint with: bottomObjectProperty
type: ObjectProperty
comment: Relation between a producer and a produced entity: for example, between a sensor and the produced output.
label: Es producido por

Es participante
sub property of: topObjectProperty
property disjoint with: bottomObjectProperty
type: ObjectProperty
label: Is participantin @en

has input
sub property of: topObjectProperty
property disjoint with: bottomObjectProperty
type: ObjectProperty
label: Tiene entrada

Semanas
sub property of: topDataProperty
property disjoint with: nombre estación
property disjoint with: Año
property disjoint with: Fecha hora en formato XSD
type: DatatypeProperty
property disjoint with: Fecha hora XSD
property disjoint with: Mes
property disjoint with: bottomDataProperty
property disjoint with: Día
domain: Descripción de la duración
range: decimal
label: Weeks @en

Device
disjoint with: Nothing
subclass of: System
subclass of: Objeto físico
subclass of: Thing
subclass of: Artefacto designado
type: Class
comment: A device is a physical piece of technology - a system in a box. Devices may of course be built of smaller devices and software components (i.e. systems have components).
source: http://www.w3.org/2005/Incubator/ssn/
label: Dispositivo

has output
sub property of: topObjectProperty
property disjoint with: bottomObjectProperty
type: ObjectProperty
label: Tiene salida

Es parámetro para
sub property of: topObjectProperty
property disjoint with: bottomObjectProperty
type: ObjectProperty
label: Is setting for @en

condicion meteorologica
type: Feature of Interest
type: http://lodlaundromat.org/.well-known/genid/b376e9a0a07605e42f1b1bc7a2ca30eb#3
type: Thing
type: NamedIndividual

Survival Property
disjoint with: Nothing
subclass of: Calidad
subclass of: Property
subclass of: Thing
type: Class
comment: An identifiable characteristic that represents the extent of the sensors useful life. Might include for example total battery life or number of recharges, or, for sensors that are used only a fixed number of times, the number of observations that can be made before the sensing capability is depleted.
label: Propiedad de supervivencia

Intervalo comienza
property disjoint with: Dentro
property disjoint with: Tiene comienzo
property disjoint with: Tiene final
type: ObjectProperty
property disjoint with: bottomObjectProperty
inverse of: Intervalo comenzado por
sub property of: topObjectProperty
property disjoint with: En fecha hora
domain: Intervalo apropiado
range: Intervalo apropiado
label: Interval starts @en

Días
property disjoint with: bottomDataProperty
property disjoint with: Día
type: DatatypeProperty
property disjoint with: Fecha hora en formato XSD
property disjoint with: Mes
property disjoint with: nombre estación
property disjoint with: Año
sub property of: topDataProperty
property disjoint with: Fecha hora XSD
domain: Descripción de la duración
range: decimal
label: Days @en

has deployment
sub property of: topObjectProperty
sub property of: Es participante
property disjoint with: bottomObjectProperty
inverse of: deployed system
type: ObjectProperty
comment: Relation between a System and a Deployment, recording that the System/Sensor was deployed in that Deployment.
label: Tiene despliegue

Propiedad ambiental
disjoint with: Nothing
subclass of: Calidad
subclass of: Property
subclass of: Thing
type: Class
comment: Concepto que agrupa las propiedades ambientales que se pueden observar.
label: Ambient property @en

end time
sub property of: topObjectProperty
sub property of: Tiene región
property disjoint with: bottomObjectProperty
type: ObjectProperty
label: Hora de finalización

Termometro seco
subclass of: Sensor
subclass of: http://lodlaundromat.org/.well-known/genid/b376e9a0a07605e42f1b1bc7a2ca30eb#3
subclass of: Termómetro
type: Class
disjoint with: Nothing
subclass of: Objeto físico
subclass of: Objeto
subclass of: Thing
comment: Mide la temperatura en grados Celsius. Mide la temperatura del aire.
label: Dry bulb thermometer @en

Tipo de unidad
sub property of: topObjectProperty
property disjoint with: bottomObjectProperty
type: ObjectProperty
domain: Descripción fecha hora
range: Unidad temporal
label: Unit type @en

Evento
disjoint with: Nothing
subclass of: http://lodlaundromat.org/.well-known/genid/b376e9a0a07605e42f1b1bc7a2ca30eb#3
subclass of: Thing
type: Class
label: Event @en

in deployment
sub property of: topObjectProperty
sub property of: Es participante
property disjoint with: bottomObjectProperty
inverse of: deployed on platform
type: ObjectProperty
comment: Relation between a Platform and a Deployment, recording that the object was used as a platform for a system/sensor for a particular deployment: as in this PhysicalObject is acting as a Platform inDeployment Deployment.
label: En despliegue

Intervalo durante
property disjoint with: Tiene comienzo
inverse of: Intervalo contiene
property disjoint with: Dentro
property disjoint with: bottomObjectProperty
sub property of: topObjectProperty
property disjoint with: En fecha hora
type: ObjectProperty
property disjoint with: Tiene final
domain: Intervalo apropiado
range: Intervalo apropiado
label: Interval during @en

observation result time
sub property of: topObjectProperty
sub property of: Tiene región
property disjoint with: bottomObjectProperty
type: ObjectProperty
comment: The result time is the time when the procedure associated with the observation act was applied.
comment: The result time shall describe the time when the result became available, typically when the procedure associated with the observation was completed For some observations this is identical to the phenomenonTime. However, there are important cases where they differ.[O&M]
source: http://www.opengeospatial.org/standards/om
label: Hora del resultado de la observación

Tiene calidad
sub property of: topObjectProperty
property disjoint with: bottomObjectProperty
type: ObjectProperty
label: Has quality @en

Operating Range
disjoint with: Nothing
subclass of: Calidad
subclass of: Property
subclass of: Thing
type: Class
source: skos:broaderMatch 'reference operating condition' [VIM 4.11] http://www.bipm.org/utils/common/documents/jcgm/JCGM_200_2008.pdf The difference is that here we also allow for qualities that aren't VIM influence quantities [VIM 2.52] - for example, a quantity that alters the power requirements, but doesn't affect the measurement properties - conditions specified in MeasurementCapability should be influence quantities.
label: Rango de operación
comment: The environmental conditions and characteristics of a system/sensor's normal operating environment. Can be used to specify for example the standard environmental conditions in which the sensor is expected to operate (a Condition with no OperatingProperty), or how the environmental and other operating properties relate: i.e., that the maintenance schedule or power requirements differ according to the conditions.
subclass of: http://lodlaundromat.org/.well-known/genid/b376e9a0a07605e42f1b1bc7a2ca30eb#48
subclass of: http://lodlaundromat.org/.well-known/genid/b376e9a0a07605e42f1b1bc7a2ca30eb#49

Descripción fecha hora
disjoint with: Nothing
subclass of: Thing
type: Class
subclass of: http://lodlaundromat.org/.well-known/genid/a796ef3c26d6f93ac9d393f7f3ff9a98#33
subclass of: http://lodlaundromat.org/.well-known/genid/a796ef3c26d6f93ac9d393f7f3ff9a98#24
subclass of: http://lodlaundromat.org/.well-known/genid/a796ef3c26d6f93ac9d393f7f3ff9a98#30
subclass of: http://lodlaundromat.org/.well-known/genid/a796ef3c26d6f93ac9d393f7f3ff9a98#29
subclass of: http://lodlaundromat.org/.well-known/genid/a796ef3c26d6f93ac9d393f7f3ff9a98#26
subclass of: http://lodlaundromat.org/.well-known/genid/a796ef3c26d6f93ac9d393f7f3ff9a98#31
subclass of: http://lodlaundromat.org/.well-known/genid/a796ef3c26d6f93ac9d393f7f3ff9a98#25
subclass of: http://lodlaundromat.org/.well-known/genid/a796ef3c26d6f93ac9d393f7f3ff9a98#32
subclass of: http://lodlaundromat.org/.well-known/genid/a796ef3c26d6f93ac9d393f7f3ff9a98#34
subclass of: http://lodlaundromat.org/.well-known/genid/a796ef3c26d6f93ac9d393f7f3ff9a98#28
label: Date time description @en
subclass of: http://lodlaundromat.org/.well-known/genid/a796ef3c26d6f93ac9d393f7f3ff9a98#27

Intervalo apropiado
disjoint with: Instante
disjoint with: Nothing
subclass of: Intervalo
subclass of: Entidad temporal
subclass of: Thing
type: Class
label: Proper interval @en

Segundos
property disjoint with: Fecha hora XSD
property disjoint with: Año
property disjoint with: Fecha hora en formato XSD
property disjoint with: Mes
property disjoint with: bottomDataProperty
sub property of: topDataProperty
property disjoint with: Día
type: DatatypeProperty
property disjoint with: nombre estación
domain: Descripción de la duración
range: decimal
label: Seconds @en

The Aemet Ontology Network
description: Ontology network for the AEMET project. This model describes meteorological information. @en
creator: María Poveda Villalón
type: Thing
type: Ontology
imports: describevar.owl
comment: Red de ontologías para el proyecto AEMET
imports: Semantic Sensor Network Ontology
imports: time
imports: localizacion.owl

has survival property
sub property of: topObjectProperty
sub property of: Tiene calidad
sub property of: has property
property disjoint with: bottomObjectProperty
type: ObjectProperty
comment: Relation from a SurvivalRange to a Property describing the survial range of a system. For example, to the temperature extreme that a system can withstand before being considered damaged.
label: Tiene propiedad de supervivencia

Minuto
property disjoint with: nombre estación
property disjoint with: Fecha hora en formato XSD
type: DatatypeProperty
property disjoint with: bottomDataProperty
property disjoint with: Fecha hora XSD
property disjoint with: Día
property disjoint with: Año
sub property of: topDataProperty
property disjoint with: Mes
domain: Descripción fecha hora
range: nonNegativeInteger
label: Minute @en

Objeto
disjoint with: Nothing
subclass of: http://lodlaundromat.org/.well-known/genid/b376e9a0a07605e42f1b1bc7a2ca30eb#3
subclass of: Thing
type: Class
label: Object @en

nombre estación
sub property of: topDataProperty
property disjoint with: Segundo
property disjoint with: Meses
property disjoint with: bottomDataProperty
property disjoint with: Día del año
property disjoint with: Horas
property disjoint with: Fecha hora XSD
property disjoint with: Minuto
property disjoint with: Día
property disjoint with: Minutos
property disjoint with: Fecha hora en formato XSD
property disjoint with: Años
property disjoint with: Mes
type: DatatypeProperty
property disjoint with: Año
property disjoint with: Calidad del dato observado
property disjoint with: Semanas
property disjoint with: Semana
property disjoint with: Segundos
property disjoint with: Días
property disjoint with: Hora
comment: Indica el nombre de la estación meteorológica.
domain: Estación meteorológica
label: Station name @en
range: string

Intervalo contiene
property disjoint with: Tiene comienzo
type: ObjectProperty
property disjoint with: bottomObjectProperty
property disjoint with: En fecha hora
property disjoint with: Dentro
property disjoint with: Tiene final
inverse of: Intervalo durante
sub property of: topObjectProperty
label: Interval contains @en

Calidad
disjoint with: Nothing
subclass of: Thing
type: Class
label: Quality @en

of feature
sub property of: topObjectProperty
property disjoint with: bottomObjectProperty
type: ObjectProperty
comment: A relation between some aspect of a sensing entity and a feature. For example, from a sensor to the features it can observe properties of, or from a deployment to the features it was installed to observe. Also from a measurement capability to the feature the capability is described for. (Used in conjunction with forProperty).
label: De característica

Proceso
disjoint with: Nothing
subclass of: Thing
type: Class
label: Process @en

Intervalo equivale
sub property of: topObjectProperty
property disjoint with: En fecha hora
property disjoint with: Tiene final
property disjoint with: bottomObjectProperty
property disjoint with: Tiene comienzo
property disjoint with: Dentro
type: ObjectProperty
domain: Intervalo apropiado
range: Intervalo apropiado
label: Interval equals @en

Resolution
disjoint with: Nothing
subclass of: Calidad
subclass of: Property
subclass of: Thing
subclass of: Measurement Property
type: Class
comment: The smallest difference in the value of a quality being observed that would result in perceptably different values of observation results.
source: skos:exactMatch 'resolution' [VIM 4.14] http://www.bipm.org/utils/common/documents/jcgm/JCGM_200_2008.pdf
label: Resolución

Es objeto incluido en
sub property of: topObjectProperty
property disjoint with: bottomObjectProperty
type: ObjectProperty
label: Is object included in @en

Propiedad ambiental sobre precipitacion
disjoint with: Nothing
subclass of: Propiedad ambiental
subclass of: Calidad
subclass of: Property
subclass of: Thing
type: Class
comment: Agrupa las propiedades ambientales sobre precipitaciones.
label: Precipitation ambient property @en

has operating range
sub property of: topObjectProperty
sub property of: Tiene calidad
sub property of: has property
property disjoint with: bottomObjectProperty
type: ObjectProperty
comment: Relation from a System to an OperatingRange describing the normal operating environment of the System.
label: Tiene rango operativo

Licencía NS
sub property of: topObjectProperty
property disjoint with: bottomObjectProperty
type: ObjectProperty
label: NS license @en

Región
disjoint with: Nothing
subclass of: Thing
type: Class
label: Region @en

Anemómetro
subclass of: Sensor
type: Class
subclass of: Objeto físico
disjoint with: Nothing
subclass of: Thing
subclass of: Objeto
subclass of: http://lodlaundromat.org/.well-known/genid/b376e9a0a07605e42f1b1bc7a2ca30eb#3
comment: Mide la intensidad [0º-360º] y la intensidad (m/s) del viento
label: Anemometer @en

Frequency
disjoint with: Nothing
subclass of: Calidad
subclass of: Property
subclass of: Thing
subclass of: Measurement Property
type: Class
comment: The smallest possible time between one observation and the next.
label: Frecuencia

Provincia
disjoint with: Nothing
subclass of: Area administrativa
subclass of: http://lodlaundromat.org/.well-known/genid/2e99a4ec08762bee318b267c5d104289#1
subclass of: http://lodlaundromat.org/.well-known/genid/d5e8cafd5833f18c9c214938a7904a12#1
subclass of: Thing
type: Class
label: Province @en
comment: Cada una de las grandes divisiones de un territorio o Estado, sujeta por lo común a una autoridad administrativa.

Barómetro
type: Class
subclass of: Sensor
subclass of: http://lodlaundromat.org/.well-known/genid/b376e9a0a07605e42f1b1bc7a2ca30eb#3
subclass of: Objeto
subclass of: Objeto físico
disjoint with: Nothing
subclass of: Thing
comment: Mide la presión en hPa
label: Barometer @en

isProxyFor
sub property of: topObjectProperty
property disjoint with: bottomObjectProperty
type: ObjectProperty
comment: A relation from a Stimulus to the Property that the Stimulus is serving as a proxy for. For example, the expansion of the quicksilver is a stimulus that serves as a proxy for temperature, or an increase or decrease in the spinning of cups on a wind sensor is serving as a proxy for wind speed.
label: Es proxy de

Describe
sub property of: topObjectProperty
property disjoint with: bottomObjectProperty
type: ObjectProperty
comment: Describes @en
label: Describes @en

Designa el límite administrativo directamente
sub property of: topObjectProperty
property disjoint with: bottomObjectProperty
type: ObjectProperty
label: Designates administrative limit directly @en

deployment process part
sub property of: topObjectProperty
sub property of: Tiene parte
property disjoint with: bottomObjectProperty
type: ObjectProperty
comment: Has part relation between a deployment process and its constituent processes.
label: Parte del proceso de despliegue

Es región para
sub property of: topObjectProperty
property disjoint with: bottomObjectProperty
type: ObjectProperty
label: Is region for @en

Sensing Device
subclass of: System
subclass of: Device
subclass of: Thing
disjoint with: Nothing
subclass of: Artefacto designado
subclass of: Objeto
subclass of: Sensor
subclass of: http://lodlaundromat.org/.well-known/genid/b376e9a0a07605e42f1b1bc7a2ca30eb#3
type: Class
subclass of: Objeto físico
source: http://www.w3.org/2005/Incubator/ssn/
comment: A sensing device is a device that implements sensing.
label: Dispositivo Sensor

Indicativo climático
sub property of: topDataProperty
property disjoint with: bottomDataProperty
type: DatatypeProperty
comment: Indicativo climatológico de la estación meteorológica.
source: maestro.csv
domain: Estación meteorológica
label: Climatic Indicator @en
range: Literal

Process
disjoint with: Nothing
subclass of: Método
subclass of: Thing
type: Class
label: Proceso
subclass of: http://lodlaundromat.org/.well-known/genid/b376e9a0a07605e42f1b1bc7a2ca30eb#35
subclass of: http://lodlaundromat.org/.well-known/genid/b376e9a0a07605e42f1b1bc7a2ca30eb#34
comment: A process has an output and possibly inputs and, for a composite process, describes the temporal and dataflow dependencies and relationships amongst its parts. [SSN XG]
source: http://www.w3.org/2005/Incubator/ssn/
subclass of: http://lodlaundromat.org/.well-known/genid/b376e9a0a07605e42f1b1bc7a2ca30eb#33

Localizado en
sub property of: topObjectProperty
sub property of: based near
property disjoint with: bottomObjectProperty
sub property of: location
equivalent property: location
type: ObjectProperty
comment: Indica la localización de los sensores.
range: http://lodlaundromat.org/.well-known/genid/d5e8cafd5833f18c9c214938a7904a12#1
domain: Sensor
label: Located in @en
range: http://lodlaundromat.org/.well-known/genid/2e99a4ec08762bee318b267c5d104289#1

Objeto de información
disjoint with: Nothing
subclass of: Thing
type: Class
label: Information object @en

Sensor
subclass of: Sensor
subclass of: Objeto
subclass of: Thing
subclass of: http://lodlaundromat.org/.well-known/genid/b376e9a0a07605e42f1b1bc7a2ca30eb#3
disjoint with: Nothing
type: Class
subclass of: Objeto físico
equivalent class: Sensor
source: skos:exactMatch 'sensor' [SensorML OGC-0700] http://www.opengeospatial.org/standards/sensorml skos:closeMatch 'observation procedure' [O&M] http://www.opengeospatial.org/standards/om O&M allows sensors, methods, instruments, systems, algorithms and process chains as the processUsed of an observation; this ontology allows a similar range of things (any thing that can do sensing), just they are all grouped under the term sensor (which is thus wider than the O&M concept).
comment: A sensor can do (implements) sensing: that is, a sensor is any entity that can follow a sensing method and thus observe some Property of a FeatureOfInterest. Sensors may be physical devices, computational methods, a laboratory setup with a person following a method, or any other thing that can follow a Sensing Method to observe a Property.
subclass of: http://lodlaundromat.org/.well-known/genid/b376e9a0a07605e42f1b1bc7a2ca30eb#21
subclass of: http://lodlaundromat.org/.well-known/genid/b376e9a0a07605e42f1b1bc7a2ca30eb#20
subclass of: http://lodlaundromat.org/.well-known/genid/b376e9a0a07605e42f1b1bc7a2ca30eb#23
subclass of: http://lodlaundromat.org/.well-known/genid/b376e9a0a07605e42f1b1bc7a2ca30eb#22

Situación
disjoint with: Nothing
subclass of: Thing
type: Class
label: Situation @en

latitude
sub property of: topObjectProperty
property disjoint with: bottomObjectProperty
type: ObjectProperty
comment: The WGS84 latitude of a SpatialThing (decimal degrees).
domain: SpatialThing

Condition
disjoint with: Nothing
subclass of: Calidad
subclass of: Property
subclass of: Thing
type: Class
comment: Used to specify ranges for qualities that act as conditions on a system/sensor's operation. For example, wind speed of 10-60m/s is expressed as a condition linking a quality, wind speed, a unit of measurement, metres per second, and a set of values, 10-60, and may be used as the condition on a MeasurementProperty, for example, to state that a sensor has a particular accuracy in that condition.
label: Condición

attached system
sub property of: topObjectProperty
sub property of: Es localización de
property disjoint with: bottomObjectProperty
inverse of: on platform
type: ObjectProperty
comment: Relation between a Platform and any Systems (e.g., Sensors) that are attached to the Platform.
label: Sistema acoplado

quality of observation
sub property of: topObjectProperty
sub property of: Tiene calidad
sub property of: has property
property disjoint with: bottomObjectProperty
type: ObjectProperty
source: skos:exactMatch 'resultQuality' [O&M - ISO/DIS 19156] http://portal.opengeospatial.org/files/?artifact_id=41579
comment: Relation linking an Observation to the adjudged quality of the result. This is of course complimentary to the MeasurementCapability information recorded for the Sensor that made the Observation.
label: Calidad de la observación

Unidad temporal
disjoint with: Nothing
subclass of: Thing
type: Class
one of: http://lodlaundromat.org/.well-known/genid/a796ef3c26d6f93ac9d393f7f3ff9a98#17
label: Temporal unit @en

Semantic Sensor Network Ontology
type: Thing
modified: 2011-06-20
created: 2009-12-02
type: Ontology
rights: Copyright 2009 - 2011 W3C.
creator: W3C Semantic Sensor Network Incubator Group
imports: DUL.owl
type: NamedIndividual
comment: This ontology is developed by the W3C Semantic Sensor Networks Incubator Group (SSN-XG). The concepts and structure of the ontology were discussed in the group's meetings and on the mailing list. For more information on the group's activities see: http://www.w3.org/2005/Incubator/ssn/
license: copyright-software-20021231.html
comment: This ontology describes sensors and observations, and related concepts. It does not describe domain concepts, time, locations, etc. these are intended to be included from other ontologies via OWL imports.
comment: Please report any errors to the Semantic Sensor Network Incubator Activity via the public W3C list public-xg-ssn@w3.org

Día
property disjoint with: Minuto
property disjoint with: Semana
property disjoint with: Año
sub property of: topDataProperty
property disjoint with: Hora
property disjoint with: Calidad del dato observado
property disjoint with: Segundo
property disjoint with: Fecha hora en formato XSD
property disjoint with: Meses
property disjoint with: Día del año
property disjoint with: Mes
property disjoint with: Fecha hora XSD
property disjoint with: Segundos
property disjoint with: Días
property disjoint with: Años
property disjoint with: bottomDataProperty
property disjoint with: Horas
property disjoint with: Minutos
property disjoint with: nombre estación
property disjoint with: Semanas
type: DatatypeProperty
domain: Descripción fecha hora
range: gDay
label: Day @en

Descripción de la duración
disjoint with: Nothing
subclass of: Thing
type: Class
subclass of: http://lodlaundromat.org/.well-known/genid/a796ef3c26d6f93ac9d393f7f3ff9a98#8
subclass of: http://lodlaundromat.org/.well-known/genid/a796ef3c26d6f93ac9d393f7f3ff9a98#3
subclass of: http://lodlaundromat.org/.well-known/genid/a796ef3c26d6f93ac9d393f7f3ff9a98#9
subclass of: http://lodlaundromat.org/.well-known/genid/a796ef3c26d6f93ac9d393f7f3ff9a98#4
subclass of: http://lodlaundromat.org/.well-known/genid/a796ef3c26d6f93ac9d393f7f3ff9a98#5
subclass of: http://lodlaundromat.org/.well-known/genid/a796ef3c26d6f93ac9d393f7f3ff9a98#6
label: Duration description @en
subclass of: http://lodlaundromat.org/.well-known/genid/a796ef3c26d6f93ac9d393f7f3ff9a98#7

Selectivity
disjoint with: Nothing
subclass of: Calidad
subclass of: Property
subclass of: Thing
subclass of: Measurement Property
type: Class
source: skos:exactMatch 'selectivity' [VIM 4.13] http://www.bipm.org/utils/common/documents/jcgm/JCGM_200_2008.pdf
comment: Selectivity is a property of a sensor whereby it provides observed values for one or more qualities such that the values of each quality are independent of other qualities in the phenomenon, body, or substance being investigated.
label: Selectividad

implemented by
sub property of: topObjectProperty
sub property of: Describe
property disjoint with: bottomObjectProperty
inverse of: implements
type: ObjectProperty
comment: A relation between the description of an algorithm, procedure or method and an entity that implements that method in some executable way. For example, between a scientific measuring method and a sensor the senses via that method.
comment: Implementado por
label: Implementado por

Hora
type: DatatypeProperty
property disjoint with: Fecha hora XSD
property disjoint with: nombre estación
property disjoint with: bottomDataProperty
property disjoint with: Mes
property disjoint with: Fecha hora en formato XSD
property disjoint with: Día
sub property of: topDataProperty
property disjoint with: Año
domain: Descripción fecha hora
range: nonNegativeInteger
label: Hour @en

Tiene comienzo
sub property of: topObjectProperty
property disjoint with: Intervalo durante
property disjoint with: Intervalo antes
property disjoint with: Intervalo finalizado por
property disjoint with: bottomObjectProperty
property disjoint with: Intervalo finaliza
property disjoint with: Intervalo solapado por
property disjoint with: Intervalo solapa
property disjoint with: Intervalo cumplido por
property disjoint with: Intervalo equivale
type: ObjectProperty
property disjoint with: Intervalo contiene
property disjoint with: Intervalo después
property disjoint with: Intervalo comienza
property disjoint with: Intervalo comenzado por
property disjoint with: Intervalo cumple
domain: Entidad temporal
range: Instante
label: Has beginning @en

Incluye evento
sub property of: topObjectProperty
property disjoint with: bottomObjectProperty
type: ObjectProperty
label: Includes event @en

observes
sub property of: topObjectProperty
property disjoint with: bottomObjectProperty
type: ObjectProperty
comment: Relation between a Sensor and a Property that the sensor can observe. Note that, given the DUL modelling of Qualities, a sensor defined with 'observes only Windspeed' technically links the sensor to particular instances of Windspeed, not to the concept itself - OWL can't express concept-concept relations, only individual-individual. The property composition ensures that if an observation is made of a particular quality then one can infer that the sensor observes that quality.
property chain axiom: http://lodlaundromat.org/.well-known/genid/b376e9a0a07605e42f1b1bc7a2ca30eb#36
property chain axiom: http://lodlaundromat.org/.well-known/genid/b376e9a0a07605e42f1b1bc7a2ca30eb#38
label: Observa

Operating Property
disjoint with: Nothing
subclass of: Calidad
subclass of: Property
subclass of: Thing
type: Class
comment: An identifiable characteristic of the environmental and other conditions in which the sensor is intended to operate. May include power ranges, power sources, standard configurations, attachments and the like.
label: Propiedad de operación

Maintenance Schedule
disjoint with: Nothing
subclass of: Calidad
subclass of: Property
subclass of: Operating Property
subclass of: Thing
type: Class
comment: Schedule of maintenance for a system/sensor in the specified conditions.
label: Registro de mantenimiento

Intervalo comenzado por
property disjoint with: Tiene final
property disjoint with: Dentro
property disjoint with: En fecha hora
inverse of: Intervalo comienza
property disjoint with: Tiene comienzo
sub property of: topObjectProperty
property disjoint with: bottomObjectProperty
type: ObjectProperty
label: Interval started by @en

Sensor Output
disjoint with: Nothing
subclass of: Objeto de información
subclass of: Thing
type: Class
label: Salida del sensor
comment: A sensor outputs a piece of information (an observed value), the value itself being represented by an ObservationValue.
subclass of: http://lodlaundromat.org/.well-known/genid/b376e9a0a07605e42f1b1bc7a2ca30eb#25
source: http://www.w3.org/2005/Incubator/ssn/ skos:closeMatch 'observation result' [O&M] http://www.opengeospatial.org/standards/om See comments at ObservationValue.
subclass of: http://lodlaundromat.org/.well-known/genid/b376e9a0a07605e42f1b1bc7a2ca30eb#26

has measurement property
sub property of: topObjectProperty
sub property of: Tiene calidad
sub property of: has property
property disjoint with: bottomObjectProperty
type: ObjectProperty
comment: Relation from a MeasurementCapability to a MeasurementProperty. For example, to an accuracy (see notes at MeasurementCapability).
label: Tiene propiedad de medición

Sensor Input
disjoint with: Nothing
equivalent class: Stimulus
subclass of: Evento
subclass of: http://lodlaundromat.org/.well-known/genid/b376e9a0a07605e42f1b1bc7a2ca30eb#3
subclass of: Thing
subclass of: Stimulus
type: Class
source: http://www.w3.org/2005/Incubator/ssn/
comment: An Event in the real world that 'triggers' the sensor. The properties associated to the stimulus may be different to eventual observed property. It is the event, not the object that triggers the sensor.
label: Entrada al sensor
subclass of: http://lodlaundromat.org/.well-known/genid/b376e9a0a07605e42f1b1bc7a2ca30eb#24

has value
sub property of: topObjectProperty
sub property of: Tiene región
property disjoint with: bottomObjectProperty
type: ObjectProperty
label: Tiene valor

has survival range
sub property of: topObjectProperty
sub property of: Tiene calidad
sub property of: has property
property disjoint with: bottomObjectProperty
type: ObjectProperty
comment: A Relation from a System to a SurvivalRange.
label: Tiene rango de supervivencia

Measurement Property
disjoint with: Nothing
subclass of: Calidad
subclass of: Property
subclass of: Thing
type: Class
comment: An identifiable and observable characteristic of a sensor's observations or ability to make observations.
label: Propiedad de medida

feature of interest
sub property of: topObjectProperty
sub property of: Es parámetro para
property disjoint with: bottomObjectProperty
type: ObjectProperty
source: skos:exactMatch 'featureOfInterest' [O&M - ISO/DIS 19156]
comment: A relation between an observation and the entity whose quality was observed. For example, in an observation of the weight of a person, the feature of interest is the person and the quality is weight.
source: skos:exactMatch 'featureOfInterest' [O&M - ISO/DIS 19156] http://portal.opengeospatial.org/files/?artifact_id=41579
label: Característica de interés

Deployment-related Process
disjoint with: Nothing
subclass of: Proceso
subclass of: Thing
type: Class
subclass of: http://lodlaundromat.org/.well-known/genid/b376e9a0a07605e42f1b1bc7a2ca30eb#45
source: http://www.w3.org/2005/Incubator/ssn/
comment: Place to group all the various Processes related to Deployment. For example, as well as Deplyment, installation, maintenance, deployment of further sensors and the like would all be classified under DeploymentRelatedProcess.
label: Proceso relacionado con el despliegue

Es calidad de
sub property of: topObjectProperty
property disjoint with: bottomObjectProperty
type: ObjectProperty
label: Is quality of @en

Tiene parte
sub property of: topObjectProperty
property disjoint with: bottomObjectProperty
type: ObjectProperty
label: Has part @en

Designado por el límite administrativo
sub property of: topObjectProperty
property disjoint with: bottomObjectProperty
type: ObjectProperty
label: Designated by administrative limit @en

Tiene región
sub property of: topObjectProperty
property disjoint with: bottomObjectProperty
type: ObjectProperty
label: Has region @en

has property
sub property of: topObjectProperty
sub property of: Tiene calidad
property disjoint with: bottomObjectProperty
inverse of: is property of
type: ObjectProperty
comment: A relation between a FeatureOfInterest and a Property of that feature.
label: Tiene propiedad

Años
sub property of: topDataProperty
property disjoint with: Día
property disjoint with: Fecha hora en formato XSD
type: DatatypeProperty
property disjoint with: Fecha hora XSD
property disjoint with: Mes
property disjoint with: Año
property disjoint with: bottomDataProperty
property disjoint with: nombre estación
domain: Descripción de la duración
range: decimal
label: Years @en

start time
sub property of: topObjectProperty
sub property of: Tiene región
property disjoint with: bottomObjectProperty
type: ObjectProperty
label: Hora de inicio

Dentro
property disjoint with: Intervalo finaliza
property disjoint with: Intervalo comenzado por
property disjoint with: Intervalo cumplido por
property disjoint with: Intervalo comienza
property disjoint with: Intervalo después
property disjoint with: Intervalo contiene
property disjoint with: Intervalo equivale
property disjoint with: Intervalo finalizado por
property disjoint with: Intervalo cumple
property disjoint with: bottomObjectProperty
property disjoint with: Intervalo solapa
property disjoint with: Intervalo solapado por
property disjoint with: Intervalo antes
sub property of: topObjectProperty
property disjoint with: Intervalo durante
type: ObjectProperty
domain: Intervalo
range: Instante
label: Inside @en

Fecha hora XSD
property disjoint with: Días
property disjoint with: Horas
property disjoint with: Mes
property disjoint with: Minutos
property disjoint with: nombre estación
property disjoint with: Día
property disjoint with: Semanas
property disjoint with: Minuto
property disjoint with: Año
property disjoint with: Hora
property disjoint with: bottomDataProperty
property disjoint with: Día del año
property disjoint with: Fecha hora en formato XSD
property disjoint with: Calidad del dato observado
property disjoint with: Meses
type: DatatypeProperty
sub property of: topDataProperty
property disjoint with: Semana
property disjoint with: Segundo
property disjoint with: Años
property disjoint with: Segundos
domain: Intervalo de fecha hora
range: dateTime
label: XSD Date Time @en

Stimulus
disjoint with: Nothing
equivalent class: Sensor Input
subclass of: Evento
subclass of: http://lodlaundromat.org/.well-known/genid/b376e9a0a07605e42f1b1bc7a2ca30eb#3
subclass of: Thing
subclass of: Sensor Input
type: Class
source: http://www.w3.org/2005/Incubator/ssn/
comment: An Event in the real world that 'triggers' the sensor. The properties associated to the stimulus may be different to eventual observed property. It is the event, not the object that triggers the sensor.
label: Estímulo

point
disjoint with: Nothing
subclass of: SpatialThing
subclass of: http://lodlaundromat.org/.well-known/genid/2e99a4ec08762bee318b267c5d104289#1
subclass of: http://lodlaundromat.org/.well-known/genid/d5e8cafd5833f18c9c214938a7904a12#1
subclass of: Thing
type: Class
label: Point @en
comment: A point, typically described using a coordinate system relative to Earth, such as WGS84.
comment: Uniquely identified by lat/long/alt. i.e. spaciallyIntersects(P1, P2) :- lat(P1, LAT), long(P1, LONG), alt(P1, ALT), lat(P2, LAT), long(P2, LONG), alt(P2, ALT). sameThing(P1, P2) :- type(P1, Point), type(P2, Point), spaciallyIntersects(P1, P2).
label: Punto

has operating property
sub property of: topObjectProperty
sub property of: Tiene calidad
sub property of: has property
property disjoint with: bottomObjectProperty
type: ObjectProperty
comment: Relation from an OperatingRange to a Property. For example, to a battery lifetime.
label: Tiene propiedad operativa

Tiene participante
sub property of: topObjectProperty
property disjoint with: bottomObjectProperty
type: ObjectProperty
label: Has participant @en

Entidad temporal
disjoint with: Nothing
subclass of: Thing
type: Class
union of: http://lodlaundromat.org/.well-known/genid/a796ef3c26d6f93ac9d393f7f3ff9a98#1
label: Temporal entity @en

Segundo
property disjoint with: Fecha hora en formato XSD
property disjoint with: Mes
type: DatatypeProperty
property disjoint with: Fecha hora XSD
property disjoint with: Año
sub property of: topDataProperty
property disjoint with: nombre estación
property disjoint with: Día
property disjoint with: bottomDataProperty
domain: Descripción fecha hora
range: decimal
label: Second @en

implements
sub property of: topObjectProperty
sub property of: Está descrito por
property disjoint with: bottomObjectProperty
inverse of: implemented by
type: ObjectProperty
comment: A relation between an entity that implements a method in some executable way and the description of an algorithm, procedure or method. For example, between a Sensor and the scientific measuring method that the Sensor uses to observe a Property.
label: Implementa

Battery Lifetime
disjoint with: Nothing
subclass of: Survival Property
subclass of: Calidad
subclass of: Property
subclass of: Thing
type: Class
comment: Total useful life of a battery.
label: Vida de la batería

Año
property disjoint with: Semanas
property disjoint with: Días
property disjoint with: nombre estación
property disjoint with: Calidad del dato observado
property disjoint with: Minuto
property disjoint with: Hora
property disjoint with: Semana
property disjoint with: Meses
property disjoint with: Día
property disjoint with: Segundo
property disjoint with: bottomDataProperty
property disjoint with: Segundos
property disjoint with: Horas
property disjoint with: Años
property disjoint with: Fecha hora en formato XSD
property disjoint with: Fecha hora XSD
type: DatatypeProperty
property disjoint with: Día del año
property disjoint with: Minutos
sub property of: topDataProperty
property disjoint with: Mes
domain: Descripción fecha hora
range: gYear
label: Year @en

Operating Power Range
disjoint with: Nothing
subclass of: Calidad
subclass of: Property
subclass of: Operating Property
subclass of: Thing
type: Class
comment: Power range in which system/sensor is expected to operate.
label: Rango de potencia operativa

is property of
sub property of: topObjectProperty
sub property of: Es calidad de
property disjoint with: bottomObjectProperty
inverse of: has property
type: ObjectProperty
comment: Relation between a FeatureOfInterest and a Property (a Quality observable by a sensor) of that feature.
label: Es propiedad de

Survival Range
disjoint with: Nothing
subclass of: Calidad
subclass of: Property
subclass of: Thing
type: Class
subclass of: http://lodlaundromat.org/.well-known/genid/b376e9a0a07605e42f1b1bc7a2ca30eb#50
subclass of: http://lodlaundromat.org/.well-known/genid/b376e9a0a07605e42f1b1bc7a2ca30eb#51
comment: The conditions a sensor can be exposed to without damage: i.e., the sensor continues to operate as defined using MeasurementCapability. If, however, the SurvivalRange is exceeded, the sensor is 'damaged' and MeasurementCapability specifications may no longer hold.
label: Rango de supervivencia
source: skos:narrowerMatch 'limiting operating condition' [VIM 4.10] http://www.bipm.org/utils/common/documents/jcgm/JCGM_200_2008.pdf

longitude
sub property of: topObjectProperty
property disjoint with: bottomObjectProperty
type: ObjectProperty
comment: The WGS84 longitude of a SpatialThing (decimal degrees).
domain: SpatialThing

Sensing
disjoint with: Nothing
subclass of: Process
subclass of: Método
subclass of: Thing
type: Class
comment: Sensing is a process that results in the estimation, or calculation, of the value of a phenomenon.
source: http://www.w3.org/2005/Incubator/ssn/
label: Captando

Tiene descripción de fecha hora
sub property of: topObjectProperty
property disjoint with: En fecha hora
property disjoint with: bottomObjectProperty
type: ObjectProperty
domain: Intervalo de fecha hora
range: Descripción fecha hora
label: Has date time description @en

Intervalo cumple
property disjoint with: En fecha hora
inverse of: Intervalo cumplido por
property disjoint with: Dentro
property disjoint with: Tiene comienzo
property disjoint with: Tiene final
property disjoint with: bottomObjectProperty
sub property of: topObjectProperty
type: ObjectProperty
domain: Intervalo apropiado
range: Intervalo apropiado
label: Interval meets @en

Intervalo solapa
type: ObjectProperty
inverse of: Intervalo solapado por
property disjoint with: En fecha hora
property disjoint with: Dentro
sub property of: topObjectProperty
property disjoint with: bottomObjectProperty
property disjoint with: Tiene final
property disjoint with: Tiene comienzo
domain: Intervalo apropiado
range: Intervalo apropiado
label: Interval overlaps @en

for property
sub property of: topObjectProperty
property disjoint with: bottomObjectProperty
type: ObjectProperty
comment: A relation between some aspect of a sensing entity and a property. For example, from a sensor to the properties it can observe, or from a deployment to the properties it was installed to observe. Also from a measurement capability to the property the capability is described for. (Used in conjunction with ofFeature).
label: Para propiedad

Propiedad ambiental sobre humedad
disjoint with: Nothing
subclass of: Propiedad ambiental
subclass of: Calidad
subclass of: Property
subclass of: Thing
type: Class
comment: Agrupa las propiedades ambientales sobre humedad.
label: Humidity ambient property @en

Horas
property disjoint with: Día
property disjoint with: Fecha hora en formato XSD
property disjoint with: Año
property disjoint with: Fecha hora XSD
type: DatatypeProperty
property disjoint with: bottomDataProperty
property disjoint with: Mes
sub property of: topDataProperty
property disjoint with: nombre estación
domain: Descripción de la duración
range: decimal
label: Hours @en

Precision
disjoint with: Nothing
subclass of: Calidad
subclass of: Property
subclass of: Thing
subclass of: Measurement Property
type: Class
comment: The closeness of agreement between replicate observations on an unchanged or similar quality value: i.e., a measure of a sensor's ability to consitently reproduce an observation.
source: skos:exactMatch 'measurement precision/precision' [VIM 2.15] http://www.bipm.org/utils/common/documents/jcgm/JCGM_200_2008.pdf
label: Precisión

Localizado en provincia
sub property of: topObjectProperty
sub property of: Localizado en
sub property of: location
sub property of: based near
property disjoint with: bottomObjectProperty
type: ObjectProperty
comment: Indica la provincia en la que está localizado un sensor.
source: maestro.csv
domain: Sensor
label: Located in province @en
range: Provincia

Captura
sub property of: topObjectProperty
property disjoint with: bottomObjectProperty
inverse of: Es capturada por
type: ObjectProperty
comment: Relationa las estaciones meteorológicas con sus observaciones.
comment: Capture @en
domain: Estación meteorológica
label: Captured @en
range: Observación

Sensor Data Sheet
disjoint with: Nothing
subclass of: Objeto de información
subclass of: Thing
type: Class
comment: A data sheet records properties of a sensor. A data sheet might describe for example the accuracy in various conditions, the power use, the types of connectors that the sensor has, etc. Generally a sensor's properties are recorded directly (with hasMeasurementCapability, for example), but the data sheet can be used for example to record the manufacturers specifications verses observed capabilites, or if more is known than the manufacturer specifies, etc. The data sheet is an information object about the sensor's properties, rather than a direct link to the actual properties themselves.
source: http://www.w3.org/2005/Incubator/ssn/
label: Hoja de especificaciones del sensor

Termómetro humedo
subclass of: Objeto
subclass of: http://lodlaundromat.org/.well-known/genid/b376e9a0a07605e42f1b1bc7a2ca30eb#3
disjoint with: Nothing
subclass of: Termómetro
subclass of: Objeto físico
type: Class
subclass of: Thing
subclass of: Sensor
comment: Mide la temperatura en grados Celsius. Mide la temperatura que varia cuando la humedad del aire varia.
label: Wet bulb thermometer @en

Día de la semana
sub property of: topObjectProperty
property disjoint with: bottomObjectProperty
type: ObjectProperty
domain: Descripción fecha hora
range: Día de la semana
comment: Day of week @en
label: Day of week @en

Observation
disjoint with: Nothing
equivalent class: Observación
subclass of: Situación
subclass of: Thing
subclass of: Observación
type: Class
subclass of: http://lodlaundromat.org/.well-known/genid/b376e9a0a07605e42f1b1bc7a2ca30eb#15
subclass of: http://lodlaundromat.org/.well-known/genid/b376e9a0a07605e42f1b1bc7a2ca30eb#13
subclass of: http://lodlaundromat.org/.well-known/genid/b376e9a0a07605e42f1b1bc7a2ca30eb#18
subclass of: http://lodlaundromat.org/.well-known/genid/b376e9a0a07605e42f1b1bc7a2ca30eb#17
subclass of: http://lodlaundromat.org/.well-known/genid/b376e9a0a07605e42f1b1bc7a2ca30eb#16
subclass of: http://lodlaundromat.org/.well-known/genid/b376e9a0a07605e42f1b1bc7a2ca30eb#7
source: skos:closeMatch 'observation' [O&M] http://www.opengeospatial.org/standards/om Observation in this ontology and O&M are described differently (O&M records an observation as an act/event), but they record the same thing and are essentially interchangeable. The difference is in the ontological structure of the two, not the data or use. Observation here records a Situation (the estimation of the value of a Property) and a description of the method that was used (along with the participants), while O&M interprets an Observation as the event itself; there must, however, have been an event that lead to our situation, so both are records of events. The distinction is between the event itself and the record of what happened in that event. skos:closeMatch 'measurement result' [VIM 2.9] http://www.bipm.org/utils/common/documents/jcgm/JCGM_200_2008.pdf Measurement result in VIM is the measured value plus any other relevant information, which means that measurement result and observation will often be associated to the same data (a value, a time, a property, etc.).
subclass of: http://lodlaundromat.org/.well-known/genid/b376e9a0a07605e42f1b1bc7a2ca30eb#9
subclass of: http://lodlaundromat.org/.well-known/genid/b376e9a0a07605e42f1b1bc7a2ca30eb#10
subclass of: http://lodlaundromat.org/.well-known/genid/b376e9a0a07605e42f1b1bc7a2ca30eb#6
subclass of: http://lodlaundromat.org/.well-known/genid/b376e9a0a07605e42f1b1bc7a2ca30eb#8
comment: An Observation is a Situation in which a Sensing method has been used to estimate or calculate a value of a Property of a FeatureOfInterest. Links to Sensing and Sensor describe what made the Observation and how; links to Property and Feature detail what was sensed; the result is the output of a Sensor; other metadata details times etc.
subclass of: http://lodlaundromat.org/.well-known/genid/b376e9a0a07605e42f1b1bc7a2ca30eb#12
label: Observación
subclass of: http://lodlaundromat.org/.well-known/genid/b376e9a0a07605e42f1b1bc7a2ca30eb#11
subclass of: http://lodlaundromat.org/.well-known/genid/b376e9a0a07605e42f1b1bc7a2ca30eb#14

Propiedad ambiental sobre radiación
disjoint with: Nothing
subclass of: Propiedad ambiental
subclass of: Calidad
subclass of: Property
subclass of: Thing
type: Class
comment: Agrupa las propiedades ambientales sobre radiación.
label: Radiation ambient property @en

Observación
disjoint with: Nothing
equivalent class: Observation
subclass of: Situación
subclass of: Thing
subclass of: Observation
type: Class
label: Observation @en

Indicativo sinóptico
sub property of: topDataProperty
property disjoint with: bottomDataProperty
type: DatatypeProperty
comment: Indicativo sinóptico de la estación meteorológica.
source: maestro.csv
domain: Estación meteorológica
label: Synoptic Indicator @en
range: Literal

Observada en intervalo
sub property of: topObjectProperty
property disjoint with: bottomObjectProperty
type: ObjectProperty
comment: Relaciona una observación con el intervalo de tiempo en el que fue observada.
domain: Observación
label: Observed in interval @en
range: Descripción fecha hora

Feature of Interest
disjoint with: Nothing
subclass of: http://lodlaundromat.org/.well-known/genid/b376e9a0a07605e42f1b1bc7a2ca30eb#3
subclass of: Thing
type: Class
source: skos:exactMatch 'feature' [O&M]
subclass of: http://lodlaundromat.org/.well-known/genid/b376e9a0a07605e42f1b1bc7a2ca30eb#1
source: skos:exactMatch 'feature' [O&M] http://www.opengeospatial.org/standards/om
label: Característica de interés
comment: A feature is an abstraction of real world phenomena (thing, person, event, etc).
subclass of: http://lodlaundromat.org/.well-known/genid/b376e9a0a07605e42f1b1bc7a2ca30eb#2

Es capturada por
sub property of: topObjectProperty
property disjoint with: bottomObjectProperty
inverse of: Captura
type: ObjectProperty
comment: Relaciona las observaciones con la estación meteorógica que las captura.
comment: Is captured by @en
domain: Observación
label: Is captured by @en
range: Estación meteorológica

Estación meteorológica
disjoint with: Nothing
subclass of: http://lodlaundromat.org/.well-known/genid/b376e9a0a07605e42f1b1bc7a2ca30eb#3
subclass of: Objeto
subclass of: Objeto físico
subclass of: Thing
subclass of: Platform
type: Class
comment: Una estación meteorológica es una instalación destinada a medir y registrar regularmente diversas variables meteorológicas.
label: Weather station @en

Satisface
sub property of: topObjectProperty
property disjoint with: bottomObjectProperty
type: ObjectProperty
label: Satisfies @en

Intervalo después
property disjoint with: Dentro
inverse of: Intervalo antes
property disjoint with: En fecha hora
sub property of: Después
sub property of: topObjectProperty
property disjoint with: Tiene final
property disjoint with: Tiene comienzo
property disjoint with: bottomObjectProperty
type: ObjectProperty
comment: Interval after @en
label: Interval after @en

Propiedad ambiental sobre temperatura
disjoint with: Nothing
subclass of: Propiedad ambiental
subclass of: Calidad
subclass of: Property
subclass of: Thing
type: Class
comment: Agrupa las propiedades ambientales sobre temperatura.
label: Temperature ambient property @en

Fecha hora en formato XSD
property disjoint with: Hora
property disjoint with: Día
property disjoint with: Minutos
property disjoint with: Segundo
property disjoint with: Días
property disjoint with: Meses
property disjoint with: Día del año
property disjoint with: Mes
property disjoint with: bottomDataProperty
type: DatatypeProperty
property disjoint with: Horas
property disjoint with: Fecha hora XSD
property disjoint with: Minuto
property disjoint with: Segundos
property disjoint with: Semana
property disjoint with: Año
property disjoint with: nombre estación
property disjoint with: Años
property disjoint with: Semanas
property disjoint with: Calidad del dato observado
sub property of: topDataProperty
domain: Instante
range: dateTime
label: In XSD date time @en

Termómetro
subclass of: Sensor
subclass of: http://lodlaundromat.org/.well-known/genid/b376e9a0a07605e42f1b1bc7a2ca30eb#3
disjoint with: Nothing
subclass of: Objeto físico
subclass of: Objeto
subclass of: Thing
type: Class
comment: Mide la temperatura en grados Celsius
label: Thermometer @en

Propiedad ambiental sobre viento
disjoint with: Nothing
subclass of: Propiedad ambiental
subclass of: Calidad
subclass of: Property
subclass of: Thing
type: Class
comment: Agrupa las propiedades ambientales sobre viento.
label: Wind ambient property @en

Meses
property disjoint with: Año
type: DatatypeProperty
property disjoint with: bottomDataProperty
property disjoint with: nombre estación
property disjoint with: Fecha hora en formato XSD
property disjoint with: Día
sub property of: topDataProperty
property disjoint with: Fecha hora XSD
property disjoint with: Mes
domain: Descripción de la duración
range: decimal
label: Months @en

lat/long
type: Thing
type: NamedIndividual
comment: A comma-separated representation of a latitude, longitude coordinate.

Tiene localización
sub property of: topObjectProperty
property disjoint with: bottomObjectProperty
type: ObjectProperty
label: Has location @en

Después
sub property of: topObjectProperty
property disjoint with: bottomObjectProperty
inverse of: Antes
type: TransitiveProperty
type: ObjectProperty
comment: after @en
label: After @en

Pluviómetro
disjoint with: Nothing
subclass of: Objeto físico
subclass of: Sensor
subclass of: Thing
subclass of: Objeto
subclass of: http://lodlaundromat.org/.well-known/genid/b376e9a0a07605e42f1b1bc7a2ca30eb#3
type: Class
comment: Mide la precipitación en mm = l/m^2
label: Pluviometer @en

Mes
property disjoint with: Año
property disjoint with: Hora
property disjoint with: Día
type: DatatypeProperty
property disjoint with: Segundo
property disjoint with: Fecha hora XSD
property disjoint with: Calidad del dato observado
property disjoint with: Día del año
property disjoint with: Semana
property disjoint with: Minuto
property disjoint with: Meses
property disjoint with: nombre estación
property disjoint with: Años
property disjoint with: Fecha hora en formato XSD
property disjoint with: bottomDataProperty
property disjoint with: Días
property disjoint with: Horas
property disjoint with: Minutos
property disjoint with: Segundos
property disjoint with: Semanas
sub property of: topDataProperty
domain: Descripción fecha hora
range: gMonth
label: Month @en

detects
sub property of: topObjectProperty
property disjoint with: bottomObjectProperty
type: ObjectProperty
comment: A relation from a sensor to the Stimulus that the sensor can detect. The Stimulus itself will be serving as a proxy for (see isProxyOf) some observable property.
label: Detecta

made observation
sub property of: topObjectProperty
sub property of: Es objeto incluido en
property disjoint with: bottomObjectProperty
inverse of: Observado por
type: ObjectProperty
comment: Relation between a Sensor and Observations it has made.
label: Observación hecha

Zona horaria
disjoint with: Nothing
subclass of: Thing
type: Class
label: Timezone @en

deployed system
sub property of: topObjectProperty
sub property of: Tiene participante
property disjoint with: bottomObjectProperty
inverse of: has deployment
type: ObjectProperty
comment: Relation between a deployment and the deployed system.
label: Sistema desplegado

Zona horaria
sub property of: topObjectProperty
property disjoint with: bottomObjectProperty
type: ObjectProperty
domain: Descripción fecha hora
range: TimeZone
label: Time zone @en

Calidad del dato observado
property disjoint with: Año
property disjoint with: nombre estación
property disjoint with: Día
sub property of: topDataProperty
property disjoint with: Fecha hora en formato XSD
property disjoint with: bottomDataProperty
type: DatatypeProperty
property disjoint with: Mes
property disjoint with: Fecha hora XSD
comment: Se utilizan los siguiente valores para la calidad: 0: Pasa todos los filtros. 2: El dato se considera sospechoso. 3: El dato podría ser erróneo.
domain: Sensor Output
label: Observed data quality @en
range: integer

http://lodlaundromat.org/.well-known/genid/a796ef3c26d6f93ac9d393f7f3ff9a98#11
type: Restriction
on property: Meses
cardinality: 0

http://lodlaundromat.org/.well-known/genid/b376e9a0a07605e42f1b1bc7a2ca30eb#8
type: Restriction
on property: feature of interest
on class: Feature of Interest
qualified cardinality: 1

http://lodlaundromat.org/.well-known/genid/a796ef3c26d6f93ac9d393f7f3ff9a98#9
type: Restriction
on property: Segundos
max cardinality: 1

http://lodlaundromat.org/.well-known/genid/b376e9a0a07605e42f1b1bc7a2ca30eb#16
type: Restriction
on property: observation sampling time
min cardinality: 0

http://lodlaundromat.org/.well-known/genid/a796ef3c26d6f93ac9d393f7f3ff9a98#29
type: Restriction
on property: Día de la semana
max cardinality: 1

http://lodlaundromat.org/.well-known/genid/a796ef3c26d6f93ac9d393f7f3ff9a98#30
type: Restriction
on property: Día del año
max cardinality: 1

time
type: Ontology
comment: An OWL Ontology of Time (OWL-Time).

http://lodlaundromat.org/.well-known/genid/a796ef3c26d6f93ac9d393f7f3ff9a98#4
type: Restriction
on property: Meses
max cardinality: 1

http://lodlaundromat.org/.well-known/genid/a796ef3c26d6f93ac9d393f7f3ff9a98#12
type: Restriction
on property: Semanas
cardinality: 0

http://lodlaundromat.org/.well-known/genid/a796ef3c26d6f93ac9d393f7f3ff9a98#24
type: Restriction
on property: Tipo de unidad
cardinality: 1

http://lodlaundromat.org/.well-known/genid/b376e9a0a07605e42f1b1bc7a2ca30eb#17
type: Restriction
on property: observation result time
min cardinality: 0

http://lodlaundromat.org/.well-known/genid/a796ef3c26d6f93ac9d393f7f3ff9a98#31
type: Restriction
on property: Hora
max cardinality: 1

http://lodlaundromat.org/.well-known/genid/a796ef3c26d6f93ac9d393f7f3ff9a98#5
type: Restriction
on property: Semanas
max cardinality: 1

http://lodlaundromat.org/.well-known/genid/a796ef3c26d6f93ac9d393f7f3ff9a98#43
type: Restriction
on property: Mes
has value: --01

http://lodlaundromat.org/.well-known/genid/a796ef3c26d6f93ac9d393f7f3ff9a98#13
type: Restriction
on property: Días
cardinality: 0

http://lodlaundromat.org/.well-known/genid/b376e9a0a07605e42f1b1bc7a2ca30eb#12
type: Restriction
on property: Observado por
on class: Sensor
qualified cardinality: 1

http://lodlaundromat.org/.well-known/genid/a796ef3c26d6f93ac9d393f7f3ff9a98#25
type: Restriction
on property: Año
max cardinality: 1

http://lodlaundromat.org/.well-known/genid/b376e9a0a07605e42f1b1bc7a2ca30eb#18
type: Restriction
on property: quality of observation
min cardinality: 0

http://lodlaundromat.org/.well-known/genid/a796ef3c26d6f93ac9d393f7f3ff9a98#32
type: Restriction
on property: Minuto
max cardinality: 1

http://lodlaundromat.org/.well-known/genid/a796ef3c26d6f93ac9d393f7f3ff9a98#6
type: Restriction
on property: Días
max cardinality: 1

http://lodlaundromat.org/.well-known/genid/a796ef3c26d6f93ac9d393f7f3ff9a98#14
type: Restriction
on property: Horas
cardinality: 0

http://lodlaundromat.org/.well-known/genid/b376e9a0a07605e42f1b1bc7a2ca30eb#13
type: Restriction
on property: observed property
on class: Property
qualified cardinality: 1

http://lodlaundromat.org/.well-known/genid/a796ef3c26d6f93ac9d393f7f3ff9a98#26
type: Restriction
on property: Mes
max cardinality: 1

http://lodlaundromat.org/.well-known/genid/a796ef3c26d6f93ac9d393f7f3ff9a98#33
type: Restriction
on property: Segundo
max cardinality: 1

http://lodlaundromat.org/.well-known/genid/a796ef3c26d6f93ac9d393f7f3ff9a98#7
type: Restriction
on property: Horas
max cardinality: 1

http://lodlaundromat.org/.well-known/genid/a796ef3c26d6f93ac9d393f7f3ff9a98#15
type: Restriction
on property: Minutos
cardinality: 0

http://lodlaundromat.org/.well-known/genid/a796ef3c26d6f93ac9d393f7f3ff9a98#27
type: Restriction
on property: Semana
max cardinality: 1

http://lodlaundromat.org/.well-known/genid/a796ef3c26d6f93ac9d393f7f3ff9a98#10
type: Restriction
on property: Años
cardinality: 1

http://lodlaundromat.org/.well-known/genid/b376e9a0a07605e42f1b1bc7a2ca30eb#7
type: Restriction
on property: sensing method used
on class: Sensing
qualified cardinality: 1

http://lodlaundromat.org/.well-known/genid/a796ef3c26d6f93ac9d393f7f3ff9a98#34
type: Restriction
on property: Zona horaria
max cardinality: 1

http://lodlaundromat.org/.well-known/genid/a796ef3c26d6f93ac9d393f7f3ff9a98#8
type: Restriction
on property: Minutos
max cardinality: 1

http://lodlaundromat.org/.well-known/genid/a796ef3c26d6f93ac9d393f7f3ff9a98#16
type: Restriction
on property: Segundos
cardinality: 0

http://lodlaundromat.org/.well-known/genid/a796ef3c26d6f93ac9d393f7f3ff9a98#28
type: Restriction
on property: Día
max cardinality: 1

http://lodlaundromat.org/.well-known/genid/a796ef3c26d6f93ac9d393f7f3ff9a98#3
type: Restriction
on property: Años
max cardinality: 1