Intervalo
subclass of: Thing
subclass of: Resource
type: Class
subclass of: Entidad temporal
label: Interval @en

has value
range: Thing
domain: Thing
sub property of: Tiene región
type: ObjectProperty
label: Tiene valor
type: Property
domain: Resource
range: Resource

Sensing
subclass of: Resource
subclass of: Thing
type: Class
subclass of: Process
comment: Sensing is a process that results in the estimation, or calculation, of the value of a phenomenon.
source: http://www.w3.org/2005/Incubator/ssn/
label: Captando
subclass of: http://lodlaundromat.org/.well-known/genid/b376e9a0a07605e42f1b1bc7a2ca30eb#33
subclass of: http://lodlaundromat.org/.well-known/genid/b376e9a0a07605e42f1b1bc7a2ca30eb#35
subclass of: http://lodlaundromat.org/.well-known/genid/b376e9a0a07605e42f1b1bc7a2ca30eb#34
subclass of: Método

detection limit
subclass of: Resource
subclass of: Thing
type: Class
subclass of: Measurement Property
source: skos:exactMatch 'detection limit' [VIM 4.18] http://www.bipm.org/utils/common/documents/jcgm/JCGM_200_2008.pdf
comment: An observed value for which the probability of falsely claiming the absence of a component in a material is Î², given a probability Î± of falsely claiming its presence.
label: Límite de detección
subclass of: http://lodlaundromat.org/.well-known/genid/b376e9a0a07605e42f1b1bc7a2ca30eb#19
subclass of: Property
subclass of: Calidad

Designa el límite administrativo directamente
range: Thing
domain: Thing
type: ObjectProperty
label: Designates administrative limit directly @en
type: Property
range: Resource
domain: Resource

En fecha hora
range: Thing
domain: Thing
domain: Instante
range: Descripción fecha hora
type: ObjectProperty
label: In date time @en
type: Property
range: Resource
range: http://lodlaundromat.org/.well-known/genid/a796ef3c26d6f93ac9d393f7f3ff9a98#24
range: http://lodlaundromat.org/.well-known/genid/a796ef3c26d6f93ac9d393f7f3ff9a98#30
range: http://lodlaundromat.org/.well-known/genid/a796ef3c26d6f93ac9d393f7f3ff9a98#25
range: http://lodlaundromat.org/.well-known/genid/a796ef3c26d6f93ac9d393f7f3ff9a98#33
range: http://lodlaundromat.org/.well-known/genid/a796ef3c26d6f93ac9d393f7f3ff9a98#27
range: http://lodlaundromat.org/.well-known/genid/a796ef3c26d6f93ac9d393f7f3ff9a98#28
range: http://lodlaundromat.org/.well-known/genid/a796ef3c26d6f93ac9d393f7f3ff9a98#34
range: http://lodlaundromat.org/.well-known/genid/a796ef3c26d6f93ac9d393f7f3ff9a98#32
range: http://lodlaundromat.org/.well-known/genid/a796ef3c26d6f93ac9d393f7f3ff9a98#29
range: http://lodlaundromat.org/.well-known/genid/a796ef3c26d6f93ac9d393f7f3ff9a98#31
range: http://lodlaundromat.org/.well-known/genid/a796ef3c26d6f93ac9d393f7f3ff9a98#26
domain: Entidad temporal
domain: Resource

Designado por el límite administrativo
range: Thing
domain: Thing
type: ObjectProperty
label: Designated by administrative limit @en
type: Property
range: Resource
domain: Resource

Condition
subclass of: Resource
subclass of: Thing
type: Class
subclass of: Property
comment: Used to specify ranges for qualities that act as conditions on a system/sensor's operation. For example, wind speed of 10-60m/s is expressed as a condition linking a quality, wind speed, a unit of measurement, metres per second, and a set of values, 10-60, and may be used as the condition on a MeasurementProperty, for example, to state that a sensor has a particular accuracy in that condition.
label: Condición
subclass of: http://lodlaundromat.org/.well-known/genid/b376e9a0a07605e42f1b1bc7a2ca30eb#19
subclass of: Calidad

http://lodlaundromat.org/.well-known/genid/b376e9a0a07605e42f1b1bc7a2ca30eb#8
subclass of: Resource
subclass of: Thing
type: Class
type: Restriction
on property: feature of interest
on class: Feature of Interest
qualified cardinality: 1

Estación meteorológica
subclass of: Thing
subclass of: Resource
type: Class
comment: Una estación meteorológica es una instalación destinada a medir y registrar regularmente diversas variables meteorológicas.
label: Weather station @en
subclass of: Platform
subclass of: Objeto
subclass of: http://lodlaundromat.org/.well-known/genid/b376e9a0a07605e42f1b1bc7a2ca30eb#47
subclass of: http://lodlaundromat.org/.well-known/genid/b376e9a0a07605e42f1b1bc7a2ca30eb#46
subclass of: http://lodlaundromat.org/.well-known/genid/b376e9a0a07605e42f1b1bc7a2ca30eb#3
subclass of: Objeto físico

has property
range: Thing
domain: Thing
inverse of: is property of
comment: A relation between a FeatureOfInterest and a Property of that feature.
sub property of: Tiene calidad
type: ObjectProperty
label: Tiene propiedad
type: Property
domain: Resource
range: Resource

Tipo de unidad
range: Thing
domain: Thing
domain: Descripción fecha hora
range: Unidad temporal
type: ObjectProperty
label: Unit type @en
type: Property
range: Resource
domain: Resource
domain: http://lodlaundromat.org/.well-known/genid/a796ef3c26d6f93ac9d393f7f3ff9a98#24
domain: http://lodlaundromat.org/.well-known/genid/a796ef3c26d6f93ac9d393f7f3ff9a98#30
domain: http://lodlaundromat.org/.well-known/genid/a796ef3c26d6f93ac9d393f7f3ff9a98#25
domain: http://lodlaundromat.org/.well-known/genid/a796ef3c26d6f93ac9d393f7f3ff9a98#33
domain: http://lodlaundromat.org/.well-known/genid/a796ef3c26d6f93ac9d393f7f3ff9a98#27
domain: http://lodlaundromat.org/.well-known/genid/a796ef3c26d6f93ac9d393f7f3ff9a98#28
domain: http://lodlaundromat.org/.well-known/genid/a796ef3c26d6f93ac9d393f7f3ff9a98#34
domain: http://lodlaundromat.org/.well-known/genid/a796ef3c26d6f93ac9d393f7f3ff9a98#32
domain: http://lodlaundromat.org/.well-known/genid/a796ef3c26d6f93ac9d393f7f3ff9a98#29
domain: http://lodlaundromat.org/.well-known/genid/a796ef3c26d6f93ac9d393f7f3ff9a98#31
domain: http://lodlaundromat.org/.well-known/genid/a796ef3c26d6f93ac9d393f7f3ff9a98#26

http://lodlaundromat.org/.well-known/genid/a796ef3c26d6f93ac9d393f7f3ff9a98#9
subclass of: Resource
subclass of: Thing
type: Class
type: Restriction
on property: Segundos
max cardinality: 1

Tiene localización
range: Thing
domain: Thing
type: ObjectProperty
label: Has location @en
type: Property
range: Resource
domain: Resource

Dentro
range: Thing
domain: Thing
domain: Intervalo
range: Instante
type: ObjectProperty
label: Inside @en
type: Property
range: Entidad temporal
range: Resource
domain: Entidad temporal
domain: Resource

implemented by
range: Thing
inverse of: implements
domain: Thing
comment: A relation between the description of an algorithm, procedure or method and an entity that implements that method in some executable way. For example, between a scientific measuring method and a sensor the senses via that method.
sub property of: Describe
type: ObjectProperty
comment: Implementado por
label: Implementado por
type: Property
domain: Resource
range: Resource

has deployment
range: Thing
domain: Thing
comment: Relation between a System and a Deployment, recording that the System/Sensor was deployed in that Deployment.
inverse of: deployed system
sub property of: Es participante
type: ObjectProperty
label: Tiene despliegue
type: Property
domain: Resource
range: Resource

observation result
range: Thing
domain: Thing
source: skos:closeMatch 'result' [O&M - ISO/DIS 19156] http://portal.opengeospatial.org/files/?artifact_id=41579
comment: Relation linking an Observation (i.e., a description of the context, the Situation, in which the observatioin was made) and a Result, which contains a value representing the value associated with the observed Property.
sub property of: Es parámetro para
type: ObjectProperty
label: Resultado de observación
type: Property
domain: Resource
range: Resource

Frequency
subclass of: Resource
subclass of: Thing
type: Class
subclass of: Measurement Property
comment: The smallest possible time between one observation and the next.
label: Frecuencia
subclass of: http://lodlaundromat.org/.well-known/genid/b376e9a0a07605e42f1b1bc7a2ca30eb#19
subclass of: Property
subclass of: Calidad

Propiedad ambiental sobre humedad
subclass of: Resource
subclass of: Thing
type: Class
comment: Agrupa las propiedades ambientales sobre humedad.
label: Humidity ambient property @en
subclass of: Propiedad ambiental
subclass of: http://lodlaundromat.org/.well-known/genid/b376e9a0a07605e42f1b1bc7a2ca30eb#19
subclass of: Property
subclass of: Calidad

http://lodlaundromat.org/.well-known/genid/b376e9a0a07605e42f1b1bc7a2ca30eb#16
subclass of: Resource
subclass of: Thing
type: Class
type: Restriction
on property: observation sampling time
min cardinality: 0

Es capturada por
range: Thing
domain: Thing
comment: Relaciona las observaciones con la estación meteorógica que las captura.
type: ObjectProperty
comment: Is captured by @en
domain: Observación
label: Is captured by @en
range: Estación meteorológica
inverse of: Captura
type: Property
range: http://lodlaundromat.org/.well-known/genid/b376e9a0a07605e42f1b1bc7a2ca30eb#47
range: http://lodlaundromat.org/.well-known/genid/b376e9a0a07605e42f1b1bc7a2ca30eb#46
range: Objeto físico
range: Resource
range: Platform
range: http://lodlaundromat.org/.well-known/genid/b376e9a0a07605e42f1b1bc7a2ca30eb#3
range: Objeto
domain: Resource
domain: http://lodlaundromat.org/.well-known/genid/b376e9a0a07605e42f1b1bc7a2ca30eb#17
domain: http://lodlaundromat.org/.well-known/genid/b376e9a0a07605e42f1b1bc7a2ca30eb#9
domain: http://lodlaundromat.org/.well-known/genid/b376e9a0a07605e42f1b1bc7a2ca30eb#14
domain: http://lodlaundromat.org/.well-known/genid/b376e9a0a07605e42f1b1bc7a2ca30eb#16
domain: http://lodlaundromat.org/.well-known/genid/b376e9a0a07605e42f1b1bc7a2ca30eb#6
domain: http://lodlaundromat.org/.well-known/genid/b376e9a0a07605e42f1b1bc7a2ca30eb#11
domain: http://lodlaundromat.org/.well-known/genid/b376e9a0a07605e42f1b1bc7a2ca30eb#12
domain: http://lodlaundromat.org/.well-known/genid/b376e9a0a07605e42f1b1bc7a2ca30eb#7
domain: http://lodlaundromat.org/.well-known/genid/b376e9a0a07605e42f1b1bc7a2ca30eb#15
domain: http://lodlaundromat.org/.well-known/genid/b376e9a0a07605e42f1b1bc7a2ca30eb#10
domain: Observation
domain: http://lodlaundromat.org/.well-known/genid/b376e9a0a07605e42f1b1bc7a2ca30eb#18
domain: http://lodlaundromat.org/.well-known/genid/b376e9a0a07605e42f1b1bc7a2ca30eb#13
domain: http://lodlaundromat.org/.well-known/genid/b376e9a0a07605e42f1b1bc7a2ca30eb#8
domain: Situación

http://lodlaundromat.org/.well-known/genid/a796ef3c26d6f93ac9d393f7f3ff9a98#29
subclass of: Resource
subclass of: Thing
type: Class
type: Restriction
on property: Día de la semana
max cardinality: 1

Intervalo comienza
range: Thing
inverse of: Intervalo comenzado por
domain: Thing
domain: Intervalo apropiado
range: Intervalo apropiado
type: ObjectProperty
label: Interval starts @en
type: Property
range: Entidad temporal
range: Resource
range: Intervalo
domain: Entidad temporal
domain: Resource
domain: Intervalo

has output
range: Thing
domain: Thing
type: ObjectProperty
label: Tiene salida
type: Property
range: Resource
domain: Resource

has measurement property
sub property of: Tiene calidad
range: Thing
domain: Thing
comment: Relation from a MeasurementCapability to a MeasurementProperty. For example, to an accuracy (see notes at MeasurementCapability).
sub property of: has property
type: ObjectProperty
label: Tiene propiedad de medición
type: Property
domain: Resource
range: Resource

Intervalo cumple
range: Thing
inverse of: Intervalo cumplido por
domain: Thing
domain: Intervalo apropiado
range: Intervalo apropiado
type: ObjectProperty
label: Interval meets @en
type: Property
range: Entidad temporal
range: Resource
range: Intervalo
domain: Entidad temporal
domain: Resource
domain: Intervalo

http://lodlaundromat.org/.well-known/genid/a796ef3c26d6f93ac9d393f7f3ff9a98#30
subclass of: Resource
subclass of: Thing
type: Class
type: Restriction
on property: Día del año
max cardinality: 1

Sensitivity
subclass of: Resource
subclass of: Thing
type: Class
subclass of: Measurement Property
source: skos:exactMatch 'sensitivity' [VIM 4.12] http://www.bipm.org/utils/common/documents/jcgm/JCGM_200_2008.pdf
comment: Sensitivity is the quotient of the change in a result of sensor and the corresponding change in a value of a quality being observed.
label: Sensibilidad
subclass of: http://lodlaundromat.org/.well-known/genid/b376e9a0a07605e42f1b1bc7a2ca30eb#19
subclass of: Calidad
subclass of: Property

Día de la semana
subclass of: Thing
subclass of: Resource
type: Class
one of: http://lodlaundromat.org/.well-known/genid/a796ef3c26d6f93ac9d393f7f3ff9a98#35
label: Day of week @en

Localizado en
range: Thing
domain: Thing
sub property of: based near
sub property of: location
comment: Indica la localización de los sensores.
range: http://lodlaundromat.org/.well-known/genid/d5e8cafd5833f18c9c214938a7904a12#1
type: ObjectProperty
domain: Sensor
label: Located in @en
range: http://lodlaundromat.org/.well-known/genid/2e99a4ec08762bee318b267c5d104289#1
equivalent property: location
type: Property
domain: Resource
domain: Objeto
domain: http://lodlaundromat.org/.well-known/genid/b376e9a0a07605e42f1b1bc7a2ca30eb#21
domain: http://lodlaundromat.org/.well-known/genid/b376e9a0a07605e42f1b1bc7a2ca30eb#3
domain: http://lodlaundromat.org/.well-known/genid/b376e9a0a07605e42f1b1bc7a2ca30eb#20
domain: http://lodlaundromat.org/.well-known/genid/b376e9a0a07605e42f1b1bc7a2ca30eb#22
domain: http://lodlaundromat.org/.well-known/genid/b376e9a0a07605e42f1b1bc7a2ca30eb#23
domain: Objeto físico
range: SpatialThing
range: Resource

http://lodlaundromat.org/.well-known/genid/a796ef3c26d6f93ac9d393f7f3ff9a98#4
subclass of: Resource
subclass of: Thing
type: Class
type: Restriction
on property: Meses
max cardinality: 1

Maintenance Schedule
subclass of: Resource
subclass of: Thing
type: Class
subclass of: Operating Property
comment: Schedule of maintenance for a system/sensor in the specified conditions.
label: Registro de mantenimiento
subclass of: http://lodlaundromat.org/.well-known/genid/b376e9a0a07605e42f1b1bc7a2ca30eb#19
subclass of: Property
subclass of: Calidad

http://lodlaundromat.org/.well-known/genid/a796ef3c26d6f93ac9d393f7f3ff9a98#12
type: Class
subclass of: Thing
subclass of: Resource
type: Restriction
on property: Semanas
cardinality: 0

start time
range: Thing
domain: Thing
sub property of: Tiene región
type: ObjectProperty
label: Hora de inicio
type: Property
domain: Resource
range: Resource

Heliógrafo
subclass of: Thing
subclass of: Sensor
subclass of: Resource
type: Class
comment: Mide la duración de la insolación en horas
label: Heliograph @en
subclass of: http://lodlaundromat.org/.well-known/genid/b376e9a0a07605e42f1b1bc7a2ca30eb#23
subclass of: http://lodlaundromat.org/.well-known/genid/b376e9a0a07605e42f1b1bc7a2ca30eb#20
subclass of: http://lodlaundromat.org/.well-known/genid/b376e9a0a07605e42f1b1bc7a2ca30eb#21
subclass of: http://lodlaundromat.org/.well-known/genid/b376e9a0a07605e42f1b1bc7a2ca30eb#22
subclass of: http://lodlaundromat.org/.well-known/genid/b376e9a0a07605e42f1b1bc7a2ca30eb#3
subclass of: Objeto
subclass of: Objeto físico

Platform
subclass of: Resource
subclass of: Thing
type: Class
subclass of: http://lodlaundromat.org/.well-known/genid/b376e9a0a07605e42f1b1bc7a2ca30eb#46
label: Plataforma
subclass of: Objeto físico
source: skos:exactMatch 'platform' [SensorML OGC-0700] http://www.opengeospatial.org/standards/sensorml
subclass of: http://lodlaundromat.org/.well-known/genid/b376e9a0a07605e42f1b1bc7a2ca30eb#47
comment: An Entity to which other Entities can be attached - particuarly Sensors and other Platforms. For example, a post might act as the Platform, a bouy might act as a Platform, or a fish might act as a Platform for an attached sensor.

Método
subclass of: Resource
subclass of: Thing
type: Class
label: Method @en

Propiedad ambiental sobre presión
subclass of: Resource
subclass of: Thing
type: Class
comment: Agrupa las propiedades ambientales sobre presión.
label: Pressure ambient property @en
subclass of: Propiedad ambiental
subclass of: http://lodlaundromat.org/.well-known/genid/b376e9a0a07605e42f1b1bc7a2ca30eb#19
subclass of: Property
subclass of: Calidad

Objeto físico
subclass of: Resource
subclass of: Thing
type: Class
label: Physical object @en

http://lodlaundromat.org/.well-known/genid/a796ef3c26d6f93ac9d393f7f3ff9a98#24
subclass of: Resource
subclass of: Thing
type: Class
type: Restriction
on property: Tipo de unidad
cardinality: 1

observation sampling time
range: Thing
domain: Thing
comment: Rebadged as phenomenon time in [O&M]. The phenomenon time shall describe the time that the result applies to the property of the feature-of-interest. This is often the time of interaction by a sampling procedure or observation procedure with a real-world feature.
source: http://www.opengeospatial.org/standards/om
comment: The sampling time is the time that the result applies to the feature-of-interest. This is the time usually required for geospatial analysis of the result.
sub property of: Tiene región
type: ObjectProperty
label: Hora del muestreo de la observación
type: Property
domain: Resource
range: Resource

Barómetro
subclass of: Sensor
subclass of: Resource
type: Class
subclass of: Thing
comment: Mide la presión en hPa
label: Barometer @en
subclass of: http://lodlaundromat.org/.well-known/genid/b376e9a0a07605e42f1b1bc7a2ca30eb#23
subclass of: http://lodlaundromat.org/.well-known/genid/b376e9a0a07605e42f1b1bc7a2ca30eb#20
subclass of: http://lodlaundromat.org/.well-known/genid/b376e9a0a07605e42f1b1bc7a2ca30eb#22
subclass of: http://lodlaundromat.org/.well-known/genid/b376e9a0a07605e42f1b1bc7a2ca30eb#21
subclass of: http://lodlaundromat.org/.well-known/genid/b376e9a0a07605e42f1b1bc7a2ca30eb#3
subclass of: Objeto
subclass of: Objeto físico

Device
type: Class
subclass of: Resource
subclass of: Thing
subclass of: System
subclass of: Artefacto designado
comment: A device is a physical piece of technology - a system in a box. Devices may of course be built of smaller devices and software components (i.e. systems have components).
source: http://www.w3.org/2005/Incubator/ssn/
label: Dispositivo
subclass of: http://lodlaundromat.org/.well-known/genid/b376e9a0a07605e42f1b1bc7a2ca30eb#29
subclass of: http://lodlaundromat.org/.well-known/genid/b376e9a0a07605e42f1b1bc7a2ca30eb#30
subclass of: http://lodlaundromat.org/.well-known/genid/b376e9a0a07605e42f1b1bc7a2ca30eb#31
subclass of: http://lodlaundromat.org/.well-known/genid/b376e9a0a07605e42f1b1bc7a2ca30eb#32
subclass of: http://lodlaundromat.org/.well-known/genid/b376e9a0a07605e42f1b1bc7a2ca30eb#28
subclass of: http://lodlaundromat.org/.well-known/genid/b376e9a0a07605e42f1b1bc7a2ca30eb#27
subclass of: Objeto físico

Intervalo finalizado por
range: Intervalo apropiado
domain: Intervalo apropiado
range: Thing
domain: Thing
inverse of: Intervalo finaliza
type: ObjectProperty
label: Interval finished by @en
type: Property
range: Entidad temporal
range: Resource
range: Intervalo
domain: Entidad temporal
domain: Resource
domain: Intervalo

Descripción fecha hora
type: Class
subclass of: Resource
subclass of: Thing
subclass of: http://lodlaundromat.org/.well-known/genid/a796ef3c26d6f93ac9d393f7f3ff9a98#33
subclass of: http://lodlaundromat.org/.well-known/genid/a796ef3c26d6f93ac9d393f7f3ff9a98#24
subclass of: http://lodlaundromat.org/.well-known/genid/a796ef3c26d6f93ac9d393f7f3ff9a98#30
subclass of: http://lodlaundromat.org/.well-known/genid/a796ef3c26d6f93ac9d393f7f3ff9a98#29
subclass of: http://lodlaundromat.org/.well-known/genid/a796ef3c26d6f93ac9d393f7f3ff9a98#26
subclass of: http://lodlaundromat.org/.well-known/genid/a796ef3c26d6f93ac9d393f7f3ff9a98#31
subclass of: http://lodlaundromat.org/.well-known/genid/a796ef3c26d6f93ac9d393f7f3ff9a98#25
subclass of: http://lodlaundromat.org/.well-known/genid/a796ef3c26d6f93ac9d393f7f3ff9a98#32
subclass of: http://lodlaundromat.org/.well-known/genid/a796ef3c26d6f93ac9d393f7f3ff9a98#34
subclass of: http://lodlaundromat.org/.well-known/genid/a796ef3c26d6f93ac9d393f7f3ff9a98#28
label: Date time description @en
subclass of: http://lodlaundromat.org/.well-known/genid/a796ef3c26d6f93ac9d393f7f3ff9a98#27

Localizacion coordenadas
range: Thing
domain: Thing
sub property of: based near
comment: Indica las coordinadas en las que está localizado un sensor.
type: ObjectProperty
domain: Sensor
label: Coordinates location @en
range: SpatialThing
sub property of: Localizado en
sub property of: location
type: Property
domain: Resource
domain: Objeto
domain: http://lodlaundromat.org/.well-known/genid/b376e9a0a07605e42f1b1bc7a2ca30eb#21
domain: http://lodlaundromat.org/.well-known/genid/b376e9a0a07605e42f1b1bc7a2ca30eb#3
domain: http://lodlaundromat.org/.well-known/genid/b376e9a0a07605e42f1b1bc7a2ca30eb#20
domain: http://lodlaundromat.org/.well-known/genid/b376e9a0a07605e42f1b1bc7a2ca30eb#22
domain: http://lodlaundromat.org/.well-known/genid/b376e9a0a07605e42f1b1bc7a2ca30eb#23
domain: Objeto físico
range: Resource
range: http://lodlaundromat.org/.well-known/genid/d5e8cafd5833f18c9c214938a7904a12#1
range: http://lodlaundromat.org/.well-known/genid/2e99a4ec08762bee318b267c5d104289#1

System
subclass of: Thing
type: Class
subclass of: Resource
source: http://www.w3.org/2005/Incubator/ssn/
subclass of: http://lodlaundromat.org/.well-known/genid/b376e9a0a07605e42f1b1bc7a2ca30eb#32
subclass of: http://lodlaundromat.org/.well-known/genid/b376e9a0a07605e42f1b1bc7a2ca30eb#31
comment: System is a unit of abstraction for pieces of infrastructure (and we largely care that they are) for sensing. A system has components, its subsystems, which are other systems.
subclass of: http://lodlaundromat.org/.well-known/genid/b376e9a0a07605e42f1b1bc7a2ca30eb#27
subclass of: http://lodlaundromat.org/.well-known/genid/b376e9a0a07605e42f1b1bc7a2ca30eb#29
subclass of: http://lodlaundromat.org/.well-known/genid/b376e9a0a07605e42f1b1bc7a2ca30eb#28
subclass of: Objeto físico
subclass of: http://lodlaundromat.org/.well-known/genid/b376e9a0a07605e42f1b1bc7a2ca30eb#30
label: Sistema

Tiene comienzo
range: Thing
domain: Thing
domain: Entidad temporal
range: Instante
type: ObjectProperty
label: Has beginning @en
type: Property
range: Entidad temporal
range: Resource
domain: Resource

Tiene parte
range: Thing
domain: Thing
type: ObjectProperty
label: Has part @en
type: Property
range: Resource
domain: Resource

Propiedad ambiental
subclass of: Resource
subclass of: Thing
type: Class
comment: Concepto que agrupa las propiedades ambientales que se pueden observar.
label: Ambient property @en
subclass of: Property
subclass of: http://lodlaundromat.org/.well-known/genid/b376e9a0a07605e42f1b1bc7a2ca30eb#19
subclass of: Calidad

Artefacto designado
subclass of: Resource
subclass of: Thing
type: Class
label: Designed artifact @en

Localizado en provincia
sub property of: based near
sub property of: location
range: Thing
domain: Thing
comment: Indica la provincia en la que está localizado un sensor.
source: maestro.csv
type: ObjectProperty
domain: Sensor
label: Located in province @en
range: Provincia
sub property of: Localizado en
type: Property
domain: Resource
domain: Objeto
domain: http://lodlaundromat.org/.well-known/genid/b376e9a0a07605e42f1b1bc7a2ca30eb#21
domain: http://lodlaundromat.org/.well-known/genid/b376e9a0a07605e42f1b1bc7a2ca30eb#3
domain: http://lodlaundromat.org/.well-known/genid/b376e9a0a07605e42f1b1bc7a2ca30eb#20
domain: http://lodlaundromat.org/.well-known/genid/b376e9a0a07605e42f1b1bc7a2ca30eb#22
domain: http://lodlaundromat.org/.well-known/genid/b376e9a0a07605e42f1b1bc7a2ca30eb#23
domain: Objeto físico
range: Resource
range: SpatialThing
range: http://lodlaundromat.org/.well-known/genid/2e99a4ec08762bee318b267c5d104289#1
range: http://lodlaundromat.org/.well-known/genid/d5e8cafd5833f18c9c214938a7904a12#1
range: Area administrativa

Resolution
subclass of: Resource
subclass of: Thing
type: Class
subclass of: Measurement Property
comment: The smallest difference in the value of a quality being observed that would result in perceptably different values of observation results.
source: skos:exactMatch 'resolution' [VIM 4.14] http://www.bipm.org/utils/common/documents/jcgm/JCGM_200_2008.pdf
label: Resolución
subclass of: http://lodlaundromat.org/.well-known/genid/b376e9a0a07605e42f1b1bc7a2ca30eb#19
subclass of: Calidad
subclass of: Property

Es región para
range: Thing
domain: Thing
type: ObjectProperty
label: Is region for @en
type: Property
range: Resource
domain: Resource

http://lodlaundromat.org/.well-known/genid/b376e9a0a07605e42f1b1bc7a2ca30eb#17
subclass of: Resource
subclass of: Thing
type: Class
type: Restriction
on property: observation result time
min cardinality: 0

isProxyFor
range: Thing
domain: Thing
comment: A relation from a Stimulus to the Property that the Stimulus is serving as a proxy for. For example, the expansion of the quicksilver is a stimulus that serves as a proxy for temperature, or an increase or decrease in the spinning of cups on a wind sensor is serving as a proxy for wind speed.
type: ObjectProperty
label: Es proxy de
type: Property
range: Resource
domain: Resource

Unidad temporal
subclass of: Resource
subclass of: Thing
type: Class
one of: http://lodlaundromat.org/.well-known/genid/a796ef3c26d6f93ac9d393f7f3ff9a98#17
label: Temporal unit @en

Objeto
subclass of: http://lodlaundromat.org/.well-known/genid/b376e9a0a07605e42f1b1bc7a2ca30eb#3
subclass of: Resource
subclass of: Thing
type: Class
label: Object @en

Intervalo de fecha hora
subclass of: Thing
subclass of: Resource
type: Class
subclass of: Intervalo apropiado
label: Date time interval @en
subclass of: Entidad temporal
subclass of: Intervalo

Descripción de la duración
type: Class
subclass of: Resource
subclass of: Thing
subclass of: http://lodlaundromat.org/.well-known/genid/a796ef3c26d6f93ac9d393f7f3ff9a98#8
subclass of: http://lodlaundromat.org/.well-known/genid/a796ef3c26d6f93ac9d393f7f3ff9a98#3
subclass of: http://lodlaundromat.org/.well-known/genid/a796ef3c26d6f93ac9d393f7f3ff9a98#9
subclass of: http://lodlaundromat.org/.well-known/genid/a796ef3c26d6f93ac9d393f7f3ff9a98#4
subclass of: http://lodlaundromat.org/.well-known/genid/a796ef3c26d6f93ac9d393f7f3ff9a98#5
subclass of: http://lodlaundromat.org/.well-known/genid/a796ef3c26d6f93ac9d393f7f3ff9a98#6
label: Duration description @en
subclass of: http://lodlaundromat.org/.well-known/genid/a796ef3c26d6f93ac9d393f7f3ff9a98#7

deployment process part
range: Thing
domain: Thing
comment: Has part relation between a deployment process and its constituent processes.
sub property of: Tiene parte
type: ObjectProperty
label: Parte del proceso de despliegue
type: Property
domain: Resource
range: Resource

has operating range
sub property of: Tiene calidad
range: Thing
domain: Thing
comment: Relation from a System to an OperatingRange describing the normal operating environment of the System.
sub property of: has property
type: ObjectProperty
label: Tiene rango operativo
type: Property
domain: Resource
range: Resource

Intervalo apropiado
subclass of: Thing
subclass of: Resource
type: Class
subclass of: Intervalo
disjoint with: Instante
label: Proper interval @en
subclass of: Entidad temporal

Pluviómetro
subclass of: Resource
subclass of: Thing
type: Class
subclass of: Sensor
comment: Mide la precipitación en mm = l/m^2
label: Pluviometer @en
subclass of: http://lodlaundromat.org/.well-known/genid/b376e9a0a07605e42f1b1bc7a2ca30eb#20
subclass of: http://lodlaundromat.org/.well-known/genid/b376e9a0a07605e42f1b1bc7a2ca30eb#23
subclass of: http://lodlaundromat.org/.well-known/genid/b376e9a0a07605e42f1b1bc7a2ca30eb#22
subclass of: http://lodlaundromat.org/.well-known/genid/b376e9a0a07605e42f1b1bc7a2ca30eb#21
subclass of: Objeto
subclass of: http://lodlaundromat.org/.well-known/genid/b376e9a0a07605e42f1b1bc7a2ca30eb#3
subclass of: Objeto físico

has survival property
sub property of: Tiene calidad
range: Thing
domain: Thing
comment: Relation from a SurvivalRange to a Property describing the survial range of a system. For example, to the temperature extreme that a system can withstand before being considered damaged.
sub property of: has property
type: ObjectProperty
label: Tiene propiedad de supervivencia
type: Property
domain: Resource
range: Resource

http://lodlaundromat.org/.well-known/genid/a796ef3c26d6f93ac9d393f7f3ff9a98#31
subclass of: Resource
subclass of: Thing
type: Class
type: Restriction
on property: Hora
max cardinality: 1

SpatialThing
subclass of: http://lodlaundromat.org/.well-known/genid/2e99a4ec08762bee318b267c5d104289#1
subclass of: Thing
subclass of: http://lodlaundromat.org/.well-known/genid/d5e8cafd5833f18c9c214938a7904a12#1
subclass of: Resource
type: Class
label: Spatial thing @en
comment: Anything with spatial extent, i.e. size, shape, or position. e.g. people, places, bowling balls, as well as abstract areas like cubes.
label: Cosa espacial

http://lodlaundromat.org/.well-known/genid/a796ef3c26d6f93ac9d393f7f3ff9a98#5
subclass of: Resource
subclass of: Thing
type: Class
type: Restriction
on property: Semanas
max cardinality: 1

Propiedad ambiental sobre viento
subclass of: Resource
subclass of: Thing
type: Class
comment: Agrupa las propiedades ambientales sobre viento.
label: Wind ambient property @en
subclass of: Propiedad ambiental
subclass of: http://lodlaundromat.org/.well-known/genid/b376e9a0a07605e42f1b1bc7a2ca30eb#19
subclass of: Property
subclass of: Calidad

has subsystem
range: Thing
domain: Thing
comment: Haspart relation between a system and its parts.
sub property of: Tiene parte
type: ObjectProperty
label: Tiene subsistema
type: Property
domain: Resource
range: Resource

http://lodlaundromat.org/.well-known/genid/a796ef3c26d6f93ac9d393f7f3ff9a98#43
subclass of: Resource
subclass of: Thing
type: Class
type: Restriction
on property: Mes
has value: --01
subclass of: Descripción fecha hora
subclass of: http://lodlaundromat.org/.well-known/genid/a796ef3c26d6f93ac9d393f7f3ff9a98#34
subclass of: http://lodlaundromat.org/.well-known/genid/a796ef3c26d6f93ac9d393f7f3ff9a98#30
subclass of: http://lodlaundromat.org/.well-known/genid/a796ef3c26d6f93ac9d393f7f3ff9a98#25
subclass of: http://lodlaundromat.org/.well-known/genid/a796ef3c26d6f93ac9d393f7f3ff9a98#26
subclass of: http://lodlaundromat.org/.well-known/genid/a796ef3c26d6f93ac9d393f7f3ff9a98#31
subclass of: http://lodlaundromat.org/.well-known/genid/a796ef3c26d6f93ac9d393f7f3ff9a98#29
subclass of: http://lodlaundromat.org/.well-known/genid/a796ef3c26d6f93ac9d393f7f3ff9a98#27
subclass of: http://lodlaundromat.org/.well-known/genid/a796ef3c26d6f93ac9d393f7f3ff9a98#32
subclass of: http://lodlaundromat.org/.well-known/genid/a796ef3c26d6f93ac9d393f7f3ff9a98#24
subclass of: http://lodlaundromat.org/.well-known/genid/a796ef3c26d6f93ac9d393f7f3ff9a98#33
subclass of: http://lodlaundromat.org/.well-known/genid/a796ef3c26d6f93ac9d393f7f3ff9a98#28

Licencía NS
range: Thing
domain: Thing
type: ObjectProperty
label: NS license @en
type: Property
range: Resource
domain: Resource

http://lodlaundromat.org/.well-known/genid/a796ef3c26d6f93ac9d393f7f3ff9a98#13
subclass of: Thing
type: Class
subclass of: Resource
type: Restriction
on property: Días
cardinality: 0

http://lodlaundromat.org/.well-known/genid/b376e9a0a07605e42f1b1bc7a2ca30eb#12
subclass of: Resource
subclass of: Thing
type: Class
type: Restriction
on property: Observado por
on class: Sensor
qualified cardinality: 1

Intervalo finaliza
inverse of: Intervalo finalizado por
range: Thing
domain: Thing
domain: Intervalo apropiado
range: Intervalo apropiado
type: ObjectProperty
label: Interval finishes @en
type: Property
range: Entidad temporal
range: Resource
range: Intervalo
domain: Entidad temporal
domain: Resource
domain: Intervalo

Termómetro
subclass of: Sensor
subclass of: Resource
subclass of: Thing
type: Class
comment: Mide la temperatura en grados Celsius
label: Thermometer @en
subclass of: http://lodlaundromat.org/.well-known/genid/b376e9a0a07605e42f1b1bc7a2ca30eb#23
subclass of: http://lodlaundromat.org/.well-known/genid/b376e9a0a07605e42f1b1bc7a2ca30eb#20
subclass of: http://lodlaundromat.org/.well-known/genid/b376e9a0a07605e42f1b1bc7a2ca30eb#22
subclass of: http://lodlaundromat.org/.well-known/genid/b376e9a0a07605e42f1b1bc7a2ca30eb#21
subclass of: http://lodlaundromat.org/.well-known/genid/b376e9a0a07605e42f1b1bc7a2ca30eb#3
subclass of: Objeto
subclass of: Objeto físico

made observation
range: Thing
domain: Thing
comment: Relation between a Sensor and Observations it has made.
inverse of: Observado por
sub property of: Es objeto incluido en
type: ObjectProperty
label: Observación hecha
type: Property
domain: Resource
range: Resource

http://lodlaundromat.org/.well-known/genid/a796ef3c26d6f93ac9d393f7f3ff9a98#25
subclass of: Resource
subclass of: Thing
type: Class
type: Restriction
on property: Año
max cardinality: 1

Tiene final
range: Thing
domain: Thing
domain: Entidad temporal
range: Instante
type: ObjectProperty
label: Has end @en
type: Property
range: Entidad temporal
range: Resource
domain: Resource

is property of
range: Thing
domain: Thing
inverse of: has property
comment: Relation between a FeatureOfInterest and a Property (a Quality observable by a sensor) of that feature.
sub property of: Es calidad de
type: ObjectProperty
label: Es propiedad de
type: Property
domain: Resource
range: Resource

has survival range
sub property of: Tiene calidad
range: Thing
domain: Thing
comment: A Relation from a System to a SurvivalRange.
sub property of: has property
type: ObjectProperty
label: Tiene rango de supervivencia
type: Property
domain: Resource
range: Resource

attached system
range: Thing
inverse of: on platform
domain: Thing
comment: Relation between a Platform and any Systems (e.g., Sensors) that are attached to the Platform.
sub property of: Es localización de
type: ObjectProperty
label: Sistema acoplado
type: Property
domain: Resource
range: Resource

Después
range: Entidad temporal
domain: Entidad temporal
range: Thing
domain: Thing
inverse of: Antes
type: ObjectProperty
comment: after @en
label: After @en
type: Property
range: Resource
domain: Resource

Input
subclass of: Resource
subclass of: Thing
type: Class
disjoint with: Output
source: http://marinemetadata.org/community/teams/ontdevices
comment: Any information that is provided to a process for its use [MMI OntDev]
label: Entrada

Objeto de información
subclass of: Resource
subclass of: Thing
type: Class
label: Information object @en

location
equivalent property: Localizado en
sub property of: Localizado en
range: Thing
domain: Thing
label: Location @en
comment: The relation between something and the point, or other geometrical thing in space, where it is. For example, the realtionship between a radio tower and a Point with a given lat and long. Or a relationship between a park and its outline as a closed arc of points, or a road and its location as a arc (a sequence of points). Clearly in practice there will be limit to the accuracy of any such statement, but one would expect an accuracy appropriate for the size of the object and uses such as mapping
range: SpatialThing
sub property of: based near
type: ObjectProperty
label: Localización
type: Property
domain: Sensor
domain: Resource
domain: Objeto
domain: http://lodlaundromat.org/.well-known/genid/b376e9a0a07605e42f1b1bc7a2ca30eb#21
domain: http://lodlaundromat.org/.well-known/genid/b376e9a0a07605e42f1b1bc7a2ca30eb#3
domain: http://lodlaundromat.org/.well-known/genid/b376e9a0a07605e42f1b1bc7a2ca30eb#20
domain: http://lodlaundromat.org/.well-known/genid/b376e9a0a07605e42f1b1bc7a2ca30eb#22
domain: http://lodlaundromat.org/.well-known/genid/b376e9a0a07605e42f1b1bc7a2ca30eb#23
domain: Objeto físico
range: http://lodlaundromat.org/.well-known/genid/d5e8cafd5833f18c9c214938a7904a12#1
range: http://lodlaundromat.org/.well-known/genid/2e99a4ec08762bee318b267c5d104289#1
range: Resource

Provincia
subclass of: Resource
subclass of: Thing
type: Class
label: Province @en
subclass of: Area administrativa
comment: Cada una de las grandes divisiones de un territorio o Estado, sujeta por lo común a una autoridad administrativa.
subclass of: http://lodlaundromat.org/.well-known/genid/d5e8cafd5833f18c9c214938a7904a12#1
subclass of: http://lodlaundromat.org/.well-known/genid/2e99a4ec08762bee318b267c5d104289#1

Battery Lifetime
subclass of: Resource
subclass of: Thing
type: Class
subclass of: Survival Property
comment: Total useful life of a battery.
label: Vida de la batería
subclass of: http://lodlaundromat.org/.well-known/genid/b376e9a0a07605e42f1b1bc7a2ca30eb#19
subclass of: Property
subclass of: Calidad

Es calidad de
range: Thing
domain: Thing
type: ObjectProperty
label: Is quality of @en
type: Property
range: Resource
domain: Resource

Es participante
range: Thing
domain: Thing
type: ObjectProperty
label: Is participantin @en
type: Property
range: Resource
domain: Resource

Zona horaria
subclass of: Resource
subclass of: Thing
type: Class
label: Timezone @en

Propiedad ambiental sobre radiación
subclass of: Resource
subclass of: Thing
type: Class
comment: Agrupa las propiedades ambientales sobre radiación.
label: Radiation ambient property @en
subclass of: Propiedad ambiental
subclass of: http://lodlaundromat.org/.well-known/genid/b376e9a0a07605e42f1b1bc7a2ca30eb#19
subclass of: Property
subclass of: Calidad

Reloj
subclass of: Resource
subclass of: Sensor
subclass of: Thing
type: Class
comment: Mide el tiempo en UTC
label: Clock @en
subclass of: http://lodlaundromat.org/.well-known/genid/b376e9a0a07605e42f1b1bc7a2ca30eb#21
subclass of: http://lodlaundromat.org/.well-known/genid/b376e9a0a07605e42f1b1bc7a2ca30eb#20
subclass of: http://lodlaundromat.org/.well-known/genid/b376e9a0a07605e42f1b1bc7a2ca30eb#23
subclass of: http://lodlaundromat.org/.well-known/genid/b376e9a0a07605e42f1b1bc7a2ca30eb#22
subclass of: Objeto
subclass of: http://lodlaundromat.org/.well-known/genid/b376e9a0a07605e42f1b1bc7a2ca30eb#3
subclass of: Objeto físico

Proceso
subclass of: Resource
subclass of: Thing
type: Class
label: Process @en

http://lodlaundromat.org/.well-known/genid/b376e9a0a07605e42f1b1bc7a2ca30eb#18
subclass of: Resource
subclass of: Thing
type: Class
type: Restriction
on property: quality of observation
min cardinality: 0

Operating Power Range
subclass of: Resource
subclass of: Thing
type: Class
subclass of: Operating Property
comment: Power range in which system/sensor is expected to operate.
label: Rango de potencia operativa
subclass of: http://lodlaundromat.org/.well-known/genid/b376e9a0a07605e42f1b1bc7a2ca30eb#19
subclass of: Property
subclass of: Calidad

Observado por
inverse of: made observation
range: Thing
domain: Thing
sub property of: Incluye objeto
type: ObjectProperty
label: Observed by @en
type: Property
domain: Resource
range: Resource

Instante
subclass of: Resource
subclass of: Thing
type: Class
subclass of: Entidad temporal
label: Instant @en
disjoint with: Intervalo apropiado

Sensor
subclass of: Sensor
subclass of: Thing
type: Class
subclass of: Resource
source: skos:exactMatch 'sensor' [SensorML OGC-0700] http://www.opengeospatial.org/standards/sensorml skos:closeMatch 'observation procedure' [O&M] http://www.opengeospatial.org/standards/om O&M allows sensors, methods, instruments, systems, algorithms and process chains as the processUsed of an observation; this ontology allows a similar range of things (any thing that can do sensing), just they are all grouped under the term sensor (which is thus wider than the O&M concept).
comment: A sensor can do (implements) sensing: that is, a sensor is any entity that can follow a sensing method and thus observe some Property of a FeatureOfInterest. Sensors may be physical devices, computational methods, a laboratory setup with a person following a method, or any other thing that can follow a Sensing Method to observe a Property.
subclass of: http://lodlaundromat.org/.well-known/genid/b376e9a0a07605e42f1b1bc7a2ca30eb#21
subclass of: http://lodlaundromat.org/.well-known/genid/b376e9a0a07605e42f1b1bc7a2ca30eb#20
subclass of: Objeto físico
subclass of: http://lodlaundromat.org/.well-known/genid/b376e9a0a07605e42f1b1bc7a2ca30eb#23
subclass of: http://lodlaundromat.org/.well-known/genid/b376e9a0a07605e42f1b1bc7a2ca30eb#22
subclass of: Objeto
subclass of: http://lodlaundromat.org/.well-known/genid/b376e9a0a07605e42f1b1bc7a2ca30eb#3
equivalent class: Sensor

in deployment
inverse of: deployed on platform
range: Thing
domain: Thing
comment: Relation between a Platform and a Deployment, recording that the object was used as a platform for a system/sensor for a particular deployment: as in this PhysicalObject is acting as a Platform inDeployment Deployment.
sub property of: Es participante
type: ObjectProperty
label: En despliegue
type: Property
domain: Resource
range: Resource

Intervalo solapa
range: Thing
inverse of: Intervalo solapado por
domain: Thing
domain: Intervalo apropiado
range: Intervalo apropiado
type: ObjectProperty
label: Interval overlaps @en
type: Property
range: Entidad temporal
range: Resource
range: Intervalo
domain: Entidad temporal
domain: Resource
domain: Intervalo

Es parámetro para
range: Thing
domain: Thing
type: ObjectProperty
label: Is setting for @en
type: Property
range: Resource
domain: Resource

Selectivity
subclass of: Resource
subclass of: Thing
type: Class
subclass of: Measurement Property
source: skos:exactMatch 'selectivity' [VIM 4.13] http://www.bipm.org/utils/common/documents/jcgm/JCGM_200_2008.pdf
comment: Selectivity is a property of a sensor whereby it provides observed values for one or more qualities such that the values of each quality are independent of other qualities in the phenomenon, body, or substance being investigated.
label: Selectividad
subclass of: http://lodlaundromat.org/.well-known/genid/b376e9a0a07605e42f1b1bc7a2ca30eb#19
subclass of: Calidad
subclass of: Property

http://lodlaundromat.org/.well-known/genid/a796ef3c26d6f93ac9d393f7f3ff9a98#32
subclass of: Resource
subclass of: Thing
type: Class
type: Restriction
on property: Minuto
max cardinality: 1

Observada en intervalo
range: Thing
domain: Thing
comment: Relaciona una observación con el intervalo de tiempo en el que fue observada.
type: ObjectProperty
domain: Observación
label: Observed in interval @en
range: Descripción fecha hora
type: Property
range: Resource
range: http://lodlaundromat.org/.well-known/genid/a796ef3c26d6f93ac9d393f7f3ff9a98#24
range: http://lodlaundromat.org/.well-known/genid/a796ef3c26d6f93ac9d393f7f3ff9a98#30
range: http://lodlaundromat.org/.well-known/genid/a796ef3c26d6f93ac9d393f7f3ff9a98#25
range: http://lodlaundromat.org/.well-known/genid/a796ef3c26d6f93ac9d393f7f3ff9a98#33
range: http://lodlaundromat.org/.well-known/genid/a796ef3c26d6f93ac9d393f7f3ff9a98#27
range: http://lodlaundromat.org/.well-known/genid/a796ef3c26d6f93ac9d393f7f3ff9a98#28
range: http://lodlaundromat.org/.well-known/genid/a796ef3c26d6f93ac9d393f7f3ff9a98#34
range: http://lodlaundromat.org/.well-known/genid/a796ef3c26d6f93ac9d393f7f3ff9a98#32
range: http://lodlaundromat.org/.well-known/genid/a796ef3c26d6f93ac9d393f7f3ff9a98#29
range: http://lodlaundromat.org/.well-known/genid/a796ef3c26d6f93ac9d393f7f3ff9a98#31
range: http://lodlaundromat.org/.well-known/genid/a796ef3c26d6f93ac9d393f7f3ff9a98#26
domain: Resource
domain: http://lodlaundromat.org/.well-known/genid/b376e9a0a07605e42f1b1bc7a2ca30eb#17
domain: http://lodlaundromat.org/.well-known/genid/b376e9a0a07605e42f1b1bc7a2ca30eb#9
domain: http://lodlaundromat.org/.well-known/genid/b376e9a0a07605e42f1b1bc7a2ca30eb#14
domain: http://lodlaundromat.org/.well-known/genid/b376e9a0a07605e42f1b1bc7a2ca30eb#16
domain: http://lodlaundromat.org/.well-known/genid/b376e9a0a07605e42f1b1bc7a2ca30eb#6
domain: http://lodlaundromat.org/.well-known/genid/b376e9a0a07605e42f1b1bc7a2ca30eb#11
domain: http://lodlaundromat.org/.well-known/genid/b376e9a0a07605e42f1b1bc7a2ca30eb#12
domain: http://lodlaundromat.org/.well-known/genid/b376e9a0a07605e42f1b1bc7a2ca30eb#7
domain: http://lodlaundromat.org/.well-known/genid/b376e9a0a07605e42f1b1bc7a2ca30eb#15
domain: http://lodlaundromat.org/.well-known/genid/b376e9a0a07605e42f1b1bc7a2ca30eb#10
domain: Observation
domain: http://lodlaundromat.org/.well-known/genid/b376e9a0a07605e42f1b1bc7a2ca30eb#18
domain: http://lodlaundromat.org/.well-known/genid/b376e9a0a07605e42f1b1bc7a2ca30eb#13
domain: http://lodlaundromat.org/.well-known/genid/b376e9a0a07605e42f1b1bc7a2ca30eb#8
domain: Situación

Tiene calidad
range: Thing
domain: Thing
type: ObjectProperty
label: Has quality @en
type: Property
range: Resource
domain: Resource

Sensor Input
subclass of: Resource
subclass of: Thing
type: Class
subclass of: Stimulus
source: http://www.w3.org/2005/Incubator/ssn/
comment: An Event in the real world that 'triggers' the sensor. The properties associated to the stimulus may be different to eventual observed property. It is the event, not the object that triggers the sensor.
label: Entrada al sensor
subclass of: http://lodlaundromat.org/.well-known/genid/b376e9a0a07605e42f1b1bc7a2ca30eb#24
equivalent class: Stimulus
subclass of: Evento
subclass of: http://lodlaundromat.org/.well-known/genid/b376e9a0a07605e42f1b1bc7a2ca30eb#3

Accuracy
subclass of: Resource
subclass of: Thing
type: Class
subclass of: Measurement Property
source: skos:exactMatch 'measurement accuracy/accuracy' [VIM 2.13] http://www.bipm.org/utils/common/documents/jcgm/JCGM_200_2008.pdf
comment: The closeness of agreement between the value of an observation and the true value of the observed quality.
label: Precisión
subclass of: http://lodlaundromat.org/.well-known/genid/b376e9a0a07605e42f1b1bc7a2ca30eb#19
subclass of: Property
subclass of: Calidad

Antes
inverse of: Después
range: Thing
domain: Thing
type: TransitiveProperty
domain: Entidad temporal
range: Entidad temporal
type: ObjectProperty
comment: Before @en
label: Before @en
type: Property
range: Resource
domain: Resource

http://lodlaundromat.org/.well-known/genid/a796ef3c26d6f93ac9d393f7f3ff9a98#6
subclass of: Resource
subclass of: Thing
type: Class
type: Restriction
on property: Días
max cardinality: 1

http://lodlaundromat.org/.well-known/genid/a796ef3c26d6f93ac9d393f7f3ff9a98#14
subclass of: Resource
type: Class
subclass of: Thing
type: Restriction
on property: Horas
cardinality: 0

Día de la semana
range: Thing
domain: Thing
domain: Descripción fecha hora
range: Día de la semana
type: ObjectProperty
comment: Day of week @en
label: Day of week @en
type: Property
range: Resource
domain: Resource
domain: http://lodlaundromat.org/.well-known/genid/a796ef3c26d6f93ac9d393f7f3ff9a98#24
domain: http://lodlaundromat.org/.well-known/genid/a796ef3c26d6f93ac9d393f7f3ff9a98#30
domain: http://lodlaundromat.org/.well-known/genid/a796ef3c26d6f93ac9d393f7f3ff9a98#25
domain: http://lodlaundromat.org/.well-known/genid/a796ef3c26d6f93ac9d393f7f3ff9a98#33
domain: http://lodlaundromat.org/.well-known/genid/a796ef3c26d6f93ac9d393f7f3ff9a98#27
domain: http://lodlaundromat.org/.well-known/genid/a796ef3c26d6f93ac9d393f7f3ff9a98#28
domain: http://lodlaundromat.org/.well-known/genid/a796ef3c26d6f93ac9d393f7f3ff9a98#34
domain: http://lodlaundromat.org/.well-known/genid/a796ef3c26d6f93ac9d393f7f3ff9a98#32
domain: http://lodlaundromat.org/.well-known/genid/a796ef3c26d6f93ac9d393f7f3ff9a98#29
domain: http://lodlaundromat.org/.well-known/genid/a796ef3c26d6f93ac9d393f7f3ff9a98#31
domain: http://lodlaundromat.org/.well-known/genid/a796ef3c26d6f93ac9d393f7f3ff9a98#26

Tiene descripción de fecha hora
range: Thing
domain: Thing
domain: Intervalo de fecha hora
range: Descripción fecha hora
type: ObjectProperty
label: Has date time description @en
type: Property
range: Resource
range: http://lodlaundromat.org/.well-known/genid/a796ef3c26d6f93ac9d393f7f3ff9a98#24
range: http://lodlaundromat.org/.well-known/genid/a796ef3c26d6f93ac9d393f7f3ff9a98#30
range: http://lodlaundromat.org/.well-known/genid/a796ef3c26d6f93ac9d393f7f3ff9a98#25
range: http://lodlaundromat.org/.well-known/genid/a796ef3c26d6f93ac9d393f7f3ff9a98#33
range: http://lodlaundromat.org/.well-known/genid/a796ef3c26d6f93ac9d393f7f3ff9a98#27
range: http://lodlaundromat.org/.well-known/genid/a796ef3c26d6f93ac9d393f7f3ff9a98#28
range: http://lodlaundromat.org/.well-known/genid/a796ef3c26d6f93ac9d393f7f3ff9a98#34
range: http://lodlaundromat.org/.well-known/genid/a796ef3c26d6f93ac9d393f7f3ff9a98#32
range: http://lodlaundromat.org/.well-known/genid/a796ef3c26d6f93ac9d393f7f3ff9a98#29
range: http://lodlaundromat.org/.well-known/genid/a796ef3c26d6f93ac9d393f7f3ff9a98#31
range: http://lodlaundromat.org/.well-known/genid/a796ef3c26d6f93ac9d393f7f3ff9a98#26
domain: Entidad temporal
domain: Resource
domain: Intervalo
domain: Intervalo apropiado

http://lodlaundromat.org/.well-known/genid/b376e9a0a07605e42f1b1bc7a2ca30eb#13
subclass of: Resource
subclass of: Thing
type: Class
type: Restriction
on property: observed property
on class: Property
qualified cardinality: 1

on platform
range: Thing
domain: Thing
comment: Relation between a System (e.g., a Sensor) and a Platform. The relation locates the sensor relative to other described entities entities: i.e., the Sensor s1's location is Platform p1. More precise locations for sensors in space (relative to other entities, where attached to another entity, or in 3D space) are made using DOLCE's Regions (SpaceRegion).
inverse of: attached system
sub property of: Tiene localización
type: ObjectProperty
label: En plataforma
type: Property
domain: Resource
range: Resource

Calidad
subclass of: Resource
subclass of: Thing
type: Class
label: Quality @en

deployed system
inverse of: has deployment
range: Thing
domain: Thing
comment: Relation between a deployment and the deployed system.
sub property of: Tiene participante
type: ObjectProperty
label: Sistema desplegado
type: Property
domain: Resource
range: Resource

http://lodlaundromat.org/.well-known/genid/a796ef3c26d6f93ac9d393f7f3ff9a98#26
subclass of: Resource
subclass of: Thing
type: Class
type: Restriction
on property: Mes
max cardinality: 1

Measurement Range
subclass of: Resource
subclass of: Thing
type: Class
subclass of: Measurement Property
comment: The set of values that the sensor can return as the result of an observation under the defined conditions with the defined measurement properties. (If no conditions are specified or the conditions do not specify a range for the observed qualities, the measurement range is to be taken as the condition for the observed qualities.)
source: skos:exactMatch 'measuring interval/measurement range' [VIM 4.7] http://www.bipm.org/utils/common/documents/jcgm/JCGM_200_2008.pdf
label: Rango de medida
subclass of: http://lodlaundromat.org/.well-known/genid/b376e9a0a07605e42f1b1bc7a2ca30eb#19
subclass of: Calidad
subclass of: Property

Sensor Data Sheet
subclass of: Resource
subclass of: Thing
type: Class
subclass of: Objeto de información
comment: A data sheet records properties of a sensor. A data sheet might describe for example the accuracy in various conditions, the power use, the types of connectors that the sensor has, etc. Generally a sensor's properties are recorded directly (with hasMeasurementCapability, for example), but the data sheet can be used for example to record the manufacturers specifications verses observed capabilites, or if more is known than the manufacturer specifies, etc. The data sheet is an information object about the sensor's properties, rather than a direct link to the actual properties themselves.
source: http://www.w3.org/2005/Incubator/ssn/
label: Hoja de especificaciones del sensor

Observation
subclass of: Thing
subclass of: Observación
type: Class
subclass of: Resource
subclass of: http://lodlaundromat.org/.well-known/genid/b376e9a0a07605e42f1b1bc7a2ca30eb#15
subclass of: http://lodlaundromat.org/.well-known/genid/b376e9a0a07605e42f1b1bc7a2ca30eb#13
subclass of: http://lodlaundromat.org/.well-known/genid/b376e9a0a07605e42f1b1bc7a2ca30eb#18
subclass of: http://lodlaundromat.org/.well-known/genid/b376e9a0a07605e42f1b1bc7a2ca30eb#17
subclass of: Situación
subclass of: http://lodlaundromat.org/.well-known/genid/b376e9a0a07605e42f1b1bc7a2ca30eb#16
subclass of: http://lodlaundromat.org/.well-known/genid/b376e9a0a07605e42f1b1bc7a2ca30eb#7
source: skos:closeMatch 'observation' [O&M] http://www.opengeospatial.org/standards/om Observation in this ontology and O&M are described differently (O&M records an observation as an act/event), but they record the same thing and are essentially interchangeable. The difference is in the ontological structure of the two, not the data or use. Observation here records a Situation (the estimation of the value of a Property) and a description of the method that was used (along with the participants), while O&M interprets an Observation as the event itself; there must, however, have been an event that lead to our situation, so both are records of events. The distinction is between the event itself and the record of what happened in that event. skos:closeMatch 'measurement result' [VIM 2.9] http://www.bipm.org/utils/common/documents/jcgm/JCGM_200_2008.pdf Measurement result in VIM is the measured value plus any other relevant information, which means that measurement result and observation will often be associated to the same data (a value, a time, a property, etc.).
subclass of: http://lodlaundromat.org/.well-known/genid/b376e9a0a07605e42f1b1bc7a2ca30eb#9
subclass of: http://lodlaundromat.org/.well-known/genid/b376e9a0a07605e42f1b1bc7a2ca30eb#10
subclass of: http://lodlaundromat.org/.well-known/genid/b376e9a0a07605e42f1b1bc7a2ca30eb#6
subclass of: http://lodlaundromat.org/.well-known/genid/b376e9a0a07605e42f1b1bc7a2ca30eb#8
comment: An Observation is a Situation in which a Sensing method has been used to estimate or calculate a value of a Property of a FeatureOfInterest. Links to Sensing and Sensor describe what made the Observation and how; links to Property and Feature detail what was sensed; the result is the output of a Sensor; other metadata details times etc.
subclass of: http://lodlaundromat.org/.well-known/genid/b376e9a0a07605e42f1b1bc7a2ca30eb#12
label: Observación
subclass of: http://lodlaundromat.org/.well-known/genid/b376e9a0a07605e42f1b1bc7a2ca30eb#11
subclass of: http://lodlaundromat.org/.well-known/genid/b376e9a0a07605e42f1b1bc7a2ca30eb#14
equivalent class: Observación

has operating property
sub property of: Tiene calidad
range: Thing
domain: Thing
comment: Relation from an OperatingRange to a Property. For example, to a battery lifetime.
sub property of: has property
type: ObjectProperty
label: Tiene propiedad operativa
type: Property
domain: Resource
range: Resource

Deployment-related Process
subclass of: Resource
subclass of: Thing
type: Class
subclass of: Proceso
subclass of: http://lodlaundromat.org/.well-known/genid/b376e9a0a07605e42f1b1bc7a2ca30eb#45
source: http://www.w3.org/2005/Incubator/ssn/
comment: Place to group all the various Processes related to Deployment. For example, as well as Deplyment, installation, maintenance, deployment of further sensors and the like would all be classified under DeploymentRelatedProcess.
label: Proceso relacionado con el despliegue

Es objeto incluido en
range: Thing
domain: Thing
type: ObjectProperty
label: Is object included in @en
type: Property
range: Resource
domain: Resource

observes
range: Thing
domain: Thing
comment: Relation between a Sensor and a Property that the sensor can observe. Note that, given the DUL modelling of Qualities, a sensor defined with 'observes only Windspeed' technically links the sensor to particular instances of Windspeed, not to the concept itself - OWL can't express concept-concept relations, only individual-individual. The property composition ensures that if an observation is made of a particular quality then one can infer that the sensor observes that quality.
property chain axiom: http://lodlaundromat.org/.well-known/genid/b376e9a0a07605e42f1b1bc7a2ca30eb#36
property chain axiom: http://lodlaundromat.org/.well-known/genid/b376e9a0a07605e42f1b1bc7a2ca30eb#38
type: ObjectProperty
label: Observa
type: Property
range: Resource
domain: Resource

Captura
inverse of: Es capturada por
range: Thing
domain: Thing
comment: Relationa las estaciones meteorológicas con sus observaciones.
type: ObjectProperty
comment: Capture @en
domain: Estación meteorológica
label: Captured @en
range: Observación
type: Property
range: Resource
range: http://lodlaundromat.org/.well-known/genid/b376e9a0a07605e42f1b1bc7a2ca30eb#17
range: http://lodlaundromat.org/.well-known/genid/b376e9a0a07605e42f1b1bc7a2ca30eb#9
range: http://lodlaundromat.org/.well-known/genid/b376e9a0a07605e42f1b1bc7a2ca30eb#14
range: http://lodlaundromat.org/.well-known/genid/b376e9a0a07605e42f1b1bc7a2ca30eb#16
range: http://lodlaundromat.org/.well-known/genid/b376e9a0a07605e42f1b1bc7a2ca30eb#6
range: http://lodlaundromat.org/.well-known/genid/b376e9a0a07605e42f1b1bc7a2ca30eb#11
range: http://lodlaundromat.org/.well-known/genid/b376e9a0a07605e42f1b1bc7a2ca30eb#12
range: http://lodlaundromat.org/.well-known/genid/b376e9a0a07605e42f1b1bc7a2ca30eb#7
range: http://lodlaundromat.org/.well-known/genid/b376e9a0a07605e42f1b1bc7a2ca30eb#15
range: http://lodlaundromat.org/.well-known/genid/b376e9a0a07605e42f1b1bc7a2ca30eb#10
range: Observation
range: http://lodlaundromat.org/.well-known/genid/b376e9a0a07605e42f1b1bc7a2ca30eb#18
range: http://lodlaundromat.org/.well-known/genid/b376e9a0a07605e42f1b1bc7a2ca30eb#13
range: http://lodlaundromat.org/.well-known/genid/b376e9a0a07605e42f1b1bc7a2ca30eb#8
range: Situación
domain: http://lodlaundromat.org/.well-known/genid/b376e9a0a07605e42f1b1bc7a2ca30eb#47
domain: http://lodlaundromat.org/.well-known/genid/b376e9a0a07605e42f1b1bc7a2ca30eb#46
domain: Objeto físico
domain: Resource
domain: Platform
domain: http://lodlaundromat.org/.well-known/genid/b376e9a0a07605e42f1b1bc7a2ca30eb#3
domain: Objeto

Propiedad ambiental sobre temperatura
subclass of: Resource
subclass of: Thing
type: Class
comment: Agrupa las propiedades ambientales sobre temperatura.
label: Temperature ambient property @en
subclass of: Propiedad ambiental
subclass of: http://lodlaundromat.org/.well-known/genid/b376e9a0a07605e42f1b1bc7a2ca30eb#19
subclass of: Property
subclass of: Calidad

Area administrativa
subclass of: http://lodlaundromat.org/.well-known/genid/2e99a4ec08762bee318b267c5d104289#1
subclass of: Resource
subclass of: Thing
type: Class
subclass of: http://lodlaundromat.org/.well-known/genid/d5e8cafd5833f18c9c214938a7904a12#1
label: Administrative area @en
comment: Distrito delimitado para fines administrativos.

implements
range: Thing
domain: Thing
comment: A relation between an entity that implements a method in some executable way and the description of an algorithm, procedure or method. For example, between a Sensor and the scientific measuring method that the Sensor uses to observe a Property.
inverse of: implemented by
sub property of: Está descrito por
type: ObjectProperty
label: Implementa
type: Property
domain: Resource
range: Resource

Stimulus
subclass of: Sensor Input
subclass of: Resource
subclass of: Thing
type: Class
subclass of: Evento
source: http://www.w3.org/2005/Incubator/ssn/
comment: An Event in the real world that 'triggers' the sensor. The properties associated to the stimulus may be different to eventual observed property. It is the event, not the object that triggers the sensor.
label: Estímulo
subclass of: http://lodlaundromat.org/.well-known/genid/b376e9a0a07605e42f1b1bc7a2ca30eb#24
subclass of: http://lodlaundromat.org/.well-known/genid/b376e9a0a07605e42f1b1bc7a2ca30eb#3
equivalent class: Sensor Input

of feature
range: Thing
domain: Thing
comment: A relation between some aspect of a sensing entity and a feature. For example, from a sensor to the features it can observe properties of, or from a deployment to the features it was installed to observe. Also from a measurement capability to the feature the capability is described for. (Used in conjunction with forProperty).
type: ObjectProperty
label: De característica
type: Property
range: Resource
domain: Resource

Observación
subclass of: Resource
type: Class
subclass of: Observation
label: Observation @en
subclass of: Thing
equivalent class: Observation
subclass of: http://lodlaundromat.org/.well-known/genid/b376e9a0a07605e42f1b1bc7a2ca30eb#18
subclass of: http://lodlaundromat.org/.well-known/genid/b376e9a0a07605e42f1b1bc7a2ca30eb#14
subclass of: http://lodlaundromat.org/.well-known/genid/b376e9a0a07605e42f1b1bc7a2ca30eb#9
subclass of: http://lodlaundromat.org/.well-known/genid/b376e9a0a07605e42f1b1bc7a2ca30eb#17
subclass of: http://lodlaundromat.org/.well-known/genid/b376e9a0a07605e42f1b1bc7a2ca30eb#10
subclass of: http://lodlaundromat.org/.well-known/genid/b376e9a0a07605e42f1b1bc7a2ca30eb#11
subclass of: http://lodlaundromat.org/.well-known/genid/b376e9a0a07605e42f1b1bc7a2ca30eb#16
subclass of: http://lodlaundromat.org/.well-known/genid/b376e9a0a07605e42f1b1bc7a2ca30eb#6
subclass of: http://lodlaundromat.org/.well-known/genid/b376e9a0a07605e42f1b1bc7a2ca30eb#15
subclass of: http://lodlaundromat.org/.well-known/genid/b376e9a0a07605e42f1b1bc7a2ca30eb#12
subclass of: Situación
subclass of: http://lodlaundromat.org/.well-known/genid/b376e9a0a07605e42f1b1bc7a2ca30eb#13
subclass of: http://lodlaundromat.org/.well-known/genid/b376e9a0a07605e42f1b1bc7a2ca30eb#7
subclass of: http://lodlaundromat.org/.well-known/genid/b376e9a0a07605e42f1b1bc7a2ca30eb#8

Tiene descripción de duración
range: Thing
domain: Thing
domain: Entidad temporal
range: Descripción de la duración
type: ObjectProperty
label: Has duration description @en
type: Property
range: Resource
range: http://lodlaundromat.org/.well-known/genid/a796ef3c26d6f93ac9d393f7f3ff9a98#8
range: http://lodlaundromat.org/.well-known/genid/a796ef3c26d6f93ac9d393f7f3ff9a98#5
range: http://lodlaundromat.org/.well-known/genid/a796ef3c26d6f93ac9d393f7f3ff9a98#7
range: http://lodlaundromat.org/.well-known/genid/a796ef3c26d6f93ac9d393f7f3ff9a98#3
range: http://lodlaundromat.org/.well-known/genid/a796ef3c26d6f93ac9d393f7f3ff9a98#9
range: http://lodlaundromat.org/.well-known/genid/a796ef3c26d6f93ac9d393f7f3ff9a98#4
range: http://lodlaundromat.org/.well-known/genid/a796ef3c26d6f93ac9d393f7f3ff9a98#6
domain: Resource

sensing method used
range: Thing
domain: Thing
source: http://www.bipm.org/en/committees/jc/jcgm/wg2.html
comment: A (measurement) procedure is a detailed description of a measurement according to one or more measurement principles and to a given measurement method, based on a measurement model and including any calculation to obtain a measurement result [VIM 2.6]
sub property of: Satisface
type: ObjectProperty
label: Método de captación utilizado
type: Property
domain: Resource
range: Resource

Intervalo antes
range: Thing
inverse of: Intervalo después
domain: Thing
sub property of: Antes
domain: Intervalo apropiado
range: Intervalo apropiado
type: ObjectProperty
comment: Interval before @en
label: Interval before @en
type: Property
domain: Entidad temporal
domain: Resource
range: Entidad temporal
range: Resource
range: Intervalo
domain: Intervalo

Feature of Interest
subclass of: Resource
type: Class
subclass of: Thing
source: skos:exactMatch 'feature' [O&M]
subclass of: http://lodlaundromat.org/.well-known/genid/b376e9a0a07605e42f1b1bc7a2ca30eb#1
subclass of: http://lodlaundromat.org/.well-known/genid/b376e9a0a07605e42f1b1bc7a2ca30eb#3
source: skos:exactMatch 'feature' [O&M] http://www.opengeospatial.org/standards/om
label: Característica de interés
comment: A feature is an abstraction of real world phenomena (thing, person, event, etc).
subclass of: http://lodlaundromat.org/.well-known/genid/b376e9a0a07605e42f1b1bc7a2ca30eb#2

Intervalo cumplido por
range: Intervalo apropiado
domain: Intervalo apropiado
range: Thing
domain: Thing
inverse of: Intervalo cumple
type: ObjectProperty
label: Interval met by @en
type: Property
range: Entidad temporal
range: Resource
range: Intervalo
domain: Entidad temporal
domain: Resource
domain: Intervalo

Response time
subclass of: Resource
subclass of: Thing
type: Class
subclass of: Measurement Property
comment: The time between a (step) change inthe value of an observed quality and a sensor (possibly with specified error) 'settling' on an observed value.
source: skos:exactMatch 'step response time' [VIM 4.23] http://www.bipm.org/utils/common/documents/jcgm/JCGM_200_2008.pdf
label: Tiempo de respuesta
subclass of: http://lodlaundromat.org/.well-known/genid/b376e9a0a07605e42f1b1bc7a2ca30eb#19
subclass of: Calidad
subclass of: Property

Survival Range
subclass of: Resource
subclass of: Thing
type: Class
subclass of: http://lodlaundromat.org/.well-known/genid/b376e9a0a07605e42f1b1bc7a2ca30eb#50
subclass of: http://lodlaundromat.org/.well-known/genid/b376e9a0a07605e42f1b1bc7a2ca30eb#51
comment: The conditions a sensor can be exposed to without damage: i.e., the sensor continues to operate as defined using MeasurementCapability. If, however, the SurvivalRange is exceeded, the sensor is 'damaged' and MeasurementCapability specifications may no longer hold.
subclass of: Property
label: Rango de supervivencia
source: skos:narrowerMatch 'limiting operating condition' [VIM 4.10] http://www.bipm.org/utils/common/documents/jcgm/JCGM_200_2008.pdf
subclass of: http://lodlaundromat.org/.well-known/genid/b376e9a0a07605e42f1b1bc7a2ca30eb#49
subclass of: http://lodlaundromat.org/.well-known/genid/b376e9a0a07605e42f1b1bc7a2ca30eb#42
subclass of: http://lodlaundromat.org/.well-known/genid/b376e9a0a07605e42f1b1bc7a2ca30eb#19
subclass of: Calidad

Propiedad ambiental sobre precipitacion
subclass of: Resource
subclass of: Thing
type: Class
comment: Agrupa las propiedades ambientales sobre precipitaciones.
label: Precipitation ambient property @en
subclass of: Propiedad ambiental
subclass of: http://lodlaundromat.org/.well-known/genid/b376e9a0a07605e42f1b1bc7a2ca30eb#19
subclass of: Property
subclass of: Calidad

Observation Value
subclass of: Resource
subclass of: Thing
type: Class
subclass of: Región
subclass of: http://lodlaundromat.org/.well-known/genid/b376e9a0a07605e42f1b1bc7a2ca30eb#52
comment: The value of the result of an Observation. An Observation has a result which is the output of some sensor, the result is an information object that encodes some value for a Feature.
source: skos:exactMatch 'measured quantity value' [VIM 2.10] http://www.bipm.org/utils/common/documents/jcgm/JCGM_200_2008.pdf skos:exactMatch 'observed value' [SensorML OGC-0700] http://www.opengeospatial.org/standards/sensorml skos:closeMatch 'observation result' [O&M] http://www.opengeospatial.org/standards/om O&M conflates what we have as SensorOutput and ObservationValue into observation result, though the OGC standard does say "result contains a value" and "a result which has a value", which fits naturally with the model here.
label: Valor de observación

Drift
subclass of: Resource
subclass of: Thing
type: Class
subclass of: Measurement Property
comment: A, continuous or incremental, change in the reported values of observations over time for an unchanging quality.
source: skos:exactMatch 'instrumental drift' [VIM 4.21] http://www.bipm.org/utils/common/documents/jcgm/JCGM_200_2008.pdf
label: Deriva
subclass of: http://lodlaundromat.org/.well-known/genid/b376e9a0a07605e42f1b1bc7a2ca30eb#19
subclass of: Calidad
subclass of: Property

Termómetro humedo
subclass of: Resource
subclass of: Thing
type: Class
comment: Mide la temperatura en grados Celsius. Mide la temperatura que varia cuando la humedad del aire varia.
label: Wet bulb thermometer @en
subclass of: Termómetro
subclass of: http://lodlaundromat.org/.well-known/genid/b376e9a0a07605e42f1b1bc7a2ca30eb#20
subclass of: http://lodlaundromat.org/.well-known/genid/b376e9a0a07605e42f1b1bc7a2ca30eb#21
subclass of: http://lodlaundromat.org/.well-known/genid/b376e9a0a07605e42f1b1bc7a2ca30eb#22
subclass of: Sensor
subclass of: http://lodlaundromat.org/.well-known/genid/b376e9a0a07605e42f1b1bc7a2ca30eb#23
subclass of: Objeto
subclass of: http://lodlaundromat.org/.well-known/genid/b376e9a0a07605e42f1b1bc7a2ca30eb#3
subclass of: Objeto físico

Intervalo equivale
range: Thing
domain: Thing
domain: Intervalo apropiado
range: Intervalo apropiado
type: ObjectProperty
label: Interval equals @en
type: Property
range: Entidad temporal
range: Resource
range: Intervalo
domain: Entidad temporal
domain: Resource
domain: Intervalo

Tiene participante
range: Thing
domain: Thing
type: ObjectProperty
label: Has participant @en
type: Property
range: Resource
domain: Resource

http://lodlaundromat.org/.well-known/genid/a796ef3c26d6f93ac9d393f7f3ff9a98#33
subclass of: Resource
subclass of: Thing
type: Class
type: Restriction
on property: Segundo
max cardinality: 1

is produced by
range: Thing
domain: Thing
comment: Relation between a producer and a produced entity: for example, between a sensor and the produced output.
type: ObjectProperty
label: Es producido por
type: Property
range: Resource
domain: Resource

Tiene región
range: Thing
domain: Thing
type: ObjectProperty
label: Has region @en
type: Property
range: Resource
domain: Resource

http://lodlaundromat.org/.well-known/genid/a796ef3c26d6f93ac9d393f7f3ff9a98#7
subclass of: Resource
subclass of: Thing
type: Class
type: Restriction
on property: Horas
max cardinality: 1

end time
range: Thing
domain: Thing
sub property of: Tiene región
type: ObjectProperty
label: Hora de finalización
type: Property
domain: Resource
range: Resource

altitude
range: Thing
domain: Thing
type: ObjectProperty
comment: The WGS84 altitude of a SpatialThing (decimal meters above the local reference ellipsoid).
domain: SpatialThing
type: Property
range: Resource
domain: Resource
domain: http://lodlaundromat.org/.well-known/genid/d5e8cafd5833f18c9c214938a7904a12#1
domain: http://lodlaundromat.org/.well-known/genid/2e99a4ec08762bee318b267c5d104289#1

Output
subclass of: Resource
subclass of: Thing
type: Class
comment: Any information that is reported from a process. [MMI OntDev]
source: http://marinemetadata.org/community/teams/ontdevices
label: Salida
disjoint with: Input

http://lodlaundromat.org/.well-known/genid/a796ef3c26d6f93ac9d393f7f3ff9a98#15
type: Class
subclass of: Thing
subclass of: Resource
type: Restriction
on property: Minutos
cardinality: 0

Intervalo contiene
range: Intervalo apropiado
domain: Intervalo apropiado
range: Thing
domain: Thing
inverse of: Intervalo durante
type: ObjectProperty
label: Interval contains @en
type: Property
range: Entidad temporal
range: Resource
range: Intervalo
domain: Entidad temporal
domain: Resource
domain: Intervalo

Intervalo comenzado por
range: Intervalo apropiado
domain: Intervalo apropiado
range: Thing
domain: Thing
inverse of: Intervalo comienza
type: ObjectProperty
label: Interval started by @en
type: Property
range: Entidad temporal
range: Resource
range: Intervalo
domain: Entidad temporal
domain: Resource
domain: Intervalo

Operating Range
subclass of: Resource
subclass of: Thing
type: Class
source: skos:broaderMatch 'reference operating condition' [VIM 4.11] http://www.bipm.org/utils/common/documents/jcgm/JCGM_200_2008.pdf The difference is that here we also allow for qualities that aren't VIM influence quantities [VIM 2.52] - for example, a quantity that alters the power requirements, but doesn't affect the measurement properties - conditions specified in MeasurementCapability should be influence quantities.
subclass of: Property
label: Rango de operación
comment: The environmental conditions and characteristics of a system/sensor's normal operating environment. Can be used to specify for example the standard environmental conditions in which the sensor is expected to operate (a Condition with no OperatingProperty), or how the environmental and other operating properties relate: i.e., that the maintenance schedule or power requirements differ according to the conditions.
subclass of: http://lodlaundromat.org/.well-known/genid/b376e9a0a07605e42f1b1bc7a2ca30eb#48
subclass of: http://lodlaundromat.org/.well-known/genid/b376e9a0a07605e42f1b1bc7a2ca30eb#49
subclass of: http://lodlaundromat.org/.well-known/genid/b376e9a0a07605e42f1b1bc7a2ca30eb#42
subclass of: http://lodlaundromat.org/.well-known/genid/b376e9a0a07605e42f1b1bc7a2ca30eb#51
subclass of: http://lodlaundromat.org/.well-known/genid/b376e9a0a07605e42f1b1bc7a2ca30eb#19
subclass of: Calidad

latitude
range: Thing
domain: Thing
type: ObjectProperty
comment: The WGS84 latitude of a SpatialThing (decimal degrees).
domain: SpatialThing
type: Property
range: Resource
domain: Resource
domain: http://lodlaundromat.org/.well-known/genid/d5e8cafd5833f18c9c214938a7904a12#1
domain: http://lodlaundromat.org/.well-known/genid/2e99a4ec08762bee318b267c5d104289#1

Incluye objeto
range: Thing
domain: Thing
type: ObjectProperty
label: Includes object @en
type: Property
range: Resource
domain: Resource

Designa el límite administrativo
range: Thing
domain: Thing
type: ObjectProperty
label: Designates administrative limit @en
type: Property
range: Resource
domain: Resource

feature of interest
range: Thing
domain: Thing
source: skos:exactMatch 'featureOfInterest' [O&M - ISO/DIS 19156]
comment: A relation between an observation and the entity whose quality was observed. For example, in an observation of the weight of a person, the feature of interest is the person and the quality is weight.
source: skos:exactMatch 'featureOfInterest' [O&M - ISO/DIS 19156] http://portal.opengeospatial.org/files/?artifact_id=41579
sub property of: Es parámetro para
type: ObjectProperty
label: Característica de interés
type: Property
domain: Resource
range: Resource

point
subclass of: Resource
subclass of: Thing
type: Class
label: Point @en
subclass of: SpatialThing
comment: A point, typically described using a coordinate system relative to Earth, such as WGS84.
comment: Uniquely identified by lat/long/alt. i.e. spaciallyIntersects(P1, P2) :- lat(P1, LAT), long(P1, LONG), alt(P1, ALT), lat(P2, LAT), long(P2, LONG), alt(P2, ALT). sameThing(P1, P2) :- type(P1, Point), type(P2, Point), spaciallyIntersects(P1, P2).
label: Punto
subclass of: http://lodlaundromat.org/.well-known/genid/2e99a4ec08762bee318b267c5d104289#1
subclass of: http://lodlaundromat.org/.well-known/genid/d5e8cafd5833f18c9c214938a7904a12#1

longitude
range: Thing
domain: Thing
type: ObjectProperty
comment: The WGS84 longitude of a SpatialThing (decimal degrees).
domain: SpatialThing
type: Property
range: Resource
domain: Resource
domain: http://lodlaundromat.org/.well-known/genid/d5e8cafd5833f18c9c214938a7904a12#1
domain: http://lodlaundromat.org/.well-known/genid/2e99a4ec08762bee318b267c5d104289#1

http://lodlaundromat.org/.well-known/genid/a796ef3c26d6f93ac9d393f7f3ff9a98#27
subclass of: Resource
subclass of: Thing
type: Class
type: Restriction
on property: Semana
max cardinality: 1

Operating Property
subclass of: Resource
subclass of: Thing
type: Class
subclass of: Property
comment: An identifiable characteristic of the environmental and other conditions in which the sensor is intended to operate. May include power ranges, power sources, standard configurations, attachments and the like.
label: Propiedad de operación
subclass of: http://lodlaundromat.org/.well-known/genid/b376e9a0a07605e42f1b1bc7a2ca30eb#19
subclass of: Calidad

detects
range: Thing
domain: Thing
comment: A relation from a sensor to the Stimulus that the sensor can detect. The Stimulus itself will be serving as a proxy for (see isProxyOf) some observable property.
type: ObjectProperty
label: Detecta
type: Property
range: Resource
domain: Resource

Intervalo solapado por
range: Intervalo apropiado
domain: Intervalo apropiado
range: Thing
domain: Thing
inverse of: Intervalo solapa
type: ObjectProperty
label: Interval overlapped by @en
type: Property
range: Entidad temporal
range: Resource
range: Intervalo
domain: Entidad temporal
domain: Resource
domain: Intervalo

Property
subclass of: Resource
subclass of: Thing
type: Class
subclass of: Calidad
subclass of: http://lodlaundromat.org/.well-known/genid/b376e9a0a07605e42f1b1bc7a2ca30eb#19
comment: An observable Quality of an Event or Object. That is, not a quality of an abstract entity as is also allowed by DUL's Quality, but rather an aspect of an entity that is intrinsic to and cannot exist without the entity and is observable by a sensor.
source: skos:exactMatch 'property' [O&M] http://www.opengeospatial.org/standards/om
label: Propiedad

Región
subclass of: Resource
subclass of: Thing
type: Class
label: Region @en

has input
range: Thing
domain: Thing
type: ObjectProperty
label: Tiene entrada
type: Property
range: Resource
domain: Resource

Entidad temporal
subclass of: Resource
subclass of: Thing
type: Class
union of: http://lodlaundromat.org/.well-known/genid/a796ef3c26d6f93ac9d393f7f3ff9a98#1
label: Temporal entity @en

Situación
subclass of: Resource
subclass of: Thing
type: Class
label: Situation @en

Higrómetro
type: Class
subclass of: Resource
subclass of: Thing
subclass of: Sensor
comment: Mide la humedad relativa en %
label: Hygrometer @en
subclass of: http://lodlaundromat.org/.well-known/genid/b376e9a0a07605e42f1b1bc7a2ca30eb#23
subclass of: http://lodlaundromat.org/.well-known/genid/b376e9a0a07605e42f1b1bc7a2ca30eb#21
subclass of: http://lodlaundromat.org/.well-known/genid/b376e9a0a07605e42f1b1bc7a2ca30eb#22
subclass of: http://lodlaundromat.org/.well-known/genid/b376e9a0a07605e42f1b1bc7a2ca30eb#20
subclass of: http://lodlaundromat.org/.well-known/genid/b376e9a0a07605e42f1b1bc7a2ca30eb#3
subclass of: Objeto
subclass of: Objeto físico

http://lodlaundromat.org/.well-known/genid/a796ef3c26d6f93ac9d393f7f3ff9a98#10
subclass of: Thing
subclass of: Resource
type: Class
type: Restriction
on property: Años
cardinality: 1
subclass of: http://lodlaundromat.org/.well-known/genid/a796ef3c26d6f93ac9d393f7f3ff9a98#3

Intervalo durante
inverse of: Intervalo contiene
range: Thing
domain: Thing
domain: Intervalo apropiado
range: Intervalo apropiado
type: ObjectProperty
label: Interval during @en
type: Property
range: Entidad temporal
range: Resource
range: Intervalo
domain: Entidad temporal
domain: Resource
domain: Intervalo

Evento
subclass of: http://lodlaundromat.org/.well-known/genid/b376e9a0a07605e42f1b1bc7a2ca30eb#3
subclass of: Resource
subclass of: Thing
type: Class
label: Event @en

Describe
range: Thing
domain: Thing
type: ObjectProperty
comment: Describes @en
label: Describes @en
type: Property
range: Resource
domain: Resource

Satisface
range: Thing
domain: Thing
type: ObjectProperty
label: Satisfies @en
type: Property
range: Resource
domain: Resource

Está descrito por
range: Thing
domain: Thing
type: ObjectProperty
label: Is described by @en
type: Property
range: Resource
domain: Resource

observation result time
range: Thing
domain: Thing
comment: The result time is the time when the procedure associated with the observation act was applied.
comment: The result time shall describe the time when the result became available, typically when the procedure associated with the observation was completed For some observations this is identical to the phenomenonTime. However, there are important cases where they differ.[O&M]
source: http://www.opengeospatial.org/standards/om
sub property of: Tiene región
type: ObjectProperty
label: Hora del resultado de la observación
type: Property
domain: Resource
range: Resource

Process
subclass of: Resource
subclass of: Thing
type: Class
label: Proceso
subclass of: http://lodlaundromat.org/.well-known/genid/b376e9a0a07605e42f1b1bc7a2ca30eb#35
subclass of: http://lodlaundromat.org/.well-known/genid/b376e9a0a07605e42f1b1bc7a2ca30eb#34
subclass of: Método
comment: A process has an output and possibly inputs and, for a composite process, describes the temporal and dataflow dependencies and relationships amongst its parts. [SSN XG]
source: http://www.w3.org/2005/Incubator/ssn/
subclass of: http://lodlaundromat.org/.well-known/genid/b376e9a0a07605e42f1b1bc7a2ca30eb#33

http://lodlaundromat.org/.well-known/genid/b376e9a0a07605e42f1b1bc7a2ca30eb#7
subclass of: Resource
subclass of: Thing
type: Class
type: Restriction
on property: sensing method used
on class: Sensing
qualified cardinality: 1

observed property
range: Thing
domain: Thing
source: skos:exactMatch 'observedProperty' [O&M - ISO/DIS 19156]
comment: Relation linking an Observation to the Property that was observed. The observedProperty should be a Property (hasProperty) of the FeatureOfInterest (linked by featureOfInterest) of this observation.
source: skos:exactMatch 'observedProperty' [O&M - ISO/DIS 19156] http://portal.opengeospatial.org/files/?artifact_id=41579
sub property of: Es parámetro para
type: ObjectProperty
label: Propiedad observada
type: Property
domain: Resource
range: Resource

http://lodlaundromat.org/.well-known/genid/a796ef3c26d6f93ac9d393f7f3ff9a98#34
subclass of: Resource
subclass of: Thing
type: Class
type: Restriction
on property: Zona horaria
max cardinality: 1

Latency
subclass of: Resource
subclass of: Thing
type: Class
subclass of: Measurement Property
comment: The time between a request for an observation and the sensor providing a result.
label: Latencia
subclass of: http://lodlaundromat.org/.well-known/genid/b376e9a0a07605e42f1b1bc7a2ca30eb#19
subclass of: Calidad
subclass of: Property

Anemómetro
type: Class
subclass of: Sensor
subclass of: Resource
subclass of: Thing
comment: Mide la intensidad [0º-360º] y la intensidad (m/s) del viento
label: Anemometer @en
subclass of: http://lodlaundromat.org/.well-known/genid/b376e9a0a07605e42f1b1bc7a2ca30eb#21
subclass of: http://lodlaundromat.org/.well-known/genid/b376e9a0a07605e42f1b1bc7a2ca30eb#23
subclass of: http://lodlaundromat.org/.well-known/genid/b376e9a0a07605e42f1b1bc7a2ca30eb#20
subclass of: http://lodlaundromat.org/.well-known/genid/b376e9a0a07605e42f1b1bc7a2ca30eb#22
subclass of: Objeto
subclass of: http://lodlaundromat.org/.well-known/genid/b376e9a0a07605e42f1b1bc7a2ca30eb#3
subclass of: Objeto físico

Survival Property
subclass of: Resource
subclass of: Thing
type: Class
subclass of: Property
comment: An identifiable characteristic that represents the extent of the sensors useful life. Might include for example total battery life or number of recharges, or, for sensors that are used only a fixed number of times, the number of observations that can be made before the sensing capability is depleted.
label: Propiedad de supervivencia
subclass of: http://lodlaundromat.org/.well-known/genid/b376e9a0a07605e42f1b1bc7a2ca30eb#19
subclass of: Calidad

Año
type: Class
subclass of: Thing
subclass of: Resource
subclass of: http://lodlaundromat.org/.well-known/genid/a796ef3c26d6f93ac9d393f7f3ff9a98#12
subclass of: http://lodlaundromat.org/.well-known/genid/a796ef3c26d6f93ac9d393f7f3ff9a98#13
subclass of: http://lodlaundromat.org/.well-known/genid/a796ef3c26d6f93ac9d393f7f3ff9a98#10
subclass of: http://lodlaundromat.org/.well-known/genid/a796ef3c26d6f93ac9d393f7f3ff9a98#11
label: Year @en
subclass of: http://lodlaundromat.org/.well-known/genid/a796ef3c26d6f93ac9d393f7f3ff9a98#16
subclass of: Descripción de la duración
subclass of: http://lodlaundromat.org/.well-known/genid/a796ef3c26d6f93ac9d393f7f3ff9a98#14
subclass of: http://lodlaundromat.org/.well-known/genid/a796ef3c26d6f93ac9d393f7f3ff9a98#15
subclass of: http://lodlaundromat.org/.well-known/genid/a796ef3c26d6f93ac9d393f7f3ff9a98#5
subclass of: http://lodlaundromat.org/.well-known/genid/a796ef3c26d6f93ac9d393f7f3ff9a98#3
subclass of: http://lodlaundromat.org/.well-known/genid/a796ef3c26d6f93ac9d393f7f3ff9a98#7
subclass of: http://lodlaundromat.org/.well-known/genid/a796ef3c26d6f93ac9d393f7f3ff9a98#8
subclass of: http://lodlaundromat.org/.well-known/genid/a796ef3c26d6f93ac9d393f7f3ff9a98#6
subclass of: http://lodlaundromat.org/.well-known/genid/a796ef3c26d6f93ac9d393f7f3ff9a98#9
subclass of: http://lodlaundromat.org/.well-known/genid/a796ef3c26d6f93ac9d393f7f3ff9a98#4

http://lodlaundromat.org/.well-known/genid/a796ef3c26d6f93ac9d393f7f3ff9a98#8
subclass of: Resource
subclass of: Thing
type: Class
type: Restriction
on property: Minutos
max cardinality: 1

Zona horaria
range: Thing
domain: Thing
domain: Descripción fecha hora
range: TimeZone
type: ObjectProperty
label: Time zone @en
type: Property
range: Resource
domain: Resource
domain: http://lodlaundromat.org/.well-known/genid/a796ef3c26d6f93ac9d393f7f3ff9a98#24
domain: http://lodlaundromat.org/.well-known/genid/a796ef3c26d6f93ac9d393f7f3ff9a98#30
domain: http://lodlaundromat.org/.well-known/genid/a796ef3c26d6f93ac9d393f7f3ff9a98#25
domain: http://lodlaundromat.org/.well-known/genid/a796ef3c26d6f93ac9d393f7f3ff9a98#33
domain: http://lodlaundromat.org/.well-known/genid/a796ef3c26d6f93ac9d393f7f3ff9a98#27
domain: http://lodlaundromat.org/.well-known/genid/a796ef3c26d6f93ac9d393f7f3ff9a98#28
domain: http://lodlaundromat.org/.well-known/genid/a796ef3c26d6f93ac9d393f7f3ff9a98#34
domain: http://lodlaundromat.org/.well-known/genid/a796ef3c26d6f93ac9d393f7f3ff9a98#32
domain: http://lodlaundromat.org/.well-known/genid/a796ef3c26d6f93ac9d393f7f3ff9a98#29
domain: http://lodlaundromat.org/.well-known/genid/a796ef3c26d6f93ac9d393f7f3ff9a98#31
domain: http://lodlaundromat.org/.well-known/genid/a796ef3c26d6f93ac9d393f7f3ff9a98#26

Designado por el límite administrativo directamente
range: Thing
domain: Thing
type: ObjectProperty
label: Designated directly by administrative limit @en
type: Property
range: Resource
domain: Resource

Intervalo después
range: Intervalo apropiado
domain: Intervalo apropiado
range: Thing
domain: Thing
inverse of: Intervalo antes
type: ObjectProperty
comment: Interval after @en
label: Interval after @en
sub property of: Después
type: Property
domain: Entidad temporal
domain: Resource
range: Entidad temporal
range: Resource
range: Intervalo
domain: Intervalo

Sensor
subclass of: Resource
subclass of: Sensor
subclass of: Thing
type: Class
comment: Posible punto de extensión para incluir la ontología del w3c Ssn
subclass of: Objeto
equivalent class: Sensor
subclass of: http://lodlaundromat.org/.well-known/genid/b376e9a0a07605e42f1b1bc7a2ca30eb#21
subclass of: http://lodlaundromat.org/.well-known/genid/b376e9a0a07605e42f1b1bc7a2ca30eb#3
subclass of: http://lodlaundromat.org/.well-known/genid/b376e9a0a07605e42f1b1bc7a2ca30eb#20
subclass of: http://lodlaundromat.org/.well-known/genid/b376e9a0a07605e42f1b1bc7a2ca30eb#22
subclass of: http://lodlaundromat.org/.well-known/genid/b376e9a0a07605e42f1b1bc7a2ca30eb#23
subclass of: Objeto físico

for property
range: Thing
domain: Thing
comment: A relation between some aspect of a sensing entity and a property. For example, from a sensor to the properties it can observe, or from a deployment to the properties it was installed to observe. Also from a measurement capability to the property the capability is described for. (Used in conjunction with ofFeature).
type: ObjectProperty
label: Para propiedad
type: Property
range: Resource
domain: Resource

http://lodlaundromat.org/.well-known/genid/a796ef3c26d6f93ac9d393f7f3ff9a98#16
subclass of: Resource
type: Class
subclass of: Thing
type: Restriction
on property: Segundos
cardinality: 0

in condition
range: Thing
domain: Thing
comment: Describes the prevailing environmental conditions for MeasurementCapabilites, OperatingConditions and SurvivalRanges. Used for example to say that a sensor has a particular accuracy in particular conditions. (see also MeasurementCapability)
type: ObjectProperty
label: En condición
type: Property
range: Resource
domain: Resource

Measurement Property
subclass of: Resource
subclass of: Thing
type: Class
subclass of: Property
comment: An identifiable and observable characteristic of a sensor's observations or ability to make observations.
label: Propiedad de medida
subclass of: http://lodlaundromat.org/.well-known/genid/b376e9a0a07605e42f1b1bc7a2ca30eb#19
subclass of: Calidad

Es localización de
range: Thing
domain: Thing
type: ObjectProperty
label: Is location of @en
type: Property
range: Resource
domain: Resource

Measurement Capability
subclass of: Resource
subclass of: Thing
type: Class
comment: Collects together measurement properties (accuracy, range, precision, etc) and the environmental conditions in which those properties hold, representing a specification of a sensor's capability in those conditions. The conditions specified here are those that affect the measurement properties, while those in OperatingRange represent the sensor's standard operating conditions, including conditions that don't affect the observations.
label: Capacidad de medida
subclass of: http://lodlaundromat.org/.well-known/genid/b376e9a0a07605e42f1b1bc7a2ca30eb#40
subclass of: http://lodlaundromat.org/.well-known/genid/b376e9a0a07605e42f1b1bc7a2ca30eb#42
subclass of: Property
subclass of: http://lodlaundromat.org/.well-known/genid/b376e9a0a07605e42f1b1bc7a2ca30eb#41
source: Similar idea to MeasurementCapability in MMI Device Ontology http://marinemetadata.org/community/teams/ontdevices But the the two express the relationship between constraints and multiple measurement properties differently. The conditions linked to a MeasurementCapability are skos:exactMatch to 'influence quantity' [VIM 2.52] http://www.bipm.org/utils/common/documents/jcgm/JCGM_200_2008.pdf
subclass of: http://lodlaundromat.org/.well-known/genid/b376e9a0a07605e42f1b1bc7a2ca30eb#51
subclass of: http://lodlaundromat.org/.well-known/genid/b376e9a0a07605e42f1b1bc7a2ca30eb#49
subclass of: http://lodlaundromat.org/.well-known/genid/b376e9a0a07605e42f1b1bc7a2ca30eb#19
subclass of: Calidad

quality of observation
sub property of: Tiene calidad
range: Thing
domain: Thing
source: skos:exactMatch 'resultQuality' [O&M - ISO/DIS 19156] http://portal.opengeospatial.org/files/?artifact_id=41579
comment: Relation linking an Observation to the adjudged quality of the result. This is of course complimentary to the MeasurementCapability information recorded for the Sensor that made the Observation.
sub property of: has property
type: ObjectProperty
label: Calidad de la observación
type: Property
domain: Resource
range: Resource

System Lifetime
subclass of: Resource
subclass of: Thing
type: Class
subclass of: Survival Property
comment: Total useful life of a sensor/system (expressed as total life since manufacture, time in use, number of operations, etc.).
label: Vida del sistema
subclass of: http://lodlaundromat.org/.well-known/genid/b376e9a0a07605e42f1b1bc7a2ca30eb#19
subclass of: Property
subclass of: Calidad

http://lodlaundromat.org/.well-known/genid/a796ef3c26d6f93ac9d393f7f3ff9a98#28
subclass of: Resource
subclass of: Thing
type: Class
type: Restriction
on property: Día
max cardinality: 1

Sensing Device
subclass of: Thing
subclass of: Resource
type: Class
subclass of: Device
subclass of: Sensor
source: http://www.w3.org/2005/Incubator/ssn/
comment: A sensing device is a device that implements sensing.
label: Dispositivo Sensor
subclass of: http://lodlaundromat.org/.well-known/genid/b376e9a0a07605e42f1b1bc7a2ca30eb#32
subclass of: Artefacto designado
subclass of: http://lodlaundromat.org/.well-known/genid/b376e9a0a07605e42f1b1bc7a2ca30eb#28
subclass of: System
subclass of: http://lodlaundromat.org/.well-known/genid/b376e9a0a07605e42f1b1bc7a2ca30eb#30
subclass of: http://lodlaundromat.org/.well-known/genid/b376e9a0a07605e42f1b1bc7a2ca30eb#29
subclass of: http://lodlaundromat.org/.well-known/genid/b376e9a0a07605e42f1b1bc7a2ca30eb#31
subclass of: http://lodlaundromat.org/.well-known/genid/b376e9a0a07605e42f1b1bc7a2ca30eb#27
subclass of: Objeto físico
subclass of: http://lodlaundromat.org/.well-known/genid/b376e9a0a07605e42f1b1bc7a2ca30eb#20
subclass of: http://lodlaundromat.org/.well-known/genid/b376e9a0a07605e42f1b1bc7a2ca30eb#23
subclass of: http://lodlaundromat.org/.well-known/genid/b376e9a0a07605e42f1b1bc7a2ca30eb#22
subclass of: http://lodlaundromat.org/.well-known/genid/b376e9a0a07605e42f1b1bc7a2ca30eb#21
subclass of: Objeto
subclass of: http://lodlaundromat.org/.well-known/genid/b376e9a0a07605e42f1b1bc7a2ca30eb#3

Precision
subclass of: Resource
subclass of: Thing
type: Class
subclass of: Measurement Property
comment: The closeness of agreement between replicate observations on an unchanged or similar quality value: i.e., a measure of a sensor's ability to consitently reproduce an observation.
source: skos:exactMatch 'measurement precision/precision' [VIM 2.15] http://www.bipm.org/utils/common/documents/jcgm/JCGM_200_2008.pdf
label: Precisión
subclass of: http://lodlaundromat.org/.well-known/genid/b376e9a0a07605e42f1b1bc7a2ca30eb#19
subclass of: Calidad
subclass of: Property

Incluye evento
range: Thing
domain: Thing
type: ObjectProperty
label: Includes event @en
type: Property
range: Resource
domain: Resource

has measurement capability
sub property of: Tiene calidad
range: Thing
domain: Thing
comment: Relation from a Sensor to a MeasurementCapability describing the measurement properties of the sensor.
sub property of: has property
type: ObjectProperty
label: Tiene capacidad de medición
type: Property
domain: Resource
range: Resource

Termometro seco
subclass of: Resource
subclass of: Thing
type: Class
comment: Mide la temperatura en grados Celsius. Mide la temperatura del aire.
label: Dry bulb thermometer @en
subclass of: Termómetro
subclass of: http://lodlaundromat.org/.well-known/genid/b376e9a0a07605e42f1b1bc7a2ca30eb#21
subclass of: http://lodlaundromat.org/.well-known/genid/b376e9a0a07605e42f1b1bc7a2ca30eb#23
subclass of: http://lodlaundromat.org/.well-known/genid/b376e9a0a07605e42f1b1bc7a2ca30eb#22
subclass of: http://lodlaundromat.org/.well-known/genid/b376e9a0a07605e42f1b1bc7a2ca30eb#20
subclass of: Sensor
subclass of: http://lodlaundromat.org/.well-known/genid/b376e9a0a07605e42f1b1bc7a2ca30eb#3
subclass of: Objeto
subclass of: Objeto físico

Sensor Output
subclass of: Resource
subclass of: Thing
type: Class
label: Salida del sensor
comment: A sensor outputs a piece of information (an observed value), the value itself being represented by an ObservationValue.
subclass of: Objeto de información
subclass of: http://lodlaundromat.org/.well-known/genid/b376e9a0a07605e42f1b1bc7a2ca30eb#25
source: http://www.w3.org/2005/Incubator/ssn/ skos:closeMatch 'observation result' [O&M] http://www.opengeospatial.org/standards/om See comments at ObservationValue.
subclass of: http://lodlaundromat.org/.well-known/genid/b376e9a0a07605e42f1b1bc7a2ca30eb#26

http://lodlaundromat.org/.well-known/genid/a796ef3c26d6f93ac9d393f7f3ff9a98#11
subclass of: Resource
type: Class
subclass of: Thing
type: Restriction
on property: Meses
cardinality: 0

http://lodlaundromat.org/.well-known/genid/a796ef3c26d6f93ac9d393f7f3ff9a98#3
subclass of: Resource
subclass of: Thing
type: Class
type: Restriction
on property: Años
max cardinality: 1

Deployment
subclass of: Resource
subclass of: Thing
type: Class
subclass of: http://lodlaundromat.org/.well-known/genid/b376e9a0a07605e42f1b1bc7a2ca30eb#44
comment: The ongoing Process of Entities (for the purposes of this ontology, mainly sensors) deployed for a particular purpose. For example, a particular Sensor deployed on a Platform, or a whole network of Sensors deployed for an observation campaign. The deployment may have sub processes, such as installation, maintenance, addition, and decomissioning and removal.
label: Despliegue
source: skos:closeMatch 'Deployment' [MMI Dev] http://marinemetadata.org/community/teams/ontdevices
subclass of: http://lodlaundromat.org/.well-known/genid/b376e9a0a07605e42f1b1bc7a2ca30eb#43
subclass of: Deployment-related Process
subclass of: http://lodlaundromat.org/.well-known/genid/b376e9a0a07605e42f1b1bc7a2ca30eb#45
subclass of: Proceso

deployed on platform
range: Thing
domain: Thing
comment: Relation between a deployment and the platform on which the system was deployed.
inverse of: in deployment
sub property of: Tiene participante
type: ObjectProperty
label: Desplegado en plataforma
type: Property
domain: Resource
range: Resource

nombre estación
comment: Indica el nombre de la estación meteorológica.
type: DatatypeProperty
domain: Estación meteorológica
label: Station name @en
range: string
type: Property
range: Resource
domain: http://lodlaundromat.org/.well-known/genid/b376e9a0a07605e42f1b1bc7a2ca30eb#47
domain: Thing
domain: http://lodlaundromat.org/.well-known/genid/b376e9a0a07605e42f1b1bc7a2ca30eb#46
domain: Objeto físico
domain: Resource
domain: Platform
domain: http://lodlaundromat.org/.well-known/genid/b376e9a0a07605e42f1b1bc7a2ca30eb#3
domain: Objeto

Día del año
domain: Descripción fecha hora
range: nonNegativeInteger
type: DatatypeProperty
label: Day of year @en
type: Property
range: decimal
range: Resource
range: integer
domain: Resource
domain: Thing
domain: http://lodlaundromat.org/.well-known/genid/a796ef3c26d6f93ac9d393f7f3ff9a98#24
domain: http://lodlaundromat.org/.well-known/genid/a796ef3c26d6f93ac9d393f7f3ff9a98#30
domain: http://lodlaundromat.org/.well-known/genid/a796ef3c26d6f93ac9d393f7f3ff9a98#25
domain: http://lodlaundromat.org/.well-known/genid/a796ef3c26d6f93ac9d393f7f3ff9a98#33
domain: http://lodlaundromat.org/.well-known/genid/a796ef3c26d6f93ac9d393f7f3ff9a98#27
domain: http://lodlaundromat.org/.well-known/genid/a796ef3c26d6f93ac9d393f7f3ff9a98#28
domain: http://lodlaundromat.org/.well-known/genid/a796ef3c26d6f93ac9d393f7f3ff9a98#34
domain: http://lodlaundromat.org/.well-known/genid/a796ef3c26d6f93ac9d393f7f3ff9a98#32
domain: http://lodlaundromat.org/.well-known/genid/a796ef3c26d6f93ac9d393f7f3ff9a98#29
domain: http://lodlaundromat.org/.well-known/genid/a796ef3c26d6f93ac9d393f7f3ff9a98#31
domain: http://lodlaundromat.org/.well-known/genid/a796ef3c26d6f93ac9d393f7f3ff9a98#26

Años
domain: Descripción de la duración
range: decimal
type: DatatypeProperty
label: Years @en
type: Property
range: Resource
domain: Thing
domain: Resource
domain: http://lodlaundromat.org/.well-known/genid/a796ef3c26d6f93ac9d393f7f3ff9a98#8
domain: http://lodlaundromat.org/.well-known/genid/a796ef3c26d6f93ac9d393f7f3ff9a98#5
domain: http://lodlaundromat.org/.well-known/genid/a796ef3c26d6f93ac9d393f7f3ff9a98#7
domain: http://lodlaundromat.org/.well-known/genid/a796ef3c26d6f93ac9d393f7f3ff9a98#3
domain: http://lodlaundromat.org/.well-known/genid/a796ef3c26d6f93ac9d393f7f3ff9a98#9
domain: http://lodlaundromat.org/.well-known/genid/a796ef3c26d6f93ac9d393f7f3ff9a98#4
domain: http://lodlaundromat.org/.well-known/genid/a796ef3c26d6f93ac9d393f7f3ff9a98#6

time
type: Ontology
comment: An OWL Ontology of Time (OWL-Time).

condicion meteorologica
type: NamedIndividual
type: Feature of Interest
type: Thing
type: http://lodlaundromat.org/.well-known/genid/b376e9a0a07605e42f1b1bc7a2ca30eb#1
type: http://lodlaundromat.org/.well-known/genid/b376e9a0a07605e42f1b1bc7a2ca30eb#3
type: http://lodlaundromat.org/.well-known/genid/b376e9a0a07605e42f1b1bc7a2ca30eb#2

Minuto
domain: Descripción fecha hora
range: nonNegativeInteger
type: DatatypeProperty
label: Minute @en
type: Property
range: decimal
range: Resource
range: integer
domain: Resource
domain: Thing
domain: http://lodlaundromat.org/.well-known/genid/a796ef3c26d6f93ac9d393f7f3ff9a98#24
domain: http://lodlaundromat.org/.well-known/genid/a796ef3c26d6f93ac9d393f7f3ff9a98#30
domain: http://lodlaundromat.org/.well-known/genid/a796ef3c26d6f93ac9d393f7f3ff9a98#25
domain: http://lodlaundromat.org/.well-known/genid/a796ef3c26d6f93ac9d393f7f3ff9a98#33
domain: http://lodlaundromat.org/.well-known/genid/a796ef3c26d6f93ac9d393f7f3ff9a98#27
domain: http://lodlaundromat.org/.well-known/genid/a796ef3c26d6f93ac9d393f7f3ff9a98#28
domain: http://lodlaundromat.org/.well-known/genid/a796ef3c26d6f93ac9d393f7f3ff9a98#34
domain: http://lodlaundromat.org/.well-known/genid/a796ef3c26d6f93ac9d393f7f3ff9a98#32
domain: http://lodlaundromat.org/.well-known/genid/a796ef3c26d6f93ac9d393f7f3ff9a98#29
domain: http://lodlaundromat.org/.well-known/genid/a796ef3c26d6f93ac9d393f7f3ff9a98#31
domain: http://lodlaundromat.org/.well-known/genid/a796ef3c26d6f93ac9d393f7f3ff9a98#26

Semanas
domain: Descripción de la duración
range: decimal
type: DatatypeProperty
label: Weeks @en
type: Property
range: Resource
domain: Thing
domain: Resource
domain: http://lodlaundromat.org/.well-known/genid/a796ef3c26d6f93ac9d393f7f3ff9a98#8
domain: http://lodlaundromat.org/.well-known/genid/a796ef3c26d6f93ac9d393f7f3ff9a98#5
domain: http://lodlaundromat.org/.well-known/genid/a796ef3c26d6f93ac9d393f7f3ff9a98#7
domain: http://lodlaundromat.org/.well-known/genid/a796ef3c26d6f93ac9d393f7f3ff9a98#3
domain: http://lodlaundromat.org/.well-known/genid/a796ef3c26d6f93ac9d393f7f3ff9a98#9
domain: http://lodlaundromat.org/.well-known/genid/a796ef3c26d6f93ac9d393f7f3ff9a98#4
domain: http://lodlaundromat.org/.well-known/genid/a796ef3c26d6f93ac9d393f7f3ff9a98#6

Semantic Sensor Network Ontology
modified: 2011-06-20
created: 2009-12-02
type: Ontology
rights: Copyright 2009 - 2011 W3C.
creator: W3C Semantic Sensor Network Incubator Group
imports: DUL.owl
type: NamedIndividual
comment: This ontology is developed by the W3C Semantic Sensor Networks Incubator Group (SSN-XG). The concepts and structure of the ontology were discussed in the group's meetings and on the mailing list. For more information on the group's activities see: http://www.w3.org/2005/Incubator/ssn/
license: copyright-software-20021231.html
type: Thing
comment: This ontology describes sensors and observations, and related concepts. It does not describe domain concepts, time, locations, etc. these are intended to be included from other ontologies via OWL imports.
comment: Please report any errors to the Semantic Sensor Network Incubator Activity via the public W3C list public-xg-ssn@w3.org

Indicativo climático
comment: Indicativo climatológico de la estación meteorológica.
source: maestro.csv
type: DatatypeProperty
domain: Estación meteorológica
label: Climatic Indicator @en
range: Literal
type: Property
range: Resource
domain: http://lodlaundromat.org/.well-known/genid/b376e9a0a07605e42f1b1bc7a2ca30eb#47
domain: Thing
domain: http://lodlaundromat.org/.well-known/genid/b376e9a0a07605e42f1b1bc7a2ca30eb#46
domain: Objeto físico
domain: Resource
domain: Platform
domain: http://lodlaundromat.org/.well-known/genid/b376e9a0a07605e42f1b1bc7a2ca30eb#3
domain: Objeto

Calidad del dato observado
type: DatatypeProperty
comment: Se utilizan los siguiente valores para la calidad: 0: Pasa todos los filtros. 2: El dato se considera sospechoso. 3: El dato podría ser erróneo.
domain: Sensor Output
label: Observed data quality @en
range: integer
type: Property
range: decimal
range: Resource
domain: Thing
domain: Resource
domain: http://lodlaundromat.org/.well-known/genid/b376e9a0a07605e42f1b1bc7a2ca30eb#25
domain: http://lodlaundromat.org/.well-known/genid/b376e9a0a07605e42f1b1bc7a2ca30eb#26
domain: Objeto de información

Semana
domain: Descripción fecha hora
range: nonNegativeInteger
type: DatatypeProperty
label: Week @en
type: Property
range: decimal
range: Resource
range: integer
domain: Resource
domain: Thing
domain: http://lodlaundromat.org/.well-known/genid/a796ef3c26d6f93ac9d393f7f3ff9a98#24
domain: http://lodlaundromat.org/.well-known/genid/a796ef3c26d6f93ac9d393f7f3ff9a98#30
domain: http://lodlaundromat.org/.well-known/genid/a796ef3c26d6f93ac9d393f7f3ff9a98#25
domain: http://lodlaundromat.org/.well-known/genid/a796ef3c26d6f93ac9d393f7f3ff9a98#33
domain: http://lodlaundromat.org/.well-known/genid/a796ef3c26d6f93ac9d393f7f3ff9a98#27
domain: http://lodlaundromat.org/.well-known/genid/a796ef3c26d6f93ac9d393f7f3ff9a98#28
domain: http://lodlaundromat.org/.well-known/genid/a796ef3c26d6f93ac9d393f7f3ff9a98#34
domain: http://lodlaundromat.org/.well-known/genid/a796ef3c26d6f93ac9d393f7f3ff9a98#32
domain: http://lodlaundromat.org/.well-known/genid/a796ef3c26d6f93ac9d393f7f3ff9a98#29
domain: http://lodlaundromat.org/.well-known/genid/a796ef3c26d6f93ac9d393f7f3ff9a98#31
domain: http://lodlaundromat.org/.well-known/genid/a796ef3c26d6f93ac9d393f7f3ff9a98#26

Segundo
domain: Descripción fecha hora
range: decimal
type: DatatypeProperty
label: Second @en
type: Property
range: Resource
domain: Resource
domain: Thing
domain: http://lodlaundromat.org/.well-known/genid/a796ef3c26d6f93ac9d393f7f3ff9a98#24
domain: http://lodlaundromat.org/.well-known/genid/a796ef3c26d6f93ac9d393f7f3ff9a98#30
domain: http://lodlaundromat.org/.well-known/genid/a796ef3c26d6f93ac9d393f7f3ff9a98#25
domain: http://lodlaundromat.org/.well-known/genid/a796ef3c26d6f93ac9d393f7f3ff9a98#33
domain: http://lodlaundromat.org/.well-known/genid/a796ef3c26d6f93ac9d393f7f3ff9a98#27
domain: http://lodlaundromat.org/.well-known/genid/a796ef3c26d6f93ac9d393f7f3ff9a98#28
domain: http://lodlaundromat.org/.well-known/genid/a796ef3c26d6f93ac9d393f7f3ff9a98#34
domain: http://lodlaundromat.org/.well-known/genid/a796ef3c26d6f93ac9d393f7f3ff9a98#32
domain: http://lodlaundromat.org/.well-known/genid/a796ef3c26d6f93ac9d393f7f3ff9a98#29
domain: http://lodlaundromat.org/.well-known/genid/a796ef3c26d6f93ac9d393f7f3ff9a98#31
domain: http://lodlaundromat.org/.well-known/genid/a796ef3c26d6f93ac9d393f7f3ff9a98#26

Fecha hora en formato XSD
domain: Instante
range: dateTime
type: DatatypeProperty
label: In XSD date time @en
type: Property
range: Resource
domain: Thing
domain: Entidad temporal
domain: Resource

lat/long
type: Thing
type: NamedIndividual
comment: A comma-separated representation of a latitude, longitude coordinate.

Hora
domain: Descripción fecha hora
range: nonNegativeInteger
type: DatatypeProperty
label: Hour @en
type: Property
range: decimal
range: Resource
range: integer
domain: Resource
domain: Thing
domain: http://lodlaundromat.org/.well-known/genid/a796ef3c26d6f93ac9d393f7f3ff9a98#24
domain: http://lodlaundromat.org/.well-known/genid/a796ef3c26d6f93ac9d393f7f3ff9a98#30
domain: http://lodlaundromat.org/.well-known/genid/a796ef3c26d6f93ac9d393f7f3ff9a98#25
domain: http://lodlaundromat.org/.well-known/genid/a796ef3c26d6f93ac9d393f7f3ff9a98#33
domain: http://lodlaundromat.org/.well-known/genid/a796ef3c26d6f93ac9d393f7f3ff9a98#27
domain: http://lodlaundromat.org/.well-known/genid/a796ef3c26d6f93ac9d393f7f3ff9a98#28
domain: http://lodlaundromat.org/.well-known/genid/a796ef3c26d6f93ac9d393f7f3ff9a98#34
domain: http://lodlaundromat.org/.well-known/genid/a796ef3c26d6f93ac9d393f7f3ff9a98#32
domain: http://lodlaundromat.org/.well-known/genid/a796ef3c26d6f93ac9d393f7f3ff9a98#29
domain: http://lodlaundromat.org/.well-known/genid/a796ef3c26d6f93ac9d393f7f3ff9a98#31
domain: http://lodlaundromat.org/.well-known/genid/a796ef3c26d6f93ac9d393f7f3ff9a98#26

Fecha hora XSD
domain: Intervalo de fecha hora
range: dateTime
type: DatatypeProperty
label: XSD Date Time @en
type: Property
range: Resource
domain: Thing
domain: Entidad temporal
domain: Resource
domain: Intervalo
domain: Intervalo apropiado

geo
type: Thing
type: NamedIndividual
description: A vocabulary for representing latitude, longitude and altitude information in the WGS84 geodetic reference datum. Version $Id: wgs84_pos.rdf,v 1.22 2009/04/20 15:00:30 timbl Exp $. See http://www.w3.org/2003/01/geo/ for more details.
comment: Recent changes to this namespace: $Log: wgs84_pos.rdf,v $ Revision 1.22 2009/04/20 15:00:30 timbl Remove the time bits which have been deal with elsewhere eg in iCal. Revision 1.21 2009/04/20 12:52:47 timbl try again Revision 1.20 2009/04/20 12:42:11 timbl Add Event (edited ages ago and never checked in), and location (following discussion http://chatlogs.planetrdf.com/swig/2009-04-20#T12-36-09) Revision 1.19 2009/04/20 12:36:31 timbl Add Event (edited ages ago and never checked in), and location (following discussion http://chatlogs.planetrdf.com/swig/2009-04-20#T12-36-09) Revision 1.18 2006/02/01 22:01:04 danbri Clarified that lat and long are decimal degrees, and that alt is decimal metres about local reference ellipsoid Revision 1.17 2004/02/06 17:38:12 danbri Fixed a bad commit screwup Revision 1.15 2003/04/19 11:24:08 danbri Fixed the typo even more. Revision 1.14 2003/04/19 11:16:56 danbri fixed a typo Revision 1.13 2003/02/19 22:27:27 connolly relaxed domain constraints on lat/long/alt from Point to SpatialThing Revision 1.12 2003/01/12 01:41:41 danbri Trying local copy of XSLT doc. Revision 1.11 2003/01/12 01:20:18 danbri added a link to morten's xslt rdfs viewer. Revision 1.10 2003/01/11 18:56:49 danbri Removed datatype range from lat and long properties, since they would have required each occurance of the property to mention the datatype. Revision 1.9 2003/01/11 11:41:31 danbri Another typo; repaired rdfs:Property to rdf:Property x4 Revision 1.8 2003/01/11 11:05:02 danbri Added an rdfs:range for each lat/long/alt property, http://www.w3.org/2001/XMLSchema#float Revision 1.7 2003/01/10 20:25:16 danbri Longer rdfs:comment for Point, trying to be Earth-centric and neutral about coordinate system(s) at the same time. Feedback welcomed. Revision 1.6 2003/01/10 20:18:30 danbri Added CVS log comments into the RDF/XML as an rdfs:comment property of the vocabulary. Note that this is not common practice (but seems both harmless and potentially useful). revision 1.…
date: $Date: 2009/04/20 15:00:30 $
title: WGS84 Geo Positioning: an RDF vocabulary

Año
domain: Descripción fecha hora
range: gYear
type: DatatypeProperty
label: Year @en
type: Property
range: Resource
domain: Resource
domain: Thing
domain: http://lodlaundromat.org/.well-known/genid/a796ef3c26d6f93ac9d393f7f3ff9a98#24
domain: http://lodlaundromat.org/.well-known/genid/a796ef3c26d6f93ac9d393f7f3ff9a98#30
domain: http://lodlaundromat.org/.well-known/genid/a796ef3c26d6f93ac9d393f7f3ff9a98#25
domain: http://lodlaundromat.org/.well-known/genid/a796ef3c26d6f93ac9d393f7f3ff9a98#33
domain: http://lodlaundromat.org/.well-known/genid/a796ef3c26d6f93ac9d393f7f3ff9a98#27
domain: http://lodlaundromat.org/.well-known/genid/a796ef3c26d6f93ac9d393f7f3ff9a98#28
domain: http://lodlaundromat.org/.well-known/genid/a796ef3c26d6f93ac9d393f7f3ff9a98#34
domain: http://lodlaundromat.org/.well-known/genid/a796ef3c26d6f93ac9d393f7f3ff9a98#32
domain: http://lodlaundromat.org/.well-known/genid/a796ef3c26d6f93ac9d393f7f3ff9a98#29
domain: http://lodlaundromat.org/.well-known/genid/a796ef3c26d6f93ac9d393f7f3ff9a98#31
domain: http://lodlaundromat.org/.well-known/genid/a796ef3c26d6f93ac9d393f7f3ff9a98#26

Segundos
domain: Descripción de la duración
range: decimal
type: DatatypeProperty
label: Seconds @en
type: Property
range: Resource
domain: Thing
domain: Resource
domain: http://lodlaundromat.org/.well-known/genid/a796ef3c26d6f93ac9d393f7f3ff9a98#8
domain: http://lodlaundromat.org/.well-known/genid/a796ef3c26d6f93ac9d393f7f3ff9a98#5
domain: http://lodlaundromat.org/.well-known/genid/a796ef3c26d6f93ac9d393f7f3ff9a98#7
domain: http://lodlaundromat.org/.well-known/genid/a796ef3c26d6f93ac9d393f7f3ff9a98#3
domain: http://lodlaundromat.org/.well-known/genid/a796ef3c26d6f93ac9d393f7f3ff9a98#9
domain: http://lodlaundromat.org/.well-known/genid/a796ef3c26d6f93ac9d393f7f3ff9a98#4
domain: http://lodlaundromat.org/.well-known/genid/a796ef3c26d6f93ac9d393f7f3ff9a98#6

Minutos
domain: Descripción de la duración
range: decimal
type: DatatypeProperty
label: Minutes @en
type: Property
range: Resource
domain: Thing
domain: Resource
domain: http://lodlaundromat.org/.well-known/genid/a796ef3c26d6f93ac9d393f7f3ff9a98#8
domain: http://lodlaundromat.org/.well-known/genid/a796ef3c26d6f93ac9d393f7f3ff9a98#5
domain: http://lodlaundromat.org/.well-known/genid/a796ef3c26d6f93ac9d393f7f3ff9a98#7
domain: http://lodlaundromat.org/.well-known/genid/a796ef3c26d6f93ac9d393f7f3ff9a98#3
domain: http://lodlaundromat.org/.well-known/genid/a796ef3c26d6f93ac9d393f7f3ff9a98#9
domain: http://lodlaundromat.org/.well-known/genid/a796ef3c26d6f93ac9d393f7f3ff9a98#4
domain: http://lodlaundromat.org/.well-known/genid/a796ef3c26d6f93ac9d393f7f3ff9a98#6

The Aemet Ontology Network
description: Ontology network for the AEMET project. This model describes meteorological information. @en
creator: María Poveda Villalón
type: Ontology
imports: describevar.owl
comment: Red de ontologías para el proyecto AEMET
imports: Semantic Sensor Network Ontology
imports: time
imports: localizacion.owl

Horas
domain: Descripción de la duración
range: decimal
type: DatatypeProperty
label: Hours @en
type: Property
range: Resource
domain: Thing
domain: Resource
domain: http://lodlaundromat.org/.well-known/genid/a796ef3c26d6f93ac9d393f7f3ff9a98#8
domain: http://lodlaundromat.org/.well-known/genid/a796ef3c26d6f93ac9d393f7f3ff9a98#5
domain: http://lodlaundromat.org/.well-known/genid/a796ef3c26d6f93ac9d393f7f3ff9a98#7
domain: http://lodlaundromat.org/.well-known/genid/a796ef3c26d6f93ac9d393f7f3ff9a98#3
domain: http://lodlaundromat.org/.well-known/genid/a796ef3c26d6f93ac9d393f7f3ff9a98#9
domain: http://lodlaundromat.org/.well-known/genid/a796ef3c26d6f93ac9d393f7f3ff9a98#4
domain: http://lodlaundromat.org/.well-known/genid/a796ef3c26d6f93ac9d393f7f3ff9a98#6

Valor del dato observado
type: DatatypeProperty
comment: En esta versión el tiempo presente (tabla 4680) se representa con literales. En la siguiente versión se refinará el modelado de esta parte.
domain: Sensor Output
label: Value of observed data @en
range: Literal
type: Property
range: Resource
domain: Thing
domain: Resource
domain: http://lodlaundromat.org/.well-known/genid/b376e9a0a07605e42f1b1bc7a2ca30eb#25
domain: http://lodlaundromat.org/.well-known/genid/b376e9a0a07605e42f1b1bc7a2ca30eb#26
domain: Objeto de información

Mes
domain: Descripción fecha hora
range: gMonth
type: DatatypeProperty
label: Month @en
type: Property
range: Resource
domain: Resource
domain: Thing
domain: http://lodlaundromat.org/.well-known/genid/a796ef3c26d6f93ac9d393f7f3ff9a98#24
domain: http://lodlaundromat.org/.well-known/genid/a796ef3c26d6f93ac9d393f7f3ff9a98#30
domain: http://lodlaundromat.org/.well-known/genid/a796ef3c26d6f93ac9d393f7f3ff9a98#25
domain: http://lodlaundromat.org/.well-known/genid/a796ef3c26d6f93ac9d393f7f3ff9a98#33
domain: http://lodlaundromat.org/.well-known/genid/a796ef3c26d6f93ac9d393f7f3ff9a98#27
domain: http://lodlaundromat.org/.well-known/genid/a796ef3c26d6f93ac9d393f7f3ff9a98#28
domain: http://lodlaundromat.org/.well-known/genid/a796ef3c26d6f93ac9d393f7f3ff9a98#34
domain: http://lodlaundromat.org/.well-known/genid/a796ef3c26d6f93ac9d393f7f3ff9a98#32
domain: http://lodlaundromat.org/.well-known/genid/a796ef3c26d6f93ac9d393f7f3ff9a98#29
domain: http://lodlaundromat.org/.well-known/genid/a796ef3c26d6f93ac9d393f7f3ff9a98#31
domain: http://lodlaundromat.org/.well-known/genid/a796ef3c26d6f93ac9d393f7f3ff9a98#26

Día
domain: Descripción fecha hora
range: gDay
type: DatatypeProperty
label: Day @en
type: Property
range: Resource
domain: Resource
domain: Thing
domain: http://lodlaundromat.org/.well-known/genid/a796ef3c26d6f93ac9d393f7f3ff9a98#24
domain: http://lodlaundromat.org/.well-known/genid/a796ef3c26d6f93ac9d393f7f3ff9a98#30
domain: http://lodlaundromat.org/.well-known/genid/a796ef3c26d6f93ac9d393f7f3ff9a98#25
domain: http://lodlaundromat.org/.well-known/genid/a796ef3c26d6f93ac9d393f7f3ff9a98#33
domain: http://lodlaundromat.org/.well-known/genid/a796ef3c26d6f93ac9d393f7f3ff9a98#27
domain: http://lodlaundromat.org/.well-known/genid/a796ef3c26d6f93ac9d393f7f3ff9a98#28
domain: http://lodlaundromat.org/.well-known/genid/a796ef3c26d6f93ac9d393f7f3ff9a98#34
domain: http://lodlaundromat.org/.well-known/genid/a796ef3c26d6f93ac9d393f7f3ff9a98#32
domain: http://lodlaundromat.org/.well-known/genid/a796ef3c26d6f93ac9d393f7f3ff9a98#29
domain: http://lodlaundromat.org/.well-known/genid/a796ef3c26d6f93ac9d393f7f3ff9a98#31
domain: http://lodlaundromat.org/.well-known/genid/a796ef3c26d6f93ac9d393f7f3ff9a98#26

Meses
domain: Descripción de la duración
range: decimal
type: DatatypeProperty
label: Months @en
type: Property
range: Resource
domain: Thing
domain: Resource
domain: http://lodlaundromat.org/.well-known/genid/a796ef3c26d6f93ac9d393f7f3ff9a98#8
domain: http://lodlaundromat.org/.well-known/genid/a796ef3c26d6f93ac9d393f7f3ff9a98#5
domain: http://lodlaundromat.org/.well-known/genid/a796ef3c26d6f93ac9d393f7f3ff9a98#7
domain: http://lodlaundromat.org/.well-known/genid/a796ef3c26d6f93ac9d393f7f3ff9a98#3
domain: http://lodlaundromat.org/.well-known/genid/a796ef3c26d6f93ac9d393f7f3ff9a98#9
domain: http://lodlaundromat.org/.well-known/genid/a796ef3c26d6f93ac9d393f7f3ff9a98#4
domain: http://lodlaundromat.org/.well-known/genid/a796ef3c26d6f93ac9d393f7f3ff9a98#6

Indicativo sinóptico
comment: Indicativo sinóptico de la estación meteorológica.
source: maestro.csv
type: DatatypeProperty
domain: Estación meteorológica
label: Synoptic Indicator @en
range: Literal
type: Property
range: Resource
domain: http://lodlaundromat.org/.well-known/genid/b376e9a0a07605e42f1b1bc7a2ca30eb#47
domain: Thing
domain: http://lodlaundromat.org/.well-known/genid/b376e9a0a07605e42f1b1bc7a2ca30eb#46
domain: Objeto físico
domain: Resource
domain: Platform
domain: http://lodlaundromat.org/.well-known/genid/b376e9a0a07605e42f1b1bc7a2ca30eb#3
domain: Objeto

Días
domain: Descripción de la duración
range: decimal
type: DatatypeProperty
label: Days @en
type: Property
range: Resource
domain: Thing
domain: Resource
domain: http://lodlaundromat.org/.well-known/genid/a796ef3c26d6f93ac9d393f7f3ff9a98#8
domain: http://lodlaundromat.org/.well-known/genid/a796ef3c26d6f93ac9d393f7f3ff9a98#5
domain: http://lodlaundromat.org/.well-known/genid/a796ef3c26d6f93ac9d393f7f3ff9a98#7
domain: http://lodlaundromat.org/.well-known/genid/a796ef3c26d6f93ac9d393f7f3ff9a98#3
domain: http://lodlaundromat.org/.well-known/genid/a796ef3c26d6f93ac9d393f7f3ff9a98#9
domain: http://lodlaundromat.org/.well-known/genid/a796ef3c26d6f93ac9d393f7f3ff9a98#4
domain: http://lodlaundromat.org/.well-known/genid/a796ef3c26d6f93ac9d393f7f3ff9a98#6