numbers
subclass of: http://lodlaundromat.org/.well-known/genid/2dd581c251e9628cd06f7f0e006f321f#240
subclass of: http://lodlaundromat.org/.well-known/genid/2dd581c251e9628cd06f7f0e006f321f#93
subclass of: http://lodlaundromat.org/.well-known/genid/2dd581c251e9628cd06f7f0e006f321f#511
disjoint with: diseases
disjoint with: Concept Scheme
subclass of: http://lodlaundromat.org/.well-known/genid/2dd581c251e9628cd06f7f0e006f321f#457
subclass of: http://lodlaundromat.org/.well-known/genid/2dd581c251e9628cd06f7f0e006f321f#45
disjoint with: food or drink
subclass of: http://lodlaundromat.org/.well-known/genid/2dd581c251e9628cd06f7f0e006f321f#556
disjoint with: earthscape
disjoint with: plants
disjoint with: natural phenomena
disjoint with: facilities
subclass of: http://lodlaundromat.org/.well-known/genid/2dd581c251e9628cd06f7f0e006f321f#162
disjoint with: natural substance
disjoint with: audio information
disjoint with: Collection
subclass of: http://lodlaundromat.org/.well-known/genid/2dd581c251e9628cd06f7f0e006f321f#141
subclass of: http://lodlaundromat.org/.well-known/genid/2dd581c251e9628cd06f7f0e006f321f#223
disjoint with: drugs
disjoint with: animals
subclass of: http://lodlaundromat.org/.well-known/genid/2dd581c251e9628cd06f7f0e006f321f#70
subclass of: http://lodlaundromat.org/.well-known/genid/2dd581c251e9628cd06f7f0e006f321f#393
subclass of: http://lodlaundromat.org/.well-known/genid/1c057c878c7c3a3a1a60afec0f9c51a2#1
subclass of: http://lodlaundromat.org/.well-known/genid/2dd581c251e9628cd06f7f0e006f321f#419
disjoint with: http://lodlaundromat.org/.well-known/genid/2dd581c251e9628cd06f7f0e006f321f#344
subclass of: http://lodlaundromat.org/.well-known/genid/2dd581c251e9628cd06f7f0e006f321f#584
subclass of: Thing
disjoint with: protists fungus
disjoint with: Ordered Collection
disjoint with: written information
disjoint with: fnance and economy
subclass of: http://lodlaundromat.org/.well-known/genid/2dd581c251e9628cd06f7f0e006f321f#23
disjoint with: http://lodlaundromat.org/.well-known/genid/2dd581c251e9628cd06f7f0e006f321f#1
disjoint with: Nothing
subclass of: http://lodlaundromat.org/.well-known/genid/2dd581c251e9628cd06f7f0e006f321f#445
subclass of: http://lodlaundromat.org/.well-known/genid/2dd581c251e9628cd06f7f0e006f321f#4
disjoint with: activities
disjoint with: organizations
subclass of: http://lodlaundromat.org/.well-known/genid/2dd581c251e9628cd06f7f0e006f321f#484
disjoint with: products
disjoint with: geopolitical
disjoint with: http://lodlaundromat.org/.well-known/genid/2dd581c251e9628cd06f7f0e006f321f#325
subclass of: http://lodlaundromat.org/.well-known/genid/2dd581c251e9628cd06f7f0e006f321f#118
disjoint with: chemistry
subclass of: http://lodlaundromat.org/.well-known/genid/2dd581c251e9628cd06f7f0e006f321f#260
disjoint with: person types
subclass of: http://lodlaundromat.org/.well-known/genid/2dd581c251e9628cd06f7f0e006f321f#602
disjoint with: events
disjoint with: time
subclass of: http://lodlaundromat.org/.well-known/genid/2dd581c251e9628cd06f7f0e006f321f#201
subclass of: http://lodlaundromat.org/.well-known/genid/2dd581c251e9628cd06f7f0e006f321f#371
type: Class
subclass of: reference concept
subclass of: Concept
disjoint with: society
disjoint with: visual information
subclass of: http://lodlaundromat.org/.well-known/genid/2dd581c251e9628cd06f7f0e006f321f#306
subclass of: SuperType
subclass of: http://lodlaundromat.org/.well-known/genid/2dd581c251e9628cd06f7f0e006f321f#283
subclass of: http://lodlaundromat.org/.well-known/genid/2dd581c251e9628cd06f7f0e006f321f#625
disjoint with: Extraterrestrial
disjoint with: prokaryotes
disjoint with: http://lodlaundromat.org/.well-known/genid/2dd581c251e9628cd06f7f0e006f321f#536
disjoint with: workplaces
subclass of: http://lodlaundromat.org/.well-known/genid/2dd581c251e9628cd06f7f0e006f321f#177
definition: This unique SuperType is for any abstract representation of numbers and numerics

workplaces
disjoint with: society
subclass of: Thing
disjoint with: animals
subclass of: http://lodlaundromat.org/.well-known/genid/2dd581c251e9628cd06f7f0e006f321f#93
type: Class
disjoint with: http://lodlaundromat.org/.well-known/genid/2dd581c251e9628cd06f7f0e006f321f#223
subclass of: http://lodlaundromat.org/.well-known/genid/2dd581c251e9628cd06f7f0e006f321f#23
subclass of: http://lodlaundromat.org/.well-known/genid/2dd581c251e9628cd06f7f0e006f321f#306
disjoint with: diseases
disjoint with: Concept Scheme
subclass of: http://lodlaundromat.org/.well-known/genid/2dd581c251e9628cd06f7f0e006f321f#177
disjoint with: natural phenomena
subclass of: http://lodlaundromat.org/.well-known/genid/2dd581c251e9628cd06f7f0e006f321f#118
disjoint with: chemistry
subclass of: http://lodlaundromat.org/.well-known/genid/2dd581c251e9628cd06f7f0e006f321f#344
disjoint with: http://lodlaundromat.org/.well-known/genid/2dd581c251e9628cd06f7f0e006f321f#602
subclass of: http://lodlaundromat.org/.well-known/genid/2dd581c251e9628cd06f7f0e006f321f#393
disjoint with: audio information
disjoint with: food or drink
disjoint with: events
subclass of: http://lodlaundromat.org/.well-known/genid/2dd581c251e9628cd06f7f0e006f321f#4
disjoint with: written information
subclass of: http://lodlaundromat.org/.well-known/genid/2dd581c251e9628cd06f7f0e006f321f#625
subclass of: http://lodlaundromat.org/.well-known/genid/2dd581c251e9628cd06f7f0e006f321f#584
disjoint with: Nothing
disjoint with: protists fungus
subclass of: http://lodlaundromat.org/.well-known/genid/2dd581c251e9628cd06f7f0e006f321f#457
disjoint with: numbers
disjoint with: Extraterrestrial
subclass of: http://lodlaundromat.org/.well-known/genid/1c057c878c7c3a3a1a60afec0f9c51a2#1
disjoint with: plants
subclass of: SuperType
disjoint with: visual information
subclass of: http://lodlaundromat.org/.well-known/genid/2dd581c251e9628cd06f7f0e006f321f#162
disjoint with: natural substance
disjoint with: structured information
disjoint with: http://lodlaundromat.org/.well-known/genid/2dd581c251e9628cd06f7f0e006f321f#1
subclass of: http://lodlaundromat.org/.well-known/genid/2dd581c251e9628cd06f7f0e006f321f#240
disjoint with: notations
subclass of: http://lodlaundromat.org/.well-known/genid/2dd581c251e9628cd06f7f0e006f321f#511
disjoint with: activities
subclass of: http://lodlaundromat.org/.well-known/genid/2dd581c251e9628cd06f7f0e006f321f#556
subclass of: http://lodlaundromat.org/.well-known/genid/2dd581c251e9628cd06f7f0e006f321f#45
disjoint with: person types
disjoint with: http://lodlaundromat.org/.well-known/genid/2dd581c251e9628cd06f7f0e006f321f#141
subclass of: http://lodlaundromat.org/.well-known/genid/2dd581c251e9628cd06f7f0e006f321f#419
subclass of: http://lodlaundromat.org/.well-known/genid/2dd581c251e9628cd06f7f0e006f321f#536
disjoint with: Ordered Collection
disjoint with: Collection
disjoint with: drugs
subclass of: http://lodlaundromat.org/.well-known/genid/2dd581c251e9628cd06f7f0e006f321f#70
subclass of: http://lodlaundromat.org/.well-known/genid/2dd581c251e9628cd06f7f0e006f321f#325
subclass of: reference concept
subclass of: Concept
disjoint with: time
subclass of: http://lodlaundromat.org/.well-known/genid/2dd581c251e9628cd06f7f0e006f321f#283
subclass of: http://lodlaundromat.org/.well-known/genid/2dd581c251e9628cd06f7f0e006f321f#484
disjoint with: prokaryotes
definition: These are various workplaces and areas of human activities, ranging from single person workstations to large aggregations of people (but which are not formal political entities)

relates to finance or economy
property disjoint with: relates to visual information
property disjoint with: relates to extraterrestrial entity
property disjoint with: relates to audio information
property disjoint with: has food drink
type: ObjectProperty
property disjoint with: relates to drug
property disjoint with: has member
property disjoint with: has time
property disjoint with: relates to chemistry
property disjoint with: relates to plant
property disjoint with: has member list
property disjoint with: relates to other organism
property disjoint with: relates to society
sub property of: topObjectProperty
property disjoint with: bottomObjectProperty
property disjoint with: relates to numbers
property disjoint with: relates to disease
property disjoint with: has top concept
property disjoint with: relates to natural phenomenon
property disjoint with: has person type
property disjoint with: relates to animal
domain: Thing
range: fnance and economy
definition: This predicate relates an external entity to the SuperType (ST) shown. It indicates there is a relationship to the ST of a verifiable nature, but which is undetermined as to strength or a full rdf:type relationship.

fnance and economy
disjoint with: numbers
subclass of: http://lodlaundromat.org/.well-known/genid/2dd581c251e9628cd06f7f0e006f321f#70
subclass of: http://lodlaundromat.org/.well-known/genid/2dd581c251e9628cd06f7f0e006f321f#23
subclass of: http://lodlaundromat.org/.well-known/genid/2dd581c251e9628cd06f7f0e006f321f#556
subclass of: http://lodlaundromat.org/.well-known/genid/2dd581c251e9628cd06f7f0e006f321f#457
subclass of: http://lodlaundromat.org/.well-known/genid/2dd581c251e9628cd06f7f0e006f321f#511
disjoint with: Extraterrestrial
disjoint with: Concept Scheme
subclass of: http://lodlaundromat.org/.well-known/genid/2dd581c251e9628cd06f7f0e006f321f#93
disjoint with: person types
disjoint with: Ordered Collection
disjoint with: Nothing
disjoint with: protists fungus
subclass of: reference concept
subclass of: http://lodlaundromat.org/.well-known/genid/2dd581c251e9628cd06f7f0e006f321f#177
disjoint with: time
disjoint with: food or drink
subclass of: Thing
subclass of: http://lodlaundromat.org/.well-known/genid/2dd581c251e9628cd06f7f0e006f321f#240
subclass of: http://lodlaundromat.org/.well-known/genid/2dd581c251e9628cd06f7f0e006f321f#118
disjoint with: http://lodlaundromat.org/.well-known/genid/2dd581c251e9628cd06f7f0e006f321f#1
disjoint with: prokaryotes
disjoint with: drugs
subclass of: http://lodlaundromat.org/.well-known/genid/2dd581c251e9628cd06f7f0e006f321f#45
subclass of: http://lodlaundromat.org/.well-known/genid/2dd581c251e9628cd06f7f0e006f321f#484
subclass of: http://lodlaundromat.org/.well-known/genid/2dd581c251e9628cd06f7f0e006f321f#344
disjoint with: http://lodlaundromat.org/.well-known/genid/2dd581c251e9628cd06f7f0e006f321f#223
disjoint with: plants
disjoint with: society
subclass of: SuperType
disjoint with: chemistry
disjoint with: audio information
subclass of: http://lodlaundromat.org/.well-known/genid/1c057c878c7c3a3a1a60afec0f9c51a2#1
disjoint with: Collection
disjoint with: natural phenomena
disjoint with: visual information
subclass of: http://lodlaundromat.org/.well-known/genid/2dd581c251e9628cd06f7f0e006f321f#419
subclass of: Concept
subclass of: http://lodlaundromat.org/.well-known/genid/2dd581c251e9628cd06f7f0e006f321f#283
type: Class
subclass of: http://lodlaundromat.org/.well-known/genid/2dd581c251e9628cd06f7f0e006f321f#393
disjoint with: diseases
subclass of: http://lodlaundromat.org/.well-known/genid/2dd581c251e9628cd06f7f0e006f321f#584
disjoint with: animals
definition: This SuperType pertains to all things financial and with respect to the economy, including chartable company performance, stock index entities, money, local currencies, taxes, incomes, accounts and accounting, mortgages and property.

has related match
type: SymmetricProperty
sub property of: is in semantic relation with
type: ObjectProperty
sub property of: topObjectProperty
property disjoint with: has member list
sub property of: is in mapping relation with
property disjoint with: has top concept
property disjoint with: is top concept in scheme
property disjoint with: has member
sub property of: has related
property disjoint with: bottomObjectProperty
property disjoint with: is in scheme
definition: skos:relatedMatch is used to state an associative mapping link between two conceptual resources in different concept schemes.
type: Property

has activity
property disjoint with: relates to geopolitical entity
property disjoint with: has time
property disjoint with: bottomObjectProperty
property disjoint with: relates to audio information
property disjoint with: relates to plant
property disjoint with: has workplace
property disjoint with: relates to society
property disjoint with: has top concept
property disjoint with: has member list
property disjoint with: relates to earthscape
property disjoint with: relates to chemistry
property disjoint with: relates to facility
property disjoint with: relates to drug
property disjoint with: relates to numbers
property disjoint with: relates to extraterrestrial entity
property disjoint with: relates to animal
sub property of: topObjectProperty
property disjoint with: relates to other organism
property disjoint with: has member
property disjoint with: relates to natural substance
property disjoint with: has person type
type: ObjectProperty
property disjoint with: has organization type
domain: Thing
range: activities
definition: This predicate relates an external entity to the SuperType (ST) shown. It indicates there is a relationship to the ST of a verifiable nature, but which is undetermined as to strength or a full rdf:type relationship

relates to facility
property disjoint with: relates to society
type: ObjectProperty
property disjoint with: has organization type
property disjoint with: relates to animal
property disjoint with: relates to other organism
property disjoint with: has activity
property disjoint with: has person type
property disjoint with: relates to numbers
sub property of: topObjectProperty
property disjoint with: has time
property disjoint with: relates to extraterrestrial entity
property disjoint with: has event
property disjoint with: relates to audio information
property disjoint with: has member list
property disjoint with: has food drink
property disjoint with: bottomObjectProperty
property disjoint with: relates to chemistry
property disjoint with: relates to disease
property disjoint with: has top concept
property disjoint with: relates to natural phenomenon
property disjoint with: has member
property disjoint with: relates to structured information
property disjoint with: has notation
property disjoint with: relates to plant
property disjoint with: relates to drug
domain: Thing
range: facilities
definition: This predicate relates an external entity to the SuperType (ST) shown. It indicates there is a relationship to the ST of a verifiable nature, but which is undetermined as to strength or a full rdf:type relationship.

attributes
subclass of: reference concept
disjoint with: Collection
subclass of: Thing
subclass of: Concept
disjoint with: Nothing
type: Class
disjoint with: Concept Scheme
subclass of: http://lodlaundromat.org/.well-known/genid/1c057c878c7c3a3a1a60afec0f9c51a2#1
subclass of: SuperType
disjoint with: Ordered Collection
definition: This general SuperType category is for descriptive attributes of all kinds. Think of the specific attributes in Wikipedia "infoboxes" to understand the purpose and coverage of this SuperType. It includes colors, shapes, sizes, or other descriptive characteristics about an object.

relates to drug
property disjoint with: bottomObjectProperty
property disjoint with: relates to facility
property disjoint with: relates to numbers
property disjoint with: relates to society
property disjoint with: relates to structured information
property disjoint with: has person type
property disjoint with: relates to geopolitical entity
property disjoint with: has notation
property disjoint with: relates to visual information
property disjoint with: relates to earthscape
property disjoint with: has member
property disjoint with: relates to animal
property disjoint with: has time
property disjoint with: relates to natural phenomenon
property disjoint with: has workplace
type: ObjectProperty
property disjoint with: has top concept
property disjoint with: has organization type
property disjoint with: has activity
property disjoint with: relates to extraterrestrial entity
property disjoint with: has event
property disjoint with: relates to finance or economy
property disjoint with: relates to disease
sub property of: topObjectProperty
property disjoint with: has member list
property disjoint with: relates to audio information
domain: Thing
range: drugs
definition: This predicate relates an external entity to the SuperType (ST) shown. It indicates there is a relationship to the ST of a verifiable nature, but which is undetermined as to strength or a full rdf:type relationship.

relates to chemistry
property disjoint with: relates to numbers
property disjoint with: relates to geopolitical entity
property disjoint with: relates to structured information
property disjoint with: relates to finance or economy
property disjoint with: relates to visual information
sub property of: topObjectProperty
property disjoint with: has top concept
property disjoint with: has activity
property disjoint with: has member
property disjoint with: has workplace
property disjoint with: has time
property disjoint with: has notation
property disjoint with: relates to plant
property disjoint with: relates to society
property disjoint with: relates to extraterrestrial entity
property disjoint with: has person type
property disjoint with: bottomObjectProperty
property disjoint with: has member list
property disjoint with: relates to earthscape
property disjoint with: relates to natural phenomenon
type: ObjectProperty
property disjoint with: relates to disease
property disjoint with: relates to facility
property disjoint with: relates to other organism
property disjoint with: has organization type
property disjoint with: relates to audio information
domain: Thing
range: chemistry
definition: This predicate relates an external entity to the SuperType (ST) shown. It indicates there is a relationship to the ST of a verifiable nature, but which is undetermined as to strength or a full rdf:type relationship.

events
disjoint with: Nothing
subclass of: http://lodlaundromat.org/.well-known/genid/2dd581c251e9628cd06f7f0e006f321f#419
disjoint with: workplaces
subclass of: Thing
disjoint with: natural substance
subclass of: http://lodlaundromat.org/.well-known/genid/2dd581c251e9628cd06f7f0e006f321f#371
subclass of: http://lodlaundromat.org/.well-known/genid/2dd581c251e9628cd06f7f0e006f321f#457
disjoint with: plants
subclass of: SuperType
disjoint with: facilities
subclass of: http://lodlaundromat.org/.well-known/genid/2dd581c251e9628cd06f7f0e006f321f#511
subclass of: http://lodlaundromat.org/.well-known/genid/2dd581c251e9628cd06f7f0e006f321f#602
disjoint with: http://lodlaundromat.org/.well-known/genid/2dd581c251e9628cd06f7f0e006f321f#162
disjoint with: http://lodlaundromat.org/.well-known/genid/2dd581c251e9628cd06f7f0e006f321f#1
subclass of: http://lodlaundromat.org/.well-known/genid/2dd581c251e9628cd06f7f0e006f321f#393
subclass of: http://lodlaundromat.org/.well-known/genid/1c057c878c7c3a3a1a60afec0f9c51a2#1
disjoint with: protists fungus
type: Class
subclass of: http://lodlaundromat.org/.well-known/genid/2dd581c251e9628cd06f7f0e006f321f#260
disjoint with: drugs
subclass of: http://lodlaundromat.org/.well-known/genid/2dd581c251e9628cd06f7f0e006f321f#141
disjoint with: person types
disjoint with: geopolitical
disjoint with: organizations
disjoint with: animals
disjoint with: Concept Scheme
disjoint with: numbers
subclass of: http://lodlaundromat.org/.well-known/genid/2dd581c251e9628cd06f7f0e006f321f#23
subclass of: http://lodlaundromat.org/.well-known/genid/2dd581c251e9628cd06f7f0e006f321f#118
disjoint with: Collection
subclass of: http://lodlaundromat.org/.well-known/genid/2dd581c251e9628cd06f7f0e006f321f#306
disjoint with: Ordered Collection
subclass of: http://lodlaundromat.org/.well-known/genid/2dd581c251e9628cd06f7f0e006f321f#344
subclass of: reference concept
disjoint with: prokaryotes
subclass of: Concept
subclass of: http://lodlaundromat.org/.well-known/genid/2dd581c251e9628cd06f7f0e006f321f#484
disjoint with: society
subclass of: http://lodlaundromat.org/.well-known/genid/2dd581c251e9628cd06f7f0e006f321f#201
disjoint with: earthscape
definition: These are nameable occasions, games, sports events, conferences, natural phenomena, natural disasters, wars, incidents, anniversaries, holidays, or notable moments or periods in time

has related
property disjoint with: has member list
property disjoint with: has top concept
sub property of: topObjectProperty
sub property of: is in semantic relation with
property disjoint with: bottomObjectProperty
property disjoint with: is in scheme
type: ObjectProperty
property disjoint with: has member
type: SymmetricProperty
property disjoint with: is top concept in scheme
definition: Relates a concept to a concept with which there is an associative semantic relationship.
comment: skos:related is disjoint with skos:broaderTransitive
type: Property

Extraterrestrial
disjoint with: diseases
subclass of: http://lodlaundromat.org/.well-known/genid/2dd581c251e9628cd06f7f0e006f321f#23
subclass of: SuperType
disjoint with: Ordered Collection
subclass of: Concept
subclass of: http://lodlaundromat.org/.well-known/genid/2dd581c251e9628cd06f7f0e006f321f#457
disjoint with: notations
disjoint with: drugs
disjoint with: workplaces
disjoint with: Concept Scheme
subclass of: http://lodlaundromat.org/.well-known/genid/2dd581c251e9628cd06f7f0e006f321f#240
disjoint with: activities
disjoint with: facilities
subclass of: http://lodlaundromat.org/.well-known/genid/2dd581c251e9628cd06f7f0e006f321f#393
disjoint with: http://lodlaundromat.org/.well-known/genid/2dd581c251e9628cd06f7f0e006f321f#177
disjoint with: Nothing
subclass of: http://lodlaundromat.org/.well-known/genid/2dd581c251e9628cd06f7f0e006f321f#223
subclass of: http://lodlaundromat.org/.well-known/genid/2dd581c251e9628cd06f7f0e006f321f#344
subclass of: http://lodlaundromat.org/.well-known/genid/2dd581c251e9628cd06f7f0e006f321f#625
disjoint with: person types
subclass of: http://lodlaundromat.org/.well-known/genid/2dd581c251e9628cd06f7f0e006f321f#511
subclass of: http://lodlaundromat.org/.well-known/genid/2dd581c251e9628cd06f7f0e006f321f#70
disjoint with: numbers
subclass of: http://lodlaundromat.org/.well-known/genid/2dd581c251e9628cd06f7f0e006f321f#602
disjoint with: chemistry
subclass of: reference concept
subclass of: http://lodlaundromat.org/.well-known/genid/2dd581c251e9628cd06f7f0e006f321f#445
subclass of: http://lodlaundromat.org/.well-known/genid/2dd581c251e9628cd06f7f0e006f321f#45
subclass of: http://lodlaundromat.org/.well-known/genid/1c057c878c7c3a3a1a60afec0f9c51a2#1
disjoint with: audio information
disjoint with: products
disjoint with: time
disjoint with: fnance and economy
subclass of: http://lodlaundromat.org/.well-known/genid/2dd581c251e9628cd06f7f0e006f321f#325
disjoint with: animals
subclass of: http://lodlaundromat.org/.well-known/genid/2dd581c251e9628cd06f7f0e006f321f#260
type: Class
subclass of: http://lodlaundromat.org/.well-known/genid/2dd581c251e9628cd06f7f0e006f321f#118
subclass of: http://lodlaundromat.org/.well-known/genid/2dd581c251e9628cd06f7f0e006f321f#4
disjoint with: geopolitical
disjoint with: Collection
subclass of: Thing
subclass of: http://lodlaundromat.org/.well-known/genid/2dd581c251e9628cd06f7f0e006f321f#536
disjoint with: prokaryotes
subclass of: http://lodlaundromat.org/.well-known/genid/2dd581c251e9628cd06f7f0e006f321f#419
disjoint with: organizations
subclass of: http://lodlaundromat.org/.well-known/genid/2dd581c251e9628cd06f7f0e006f321f#371
disjoint with: protists fungus
disjoint with: http://lodlaundromat.org/.well-known/genid/2dd581c251e9628cd06f7f0e006f321f#1
subclass of: http://lodlaundromat.org/.well-known/genid/2dd581c251e9628cd06f7f0e006f321f#201
disjoint with: plants
subclass of: http://lodlaundromat.org/.well-known/genid/2dd581c251e9628cd06f7f0e006f321f#556
disjoint with: society
disjoint with: structured information
disjoint with: food or drink
subclass of: http://lodlaundromat.org/.well-known/genid/2dd581c251e9628cd06f7f0e006f321f#484
disjoint with: written information
subclass of: http://lodlaundromat.org/.well-known/genid/2dd581c251e9628cd06f7f0e006f321f#93
definition: This SuperType includes all natural things not specifically terrestrial, including celestial bodies (planets, asteroids, stars, galaxies, etc., that can be located within a sky map).

has mapping
sub property of: topObjectProperty
property disjoint with: has member list
property disjoint with: has top concept
property disjoint with: bottomObjectProperty
property disjoint with: has member
type: ObjectProperty
domain: test
range: Thing
definition: This property is used to reify a umbel:isAbout or a umbel:isRelatedTo property to a mapping percentage value, some quantitative metric value, or a qualitative descriptor characterizing the linkage degree or overlap between the two classes, predicates, individuals or datatypes. This value might be calculated from some external utility.

audio information
disjoint with: earthscape
subclass of: http://lodlaundromat.org/.well-known/genid/2dd581c251e9628cd06f7f0e006f321f#201
subclass of: http://lodlaundromat.org/.well-known/genid/2dd581c251e9628cd06f7f0e006f321f#223
disjoint with: http://lodlaundromat.org/.well-known/genid/2dd581c251e9628cd06f7f0e006f321f#325
disjoint with: http://lodlaundromat.org/.well-known/genid/2dd581c251e9628cd06f7f0e006f321f#162
subclass of: SuperType
disjoint with: time
disjoint with: diseases
subclass of: http://lodlaundromat.org/.well-known/genid/2dd581c251e9628cd06f7f0e006f321f#602
subclass of: Concept
disjoint with: Extraterrestrial
subclass of: http://lodlaundromat.org/.well-known/genid/2dd581c251e9628cd06f7f0e006f321f#177
disjoint with: animals
disjoint with: food or drink
disjoint with: written information
disjoint with: drugs
disjoint with: natural substance
disjoint with: Ordered Collection
subclass of: http://lodlaundromat.org/.well-known/genid/2dd581c251e9628cd06f7f0e006f321f#4
disjoint with: chemistry
subclass of: http://lodlaundromat.org/.well-known/genid/2dd581c251e9628cd06f7f0e006f321f#240
subclass of: http://lodlaundromat.org/.well-known/genid/2dd581c251e9628cd06f7f0e006f321f#393
disjoint with: Collection
subclass of: http://lodlaundromat.org/.well-known/genid/2dd581c251e9628cd06f7f0e006f321f#419
subclass of: http://lodlaundromat.org/.well-known/genid/2dd581c251e9628cd06f7f0e006f321f#625
disjoint with: natural phenomena
disjoint with: organizations
subclass of: http://lodlaundromat.org/.well-known/genid/2dd581c251e9628cd06f7f0e006f321f#344
disjoint with: protists fungus
subclass of: http://lodlaundromat.org/.well-known/genid/2dd581c251e9628cd06f7f0e006f321f#70
disjoint with: prokaryotes
subclass of: http://lodlaundromat.org/.well-known/genid/2dd581c251e9628cd06f7f0e006f321f#93
subclass of: http://lodlaundromat.org/.well-known/genid/2dd581c251e9628cd06f7f0e006f321f#118
subclass of: http://lodlaundromat.org/.well-known/genid/2dd581c251e9628cd06f7f0e006f321f#511
disjoint with: workplaces
disjoint with: http://lodlaundromat.org/.well-known/genid/2dd581c251e9628cd06f7f0e006f321f#445
subclass of: http://lodlaundromat.org/.well-known/genid/2dd581c251e9628cd06f7f0e006f321f#260
subclass of: http://lodlaundromat.org/.well-known/genid/1c057c878c7c3a3a1a60afec0f9c51a2#1
subclass of: http://lodlaundromat.org/.well-known/genid/2dd581c251e9628cd06f7f0e006f321f#141
disjoint with: Concept Scheme
disjoint with: society
disjoint with: http://lodlaundromat.org/.well-known/genid/2dd581c251e9628cd06f7f0e006f321f#1
subclass of: http://lodlaundromat.org/.well-known/genid/2dd581c251e9628cd06f7f0e006f321f#484
disjoint with: fnance and economy
subclass of: http://lodlaundromat.org/.well-known/genid/2dd581c251e9628cd06f7f0e006f321f#23
subclass of: http://lodlaundromat.org/.well-known/genid/2dd581c251e9628cd06f7f0e006f321f#306
subclass of: http://lodlaundromat.org/.well-known/genid/2dd581c251e9628cd06f7f0e006f321f#457
disjoint with: activities
disjoint with: facilities
subclass of: Thing
type: Class
subclass of: http://lodlaundromat.org/.well-known/genid/2dd581c251e9628cd06f7f0e006f321f#536
subclass of: http://lodlaundromat.org/.well-known/genid/2dd581c251e9628cd06f7f0e006f321f#283
disjoint with: Nothing
subclass of: http://lodlaundromat.org/.well-known/genid/2dd581c251e9628cd06f7f0e006f321f#556
subclass of: http://lodlaundromat.org/.well-known/genid/2dd581c251e9628cd06f7f0e006f321f#371
subclass of: reference concept
disjoint with: geopolitical
disjoint with: http://lodlaundromat.org/.well-known/genid/2dd581c251e9628cd06f7f0e006f321f#584
disjoint with: structured information
disjoint with: person types
disjoint with: plants
disjoint with: numbers
disjoint with: http://lodlaundromat.org/.well-known/genid/2dd581c251e9628cd06f7f0e006f321f#45
definition: This SuperType is for any audio-only human work. Examples include live music performances, record albums, or radion shows or individual radio broadcasts

reference concept
disjoint with: Ordered Collection
equivalent class: Thing
disjoint with: Collection
complement of: Collection
complement of: Concept Scheme
subclass of: Thing
subclass of: http://lodlaundromat.org/.well-known/genid/1c057c878c7c3a3a1a60afec0f9c51a2#1
disjoint with: Concept Scheme
subclass of: Concept
equivalent class: http://lodlaundromat.org/.well-known/genid/1c057c878c7c3a3a1a60afec0f9c51a2#1
equivalent class: Concept
complement of: Ordered Collection
complement of: Nothing
disjoint with: Nothing
type: Class
subclass of: http://lodlaundromat.org/.well-known/genid/2dd581c251e9628cd06f7f0e006f321f#510
definition: Reference Concepts are a distinct subset of the more broadly understood concept such as used in the SKOS RDFS controlled vocabulary or formal concept analysis or the very general or abstract concepts common to some upper ontologies. Reference Concepts are selected for their use as concrete, subject-related or commonly used notions for describing tangible ideas and referents in human experience and language. Reference Concepts are classes, the members of which are nameable instances or named entities, which by definition are held as distinct from these concepts. The UMBEL ontology is a coherently organized structure (or reference "backbone") of these Reference Concepts.

test
disjoint with: Concept Scheme
disjoint with: Nothing
subclass of: http://lodlaundromat.org/.well-known/genid/1c057c878c7c3a3a1a60afec0f9c51a2#1
subclass of: reference concept
disjoint with: Collection
subclass of: Concept
disjoint with: Ordered Collection
subclass of: Thing
type: Class

relates to visual information
property disjoint with: relates to finance or economy
property disjoint with: relates to society
type: ObjectProperty
property disjoint with: relates to disease
property disjoint with: relates to drug
property disjoint with: has workplace
property disjoint with: has member
property disjoint with: relates to animal
sub property of: topObjectProperty
property disjoint with: relates to other organism
property disjoint with: has member list
property disjoint with: has time
property disjoint with: has person type
property disjoint with: relates to plant
property disjoint with: relates to numbers
property disjoint with: has top concept
property disjoint with: relates to earthscape
property disjoint with: has organization type
property disjoint with: relates to geopolitical entity
property disjoint with: relates to chemistry
property disjoint with: relates to natural substance
property disjoint with: has food drink
property disjoint with: bottomObjectProperty
domain: Thing
range: visual information
definition: This predicate relates an external entity to the SuperType (ST) shown. It indicates there is a relationship to the ST of a verifiable nature, but which is undetermined as to strength or a full rdf:type relationship.

topics categories
subclass of: Thing
disjoint with: Collection
disjoint with: Ordered Collection
subclass of: reference concept
subclass of: SuperType
subclass of: Concept
disjoint with: Concept Scheme
subclass of: http://lodlaundromat.org/.well-known/genid/1c057c878c7c3a3a1a60afec0f9c51a2#1
type: Class
disjoint with: Nothing
definition: This largely subject-oriented SuperType is a means for using controlled vocabularies and classification schemes for characterizing what content "is about". The key constituents of this category are Types, Classifications, Concepts, CCC, and controlled vocabularies

Manual - Similar Sense
type: reference concept
type: Concept
type: Thing
type: http://lodlaundromat.org/.well-known/genid/1c057c878c7c3a3a1a60afec0f9c51a2#1
type: qualifier
type: NamedIndividual
definition: The two mapped concepts share much overlap, but are not the exact same sense, such as an action as related to the thing it acts upo.

natural phenomena
disjoint with: numbers
disjoint with: facilities
subclass of: http://lodlaundromat.org/.well-known/genid/2dd581c251e9628cd06f7f0e006f321f#445
disjoint with: products
subclass of: http://lodlaundromat.org/.well-known/genid/2dd581c251e9628cd06f7f0e006f321f#625
subclass of: http://lodlaundromat.org/.well-known/genid/2dd581c251e9628cd06f7f0e006f321f#201
disjoint with: Ordered Collection
subclass of: http://lodlaundromat.org/.well-known/genid/2dd581c251e9628cd06f7f0e006f321f#393
subclass of: http://lodlaundromat.org/.well-known/genid/2dd581c251e9628cd06f7f0e006f321f#118
disjoint with: person types
disjoint with: workplaces
type: Class
subclass of: http://lodlaundromat.org/.well-known/genid/2dd581c251e9628cd06f7f0e006f321f#223
disjoint with: http://lodlaundromat.org/.well-known/genid/2dd581c251e9628cd06f7f0e006f321f#162
subclass of: Thing
subclass of: http://lodlaundromat.org/.well-known/genid/2dd581c251e9628cd06f7f0e006f321f#602
subclass of: http://lodlaundromat.org/.well-known/genid/1c057c878c7c3a3a1a60afec0f9c51a2#1
disjoint with: fnance and economy
disjoint with: http://lodlaundromat.org/.well-known/genid/2dd581c251e9628cd06f7f0e006f321f#584
disjoint with: chemistry
disjoint with: diseases
subclass of: http://lodlaundromat.org/.well-known/genid/2dd581c251e9628cd06f7f0e006f321f#141
disjoint with: society
disjoint with: written information
subclass of: http://lodlaundromat.org/.well-known/genid/2dd581c251e9628cd06f7f0e006f321f#93
disjoint with: time
disjoint with: http://lodlaundromat.org/.well-known/genid/2dd581c251e9628cd06f7f0e006f321f#1
disjoint with: organizations
subclass of: http://lodlaundromat.org/.well-known/genid/2dd581c251e9628cd06f7f0e006f321f#419
subclass of: Concept
subclass of: http://lodlaundromat.org/.well-known/genid/2dd581c251e9628cd06f7f0e006f321f#325
subclass of: http://lodlaundromat.org/.well-known/genid/2dd581c251e9628cd06f7f0e006f321f#371
subclass of: http://lodlaundromat.org/.well-known/genid/2dd581c251e9628cd06f7f0e006f321f#511
disjoint with: plants
subclass of: http://lodlaundromat.org/.well-known/genid/2dd581c251e9628cd06f7f0e006f321f#45
subclass of: http://lodlaundromat.org/.well-known/genid/2dd581c251e9628cd06f7f0e006f321f#344
subclass of: http://lodlaundromat.org/.well-known/genid/2dd581c251e9628cd06f7f0e006f321f#70
subclass of: http://lodlaundromat.org/.well-known/genid/2dd581c251e9628cd06f7f0e006f321f#306
subclass of: http://lodlaundromat.org/.well-known/genid/2dd581c251e9628cd06f7f0e006f321f#260
disjoint with: earthscape
disjoint with: animals
disjoint with: food or drink
disjoint with: http://lodlaundromat.org/.well-known/genid/2dd581c251e9628cd06f7f0e006f321f#283
disjoint with: audio information
disjoint with: Nothing
disjoint with: notations
disjoint with: protists fungus
disjoint with: Collection
disjoint with: Concept Scheme
disjoint with: natural substance
disjoint with: prokaryotes
subclass of: SuperType
disjoint with: geopolitical
subclass of: http://lodlaundromat.org/.well-known/genid/2dd581c251e9628cd06f7f0e006f321f#484
subclass of: http://lodlaundromat.org/.well-known/genid/2dd581c251e9628cd06f7f0e006f321f#457
subclass of: reference concept
disjoint with: drugs
subclass of: http://lodlaundromat.org/.well-known/genid/2dd581c251e9628cd06f7f0e006f321f#556
subclass of: http://lodlaundromat.org/.well-known/genid/2dd581c251e9628cd06f7f0e006f321f#240
subclass of: http://lodlaundromat.org/.well-known/genid/2dd581c251e9628cd06f7f0e006f321f#23
definition: This SuperType includes natural phenomena and natural processes such as weather, weathering, erosion, fires, lightning, earthquakes, tectonics, etc. Clouds and weather processes are specifically included. Also includes climate cycles, general natural events (such as hurricanes) that are not specifically named, and biochemical processes and pathways.

has food drink
property disjoint with: relates to audio information
property disjoint with: relates to society
property disjoint with: has member list
property disjoint with: has organization type
property disjoint with: has top concept
property disjoint with: relates to disease
property disjoint with: relates to earthscape
property disjoint with: relates to geopolitical entity
property disjoint with: has time
property disjoint with: bottomObjectProperty
property disjoint with: relates to numbers
property disjoint with: has workplace
property disjoint with: relates to finance or economy
sub property of: topObjectProperty
property disjoint with: relates to facility
property disjoint with: has notation
type: ObjectProperty
property disjoint with: relates to extraterrestrial entity
property disjoint with: has person type
property disjoint with: has member
property disjoint with: relates to visual information
property disjoint with: relates to natural phenomenon
property disjoint with: relates to structured information
domain: Thing
range: food or drink
definition: This predicate relates an external entity to the SuperType (ST) shown. It indicates there is a relationship to the ST of a verifiable nature, but which is undetermined as to strength or a full rdf:type relationship

Concept Scheme
subclass of: Class
disjoint with: Collection
subclass of: structured information
subclass of: chemistry
subclass of: abstract level
disjoint with: audio information
subclass of: http://lodlaundromat.org/.well-known/genid/2dd581c251e9628cd06f7f0e006f321f#201
subclass of: society
subclass of: geopolitical
subclass of: market industries
disjoint with: http://lodlaundromat.org/.well-known/genid/2dd581c251e9628cd06f7f0e006f321f#23
disjoint with: http://lodlaundromat.org/.well-known/genid/2dd581c251e9628cd06f7f0e006f321f#141
subclass of: http://lodlaundromat.org/.well-known/genid/2dd581c251e9628cd06f7f0e006f321f#584
complement of: Concept
disjoint with: http://lodlaundromat.org/.well-known/genid/2dd581c251e9628cd06f7f0e006f321f#393
disjoint with: plants
disjoint with: http://lodlaundromat.org/.well-known/genid/1c057c878c7c3a3a1a60afec0f9c51a2#1
disjoint with: structured information
disjoint with: fnance and economy
subclass of: http://lodlaundromat.org/.well-known/genid/2dd581c251e9628cd06f7f0e006f321f#419
disjoint with: http://lodlaundromat.org/.well-known/genid/2dd581c251e9628cd06f7f0e006f321f#325
disjoint with: written information
complement of: http://lodlaundromat.org/.well-known/genid/1c057c878c7c3a3a1a60afec0f9c51a2#1
subclass of: workplaces
subclass of: Ordered Collection
disjoint with: http://lodlaundromat.org/.well-known/genid/2dd581c251e9628cd06f7f0e006f321f#602
subclass of: Nothing
subclass of: http://lodlaundromat.org/.well-known/genid/2dd581c251e9628cd06f7f0e006f321f#70
disjoint with: http://lodlaundromat.org/.well-known/genid/2dd581c251e9628cd06f7f0e006f321f#556
disjoint with: Extraterrestrial
type: Class
disjoint with: person types
subclass of: plants
disjoint with: protists fungus
subclass of: http://lodlaundromat.org/.well-known/genid/2dd581c251e9628cd06f7f0e006f321f#162
disjoint with: http://lodlaundromat.org/.well-known/genid/2dd581c251e9628cd06f7f0e006f321f#240
disjoint with: society
disjoint with: reference concept
subclass of: attributes
disjoint with: time
disjoint with: diseases
disjoint with: http://lodlaundromat.org/.well-known/genid/2dd581c251e9628cd06f7f0e006f321f#70
disjoint with: notations
disjoint with: food or drink
subclass of: http://lodlaundromat.org/.well-known/genid/2dd581c251e9628cd06f7f0e006f321f#4
subclass of: activities
subclass of: http://lodlaundromat.org/.well-known/genid/2dd581c251e9628cd06f7f0e006f321f#93
disjoint with: http://lodlaundromat.org/.well-known/genid/2dd581c251e9628cd06f7f0e006f321f#625
subclass of: http://lodlaundromat.org/.well-known/genid/2dd581c251e9628cd06f7f0e006f321f#457
subclass of: written information
disjoint with: http://lodlaundromat.org/.well-known/genid/2dd581c251e9628cd06f7f0e006f321f#93
equivalent class: Nothing
disjoint with: http://lodlaundromat.org/.well-known/genid/2dd581c251e9628cd06f7f0e006f321f#4
subclass of: person types
subclass of: http://lodlaundromat.org/.well-known/genid/2dd581c251e9628cd06f7f0e006f321f#306
subclass of: animals
disjoint with: drugs
subclass of: http://lodlaundromat.org/.well-known/genid/2dd581c251e9628cd06f7f0e006f321f#536
disjoint with: http://lodlaundromat.org/.well-known/genid/2dd581c251e9628cd06f7f0e006f321f#45
subclass of: visual information
disjoint with: animals
subclass of: Collection
subclass of: fnance and economy
subclass of: notations
subclass of: facilities
disjoint with: qualifier
subclass of: drugs
disjoint with: http://lodlaundromat.org/.well-known/genid/2dd581c251e9628cd06f7f0e006f321f#201
disjoint with: Ordered Collection
disjoint with: chemistry
subclass of: http://lodlaundromat.org/.well-known/genid/2dd581c251e9628cd06f7f0e006f321f#223
disjoint with: http://lodlaundromat.org/.well-known/genid/2dd581c251e9628cd06f7f0e006f321f#223
equivalent class: Ordered Collection
disjoint with: natural substance
disjoint with: http://lodlaundromat.org/.well-known/genid/2dd581c251e9628cd06f7f0e006f321f#419
disjoint with: abstract level
subclass of: http://lodlaundromat.org/.well-known/genid/2dd581c251e9628cd06f7f0e006f321f#177
disjoint with: earthscape
disjoint with: test
subclass of: http://lodlaundromat.org/.well-known/genid/2dd581c251e9628cd06f7f0e006f321f#283

relates to numbers
property disjoint with: relates to chemistry
property disjoint with: has product type
sub property of: topObjectProperty
property disjoint with: has organization type
property disjoint with: relates to animal
property disjoint with: has workplace
property disjoint with: has member
property disjoint with: relates to natural substance
property disjoint with: relates to drug
property disjoint with: has food drink
property disjoint with: relates to society
property disjoint with: relates to earthscape
property disjoint with: relates to other organism
property disjoint with: relates to finance or economy
property disjoint with: bottomObjectProperty
property disjoint with: relates to natural phenomenon
property disjoint with: has time
property disjoint with: has top concept
type: ObjectProperty
property disjoint with: has event
property disjoint with: has member list
property disjoint with: has activity
property disjoint with: relates to extraterrestrial entity
property disjoint with: relates to facility
property disjoint with: relates to audio information
property disjoint with: relates to disease
property disjoint with: relates to visual information
property disjoint with: relates to geopolitical entity
property disjoint with: has person type
property disjoint with: relates to plant
domain: Thing
range: numbers
definition: This predicate relates an external entity to the SuperType (ST) shown. It indicates there is a relationship to the ST of a verifiable nature, but which is undetermined as to strength or a full rdf:type relationship.

Manual - Nearly Equivalent
type: reference concept
type: Concept
type: Thing
type: http://lodlaundromat.org/.well-known/genid/1c057c878c7c3a3a1a60afec0f9c51a2#1
type: qualifier
type: NamedIndividual
definition: The two mapped concepts are deemed to be nearly an equivalentClass or sameAs relationship, but not 100% so.

Heuristic - ListOf Basis
type: reference concept
type: Concept
type: Thing
type: http://lodlaundromat.org/.well-known/genid/1c057c878c7c3a3a1a60afec0f9c51a2#1
type: qualifier
type: NamedIndividual
definition: Type assignment based on Wikipedia ListOf category.

plants
subclass of: http://lodlaundromat.org/.well-known/genid/2dd581c251e9628cd06f7f0e006f321f#4
subclass of: http://lodlaundromat.org/.well-known/genid/2dd581c251e9628cd06f7f0e006f321f#141
disjoint with: earthscape
disjoint with: society
disjoint with: visual information
disjoint with: workplaces
disjoint with: protists fungus
disjoint with: written information
subclass of: http://lodlaundromat.org/.well-known/genid/2dd581c251e9628cd06f7f0e006f321f#23
subclass of: http://lodlaundromat.org/.well-known/genid/2dd581c251e9628cd06f7f0e006f321f#457
disjoint with: facilities
subclass of: http://lodlaundromat.org/.well-known/genid/2dd581c251e9628cd06f7f0e006f321f#602
subclass of: http://lodlaundromat.org/.well-known/genid/2dd581c251e9628cd06f7f0e006f321f#393
disjoint with: Nothing
subclass of: SuperType
disjoint with: http://lodlaundromat.org/.well-known/genid/2dd581c251e9628cd06f7f0e006f321f#445
disjoint with: organizations
disjoint with: http://lodlaundromat.org/.well-known/genid/2dd581c251e9628cd06f7f0e006f321f#240
subclass of: http://lodlaundromat.org/.well-known/genid/2dd581c251e9628cd06f7f0e006f321f#511
subclass of: http://lodlaundromat.org/.well-known/genid/2dd581c251e9628cd06f7f0e006f321f#584
disjoint with: Collection
subclass of: http://lodlaundromat.org/.well-known/genid/2dd581c251e9628cd06f7f0e006f321f#177
disjoint with: structured information
disjoint with: person types
disjoint with: activities
disjoint with: animals
disjoint with: http://lodlaundromat.org/.well-known/genid/2dd581c251e9628cd06f7f0e006f321f#419
disjoint with: prokaryotes
subclass of: Thing
subclass of: http://lodlaundromat.org/.well-known/genid/2dd581c251e9628cd06f7f0e006f321f#536
subclass of: http://lodlaundromat.org/.well-known/genid/2dd581c251e9628cd06f7f0e006f321f#484
subclass of: http://lodlaundromat.org/.well-known/genid/2dd581c251e9628cd06f7f0e006f321f#93
subclass of: http://lodlaundromat.org/.well-known/genid/1c057c878c7c3a3a1a60afec0f9c51a2#1
subclass of: http://lodlaundromat.org/.well-known/genid/2dd581c251e9628cd06f7f0e006f321f#371
subclass of: http://lodlaundromat.org/.well-known/genid/2dd581c251e9628cd06f7f0e006f321f#162
subclass of: http://lodlaundromat.org/.well-known/genid/2dd581c251e9628cd06f7f0e006f321f#344
disjoint with: events
disjoint with: natural substance
disjoint with: time
subclass of: http://lodlaundromat.org/.well-known/genid/2dd581c251e9628cd06f7f0e006f321f#283
subclass of: reference concept
disjoint with: audio information
subclass of: http://lodlaundromat.org/.well-known/genid/2dd581c251e9628cd06f7f0e006f321f#70
subclass of: http://lodlaundromat.org/.well-known/genid/2dd581c251e9628cd06f7f0e006f321f#306
type: Class
disjoint with: geopolitical
subclass of: http://lodlaundromat.org/.well-known/genid/2dd581c251e9628cd06f7f0e006f321f#45
subclass of: http://lodlaundromat.org/.well-known/genid/2dd581c251e9628cd06f7f0e006f321f#325
disjoint with: chemistry
disjoint with: fnance and economy
disjoint with: Extraterrestrial
disjoint with: numbers
subclass of: http://lodlaundromat.org/.well-known/genid/2dd581c251e9628cd06f7f0e006f321f#223
disjoint with: diseases
subclass of: http://lodlaundromat.org/.well-known/genid/2dd581c251e9628cd06f7f0e006f321f#260
disjoint with: Concept Scheme
disjoint with: natural phenomena
subclass of: http://lodlaundromat.org/.well-known/genid/2dd581c251e9628cd06f7f0e006f321f#556
subclass of: Concept
disjoint with: http://lodlaundromat.org/.well-known/genid/2dd581c251e9628cd06f7f0e006f321f#118
disjoint with: Ordered Collection
disjoint with: notations
subclass of: http://lodlaundromat.org/.well-known/genid/2dd581c251e9628cd06f7f0e006f321f#201
subclass of: http://lodlaundromat.org/.well-known/genid/2dd581c251e9628cd06f7f0e006f321f#625
disjoint with: http://lodlaundromat.org/.well-known/genid/2dd581c251e9628cd06f7f0e006f321f#1
definition: This SuperType includes all plant types and flora, including flowering plants, algae, non-flowering plants, gymnosperms, cycads, and plant parts and body types. Note that all Plant Parts are also included.

has product type
property disjoint with: bottomObjectProperty
property disjoint with: relates to extraterrestrial entity
property disjoint with: relates to natural phenomenon
property disjoint with: has top concept
property disjoint with: relates to numbers
property disjoint with: relates to disease
property disjoint with: has member list
property disjoint with: relates to geopolitical entity
property disjoint with: has member
property disjoint with: has time
property disjoint with: relates to society
sub property of: topObjectProperty
property disjoint with: relates to other organism
property disjoint with: has person type
property disjoint with: has organization type
type: ObjectProperty
domain: Thing
range: products
definition: This predicate relates an external entity to the SuperType (ST) shown. It indicates there is a relationship to the ST of a verifiable nature, but which is undetermined as to strength or a full rdf:type relationship

drugs
disjoint with: written information
subclass of: http://lodlaundromat.org/.well-known/genid/2dd581c251e9628cd06f7f0e006f321f#457
disjoint with: workplaces
subclass of: http://lodlaundromat.org/.well-known/genid/2dd581c251e9628cd06f7f0e006f321f#201
disjoint with: organizations
disjoint with: animals
subclass of: http://lodlaundromat.org/.well-known/genid/2dd581c251e9628cd06f7f0e006f321f#584
disjoint with: http://lodlaundromat.org/.well-known/genid/2dd581c251e9628cd06f7f0e006f321f#118
subclass of: http://lodlaundromat.org/.well-known/genid/2dd581c251e9628cd06f7f0e006f321f#625
subclass of: http://lodlaundromat.org/.well-known/genid/2dd581c251e9628cd06f7f0e006f321f#393
subclass of: http://lodlaundromat.org/.well-known/genid/2dd581c251e9628cd06f7f0e006f321f#141
subclass of: http://lodlaundromat.org/.well-known/genid/2dd581c251e9628cd06f7f0e006f321f#4
disjoint with: activities
subclass of: http://lodlaundromat.org/.well-known/genid/2dd581c251e9628cd06f7f0e006f321f#511
disjoint with: person types
subclass of: Concept
disjoint with: events
disjoint with: structured information
subclass of: SuperType
subclass of: Thing
subclass of: http://lodlaundromat.org/.well-known/genid/2dd581c251e9628cd06f7f0e006f321f#93
subclass of: http://lodlaundromat.org/.well-known/genid/2dd581c251e9628cd06f7f0e006f321f#223
disjoint with: facilities
subclass of: http://lodlaundromat.org/.well-known/genid/2dd581c251e9628cd06f7f0e006f321f#325
disjoint with: prokaryotes
subclass of: http://lodlaundromat.org/.well-known/genid/1c057c878c7c3a3a1a60afec0f9c51a2#1
subclass of: http://lodlaundromat.org/.well-known/genid/2dd581c251e9628cd06f7f0e006f321f#23
type: Class
subclass of: http://lodlaundromat.org/.well-known/genid/2dd581c251e9628cd06f7f0e006f321f#177
subclass of: http://lodlaundromat.org/.well-known/genid/2dd581c251e9628cd06f7f0e006f321f#162
disjoint with: Extraterrestrial
disjoint with: Collection
disjoint with: fnance and economy
disjoint with: society
disjoint with: Concept Scheme
disjoint with: time
disjoint with: Ordered Collection
subclass of: reference concept
disjoint with: numbers
disjoint with: diseases
subclass of: http://lodlaundromat.org/.well-known/genid/2dd581c251e9628cd06f7f0e006f321f#536
disjoint with: natural phenomena
disjoint with: http://lodlaundromat.org/.well-known/genid/2dd581c251e9628cd06f7f0e006f321f#240
subclass of: http://lodlaundromat.org/.well-known/genid/2dd581c251e9628cd06f7f0e006f321f#371
subclass of: http://lodlaundromat.org/.well-known/genid/2dd581c251e9628cd06f7f0e006f321f#260
disjoint with: audio information
subclass of: http://lodlaundromat.org/.well-known/genid/2dd581c251e9628cd06f7f0e006f321f#344
disjoint with: notations
subclass of: http://lodlaundromat.org/.well-known/genid/2dd581c251e9628cd06f7f0e006f321f#283
disjoint with: visual information
subclass of: http://lodlaundromat.org/.well-known/genid/2dd581c251e9628cd06f7f0e006f321f#45
disjoint with: earthscape
subclass of: http://lodlaundromat.org/.well-known/genid/2dd581c251e9628cd06f7f0e006f321f#556
subclass of: http://lodlaundromat.org/.well-known/genid/2dd581c251e9628cd06f7f0e006f321f#602
disjoint with: geopolitical
disjoint with: Nothing
definition: This SuperType is an drug, medication or addictive substance

correspondsTo
property disjoint with: is in scheme
sub property of: topObjectProperty
type: SymmetricProperty
property disjoint with: has top concept
property disjoint with: bottomObjectProperty
type: TransitiveProperty
property disjoint with: has member list
property disjoint with: is top concept in scheme
property disjoint with: has member
type: ObjectProperty
type: ReflexiveProperty
comment: The property umbel:correspondsTo is used to assert a close correspondence between an external class, named entity, individual or instance with a Reference Concept class. umbel:correspondsTo relates the external class, named entity, individual or instance to the class through the basis of both its subject matter and intended scope. This predicate should be used where the correspondence between the two entities is felt to be nearly equivalent to a sameAs assertion, and is reflexive, but without the full entailments of intensional class memberships. In these cases, both entities are understood to have the same type and intended scope, but without asserting a full class-level or sameAs individual relationship. This predicate is designed for the circumstance of aligning two different ontologies or knowledge bases based on node-level correspondences, but without entailing the actual ontological relationships and structure of the object source. For example, the umbel:correspondsTo predicate is used to assert close correspondence between UMBEL Reference Concepts and Wikipedia categories or pages, yet without entailing the actual Wikipedia category structure. This property asserts a different and stronger relationship than umbel:isAbout. One practical use is to guide specific instance member determinations when, say, the native structure of the external ontology or knowledge base is to be analyzed and replaced with an UMBEL-based structure. This property is therefore used to create a nearly equivalent assertion (however, with the degree of that equivalence being unknown or unknowable) between an external instance or class and a Reference Concept class
domain: Thing
range: reference concept

External - DBOntology Mapping
type: reference concept
type: Concept
type: Thing
type: http://lodlaundromat.org/.well-known/genid/1c057c878c7c3a3a1a60afec0f9c51a2#1
type: qualifier
type: NamedIndividual
definition: Mapping based on existing DBOntology assertion.

has narrower
sub property of: has narrower transitive
sub property of: is in semantic relation with
property disjoint with: is in scheme
property disjoint with: has member
property disjoint with: bottomObjectProperty
type: ObjectProperty
sub property of: topObjectProperty
inverse of: has broader
property disjoint with: is top concept in scheme
property disjoint with: has top concept
property disjoint with: has member list
definition: Relates a concept to a concept that is more specific in meaning.
scope note: By convention, skos:broader is only used to assert an immediate (i.e. direct) hierarchical link between two conceptual resources.
comment: Narrower concepts are typically rendered as children in a concept hierarchy (tree).
type: Property

has broader
property disjoint with: is in scheme
type: ObjectProperty
sub property of: topObjectProperty
property disjoint with: is top concept in scheme
property disjoint with: bottomObjectProperty
sub property of: has broader transitive
property disjoint with: has member
sub property of: is in semantic relation with
property disjoint with: has top concept
property disjoint with: has member list
inverse of: has narrower
definition: Relates a concept to a concept that is more general in meaning.
comment: Broader concepts are typically rendered as parents in a concept hierarchy (tree).
scope note: By convention, skos:broader is only used to assert an immediate (i.e. direct) hierarchical link between two conceptual resources.
type: Property

has broader transitive
sub property of: is in semantic relation with
type: ObjectProperty
property disjoint with: is in scheme
property disjoint with: has top concept
property disjoint with: is top concept in scheme
sub property of: topObjectProperty
type: TransitiveProperty
inverse of: has narrower transitive
property disjoint with: has member
property disjoint with: bottomObjectProperty
property disjoint with: has member list
definition: skos:broaderTransitive is a transitive superproperty of skos:broader.
scope note: By convention, skos:broaderTransitive is not used to make assertions. Rather, the properties can be used to draw inferences about the transitive closure of the hierarchical relation, which is useful e.g. when implementing a simple query expansion algorithm in a search application.
type: Property

Concept
equivalent class: reference concept
disjoint with: Concept Scheme
complement of: Nothing
disjoint with: Collection
complement of: Collection
subclass of: Thing
equivalent class: http://lodlaundromat.org/.well-known/genid/1c057c878c7c3a3a1a60afec0f9c51a2#1
disjoint with: Nothing
subclass of: http://lodlaundromat.org/.well-known/genid/1c057c878c7c3a3a1a60afec0f9c51a2#1
equivalent class: Thing
disjoint with: Ordered Collection
complement of: Concept Scheme
complement of: Ordered Collection
subclass of: reference concept
type: Class
definition: An idea or notion; a unit of thought.

Automatic - Not Specified
type: reference concept
type: Concept
type: Thing
type: http://lodlaundromat.org/.well-known/genid/1c057c878c7c3a3a1a60afec0f9c51a2#1
type: qualifier
type: NamedIndividual
preferred label: Mapping based on automatic scoring of concepts using a script or technique not otherwise specified.

visual information
subclass of: http://lodlaundromat.org/.well-known/genid/2dd581c251e9628cd06f7f0e006f321f#23
disjoint with: http://lodlaundromat.org/.well-known/genid/2dd581c251e9628cd06f7f0e006f321f#1
disjoint with: organizations
disjoint with: geopolitical
disjoint with: protists fungus
subclass of: http://lodlaundromat.org/.well-known/genid/2dd581c251e9628cd06f7f0e006f321f#260
disjoint with: numbers
disjoint with: food or drink
subclass of: http://lodlaundromat.org/.well-known/genid/2dd581c251e9628cd06f7f0e006f321f#141
disjoint with: Ordered Collection
disjoint with: workplaces
subclass of: http://lodlaundromat.org/.well-known/genid/2dd581c251e9628cd06f7f0e006f321f#70
subclass of: http://lodlaundromat.org/.well-known/genid/2dd581c251e9628cd06f7f0e006f321f#344
disjoint with: chemistry
subclass of: http://lodlaundromat.org/.well-known/genid/2dd581c251e9628cd06f7f0e006f321f#511
subclass of: http://lodlaundromat.org/.well-known/genid/2dd581c251e9628cd06f7f0e006f321f#371
type: Class
disjoint with: Nothing
subclass of: http://lodlaundromat.org/.well-known/genid/1c057c878c7c3a3a1a60afec0f9c51a2#1
subclass of: http://lodlaundromat.org/.well-known/genid/2dd581c251e9628cd06f7f0e006f321f#240
subclass of: http://lodlaundromat.org/.well-known/genid/2dd581c251e9628cd06f7f0e006f321f#93
disjoint with: drugs
disjoint with: http://lodlaundromat.org/.well-known/genid/2dd581c251e9628cd06f7f0e006f321f#584
disjoint with: Concept Scheme
subclass of: http://lodlaundromat.org/.well-known/genid/2dd581c251e9628cd06f7f0e006f321f#602
subclass of: http://lodlaundromat.org/.well-known/genid/2dd581c251e9628cd06f7f0e006f321f#484
subclass of: http://lodlaundromat.org/.well-known/genid/2dd581c251e9628cd06f7f0e006f321f#556
disjoint with: plants
subclass of: http://lodlaundromat.org/.well-known/genid/2dd581c251e9628cd06f7f0e006f321f#118
subclass of: http://lodlaundromat.org/.well-known/genid/2dd581c251e9628cd06f7f0e006f321f#419
disjoint with: prokaryotes
disjoint with: society
subclass of: SuperType
disjoint with: Collection
subclass of: reference concept
disjoint with: natural substance
disjoint with: diseases
disjoint with: animals
disjoint with: fnance and economy
subclass of: Concept
subclass of: Thing
subclass of: http://lodlaundromat.org/.well-known/genid/2dd581c251e9628cd06f7f0e006f321f#457
subclass of: http://lodlaundromat.org/.well-known/genid/2dd581c251e9628cd06f7f0e006f321f#223
disjoint with: time
subclass of: http://lodlaundromat.org/.well-known/genid/2dd581c251e9628cd06f7f0e006f321f#393
disjoint with: person types
disjoint with: earthscape
subclass of: http://lodlaundromat.org/.well-known/genid/2dd581c251e9628cd06f7f0e006f321f#306
definition: any still image or picture or streaming video human work, with or without audio. Examples include graphics, pictures, movies, TV shows, individual shows from a TV show, etc.

has topic
sub property of: topObjectProperty
property disjoint with: has member list
property disjoint with: has top concept
property disjoint with: bottomObjectProperty
property disjoint with: has member
type: ObjectProperty
domain: Thing
range: topics categories
definition: This predicate relates an external entity to the SuperType (ST) shown. It indicates there is a relationship to the ST of a verifiable nature, but which is undetermined as to strength or a full rdf:type relationship

has broader match
property disjoint with: has member list
property disjoint with: is in scheme
sub property of: is in semantic relation with
type: ObjectProperty
property disjoint with: bottomObjectProperty
sub property of: topObjectProperty
sub property of: has broader transitive
property disjoint with: has top concept
property disjoint with: is top concept in scheme
sub property of: is in mapping relation with
inverse of: has narrower match
property disjoint with: has member
sub property of: has broader
definition: skos:broadMatch is used to state a hierarchical mapping link between two conceptual resources in different concept schemes.
type: Property

Ordered Collection
subclass of: numbers
subclass of: http://lodlaundromat.org/.well-known/genid/2dd581c251e9628cd06f7f0e006f321f#419
disjoint with: Extraterrestrial
subclass of: activities
complement of: reference concept
subclass of: Concept
disjoint with: visual information
disjoint with: Thing
subclass of: http://lodlaundromat.org/.well-known/genid/2dd581c251e9628cd06f7f0e006f321f#260
subclass of: facilities
disjoint with: http://lodlaundromat.org/.well-known/genid/2dd581c251e9628cd06f7f0e006f321f#556
complement of: Thing
subclass of: structured information
subclass of: http://lodlaundromat.org/.well-known/genid/2dd581c251e9628cd06f7f0e006f321f#325
disjoint with: written information
disjoint with: person types
subclass of: http://lodlaundromat.org/.well-known/genid/2dd581c251e9628cd06f7f0e006f321f#141
subclass of: reference concept
disjoint with: attributes
disjoint with: earthscape
subclass of: natural phenomena
subclass of: workplaces
subclass of: http://lodlaundromat.org/.well-known/genid/2dd581c251e9628cd06f7f0e006f321f#536
disjoint with: http://lodlaundromat.org/.well-known/genid/2dd581c251e9628cd06f7f0e006f321f#70
subclass of: Concept Scheme
disjoint with: abstract level
disjoint with: geopolitical
disjoint with: workplaces
subclass of: qualifier
disjoint with: numbers
subclass of: plants
equivalent class: Nothing
subclass of: time
disjoint with: http://lodlaundromat.org/.well-known/genid/2dd581c251e9628cd06f7f0e006f321f#141
complement of: Concept
subclass of: http://lodlaundromat.org/.well-known/genid/2dd581c251e9628cd06f7f0e006f321f#484
disjoint with: http://lodlaundromat.org/.well-known/genid/2dd581c251e9628cd06f7f0e006f321f#162
subclass of: topics categories
subclass of: visual information
disjoint with: activities
subclass of: http://lodlaundromat.org/.well-known/genid/2dd581c251e9628cd06f7f0e006f321f#162
subclass of: chemistry
subclass of: organizations
subclass of: notations
disjoint with: Class
subclass of: abstract level
disjoint with: animals
subclass of: http://lodlaundromat.org/.well-known/genid/2dd581c251e9628cd06f7f0e006f321f#511
subclass of: market industries
disjoint with: http://lodlaundromat.org/.well-known/genid/2dd581c251e9628cd06f7f0e006f321f#511
complement of: http://lodlaundromat.org/.well-known/genid/1c057c878c7c3a3a1a60afec0f9c51a2#1
subclass of: http://lodlaundromat.org/.well-known/genid/2dd581c251e9628cd06f7f0e006f321f#283
subclass of: test
subclass of: http://lodlaundromat.org/.well-known/genid/2dd581c251e9628cd06f7f0e006f321f#93
disjoint with: http://lodlaundromat.org/.well-known/genid/1c057c878c7c3a3a1a60afec0f9c51a2#1
subclass of: http://lodlaundromat.org/.well-known/genid/2dd581c251e9628cd06f7f0e006f321f#602
subclass of: http://lodlaundromat.org/.well-known/genid/2dd581c251e9628cd06f7f0e006f321f#457
subclass of: http://lodlaundromat.org/.well-known/genid/2dd581c251e9628cd06f7f0e006f321f#306
disjoint with: http://lodlaundromat.org/.well-known/genid/2dd581c251e9628cd06f7f0e006f321f#118
disjoint with: http://lodlaundromat.org/.well-known/genid/2dd581c251e9628cd06f7f0e006f321f#484
disjoint with: http://lodlaundromat.org/.well-known/genid/2dd581c251e9628cd06f7f0e006f321f#371
disjoint with: fnance and economy
subclass of: geopolitical
disjoint with: http://lodlaundromat.org/.well-known/genid/2dd581c251e9628cd06f7f0e006f321f#344
subclass of: person types
disjoint with: Concept Scheme
disjoint with: http://lodlaundromat.org/.well-known/genid/2dd581c251e9628cd06f7f0e006f321f#625
disjoint with: http://lodlaundromat.org/.well-known/genid/2dd581c251e9628cd06f7f0e006f321f#457
equivalent class: Collection
disjoint with: reference concept
disjoint with: http://lodlaundromat.org/.well-known/genid/2dd581c251e9628cd06f7f0e006f321f#23
subclass of: http://lodlaundromat.org/.well-known/genid/2dd581c251e9628cd06f7f0e006f321f#45
subclass of: society
disjoint with: http://lodlaundromat.org/.well-known/genid/2dd581c251e9628cd06f7f0e006f321f#393
disjoint with: http://lodlaundromat.org/.well-known/genid/2dd581c251e9628cd06f7f0e006f321f#445
disjoint with: http://lodlaundromat.org/.well-known/genid/2dd581c251e9628cd06f7f0e006f321f#283
subclass of: attributes
subclass of: http://lodlaundromat.org/.well-known/genid/2dd581c251e9628cd06f7f0e006f321f#223
subclass of: http://lodlaundromat.org/.well-known/genid/2dd581c251e9628cd06f7f0e006f321f#393
disjoint with: structured information

relates to structured information
property disjoint with: has workplace
property disjoint with: has food drink
property disjoint with: relates to extraterrestrial entity
property disjoint with: relates to disease
property disjoint with: relates to facility
property disjoint with: relates to natural substance
type: ObjectProperty
property disjoint with: relates to other organism
property disjoint with: has top concept
property disjoint with: relates to earthscape
property disjoint with: relates to animal
property disjoint with: relates to geopolitical entity
property disjoint with: relates to chemistry
property disjoint with: relates to society
property disjoint with: relates to plant
property disjoint with: has member
sub property of: topObjectProperty
property disjoint with: has member list
property disjoint with: has person type
property disjoint with: relates to audio information
property disjoint with: has organization type
property disjoint with: relates to drug
property disjoint with: bottomObjectProperty
property disjoint with: has time
domain: Thing
range: structured information
definition: This predicate relates an external entity to the SuperType (ST) shown. It indicates there is a relationship to the ST of a verifiable nature, but which is undetermined as to strength or a full rdf:type relationship.

structured information
subclass of: http://lodlaundromat.org/.well-known/genid/2dd581c251e9628cd06f7f0e006f321f#371
disjoint with: diseases
subclass of: http://lodlaundromat.org/.well-known/genid/2dd581c251e9628cd06f7f0e006f321f#45
disjoint with: earthscape
subclass of: http://lodlaundromat.org/.well-known/genid/2dd581c251e9628cd06f7f0e006f321f#602
subclass of: Thing
disjoint with: facilities
disjoint with: Ordered Collection
subclass of: http://lodlaundromat.org/.well-known/genid/2dd581c251e9628cd06f7f0e006f321f#484
disjoint with: workplaces
subclass of: http://lodlaundromat.org/.well-known/genid/2dd581c251e9628cd06f7f0e006f321f#93
subclass of: http://lodlaundromat.org/.well-known/genid/2dd581c251e9628cd06f7f0e006f321f#393
subclass of: http://lodlaundromat.org/.well-known/genid/2dd581c251e9628cd06f7f0e006f321f#260
disjoint with: drugs
disjoint with: person types
disjoint with: Extraterrestrial
subclass of: http://lodlaundromat.org/.well-known/genid/2dd581c251e9628cd06f7f0e006f321f#240
disjoint with: audio information
subclass of: http://lodlaundromat.org/.well-known/genid/2dd581c251e9628cd06f7f0e006f321f#141
disjoint with: organizations
type: Class
subclass of: http://lodlaundromat.org/.well-known/genid/2dd581c251e9628cd06f7f0e006f321f#177
disjoint with: time
disjoint with: Collection
disjoint with: animals
subclass of: http://lodlaundromat.org/.well-known/genid/2dd581c251e9628cd06f7f0e006f321f#23
subclass of: http://lodlaundromat.org/.well-known/genid/2dd581c251e9628cd06f7f0e006f321f#419
disjoint with: natural substance
subclass of: http://lodlaundromat.org/.well-known/genid/2dd581c251e9628cd06f7f0e006f321f#201
disjoint with: society
disjoint with: http://lodlaundromat.org/.well-known/genid/2dd581c251e9628cd06f7f0e006f321f#536
disjoint with: Concept Scheme
subclass of: reference concept
subclass of: http://lodlaundromat.org/.well-known/genid/2dd581c251e9628cd06f7f0e006f321f#511
disjoint with: protists fungus
disjoint with: prokaryotes
disjoint with: food or drink
disjoint with: Nothing
disjoint with: http://lodlaundromat.org/.well-known/genid/2dd581c251e9628cd06f7f0e006f321f#1
subclass of: http://lodlaundromat.org/.well-known/genid/2dd581c251e9628cd06f7f0e006f321f#70
subclass of: SuperType
subclass of: http://lodlaundromat.org/.well-known/genid/2dd581c251e9628cd06f7f0e006f321f#556
subclass of: Concept
subclass of: http://lodlaundromat.org/.well-known/genid/2dd581c251e9628cd06f7f0e006f321f#306
disjoint with: plants
subclass of: http://lodlaundromat.org/.well-known/genid/1c057c878c7c3a3a1a60afec0f9c51a2#1
subclass of: http://lodlaundromat.org/.well-known/genid/2dd581c251e9628cd06f7f0e006f321f#457
disjoint with: chemistry
subclass of: http://lodlaundromat.org/.well-known/genid/2dd581c251e9628cd06f7f0e006f321f#118
disjoint with: geopolitical
definition: This information SuperType is for all kinds of structured information and datasets, including compute programs, databases, files, Web pages and structured data that can be presented in tabular form

market industries
subclass of: Thing
subclass of: reference concept
subclass of: SuperType
disjoint with: Collection
type: Class
subclass of: http://lodlaundromat.org/.well-known/genid/1c057c878c7c3a3a1a60afec0f9c51a2#1
subclass of: Concept
disjoint with: Nothing
disjoint with: Concept Scheme
disjoint with: Ordered Collection
definition: This SuperType is a specialized classificatory system for markets and industries. It could be combined with the SuperType above, but is kept separate in order to provide a separate, economy-oriented system.

activities
disjoint with: drugs
disjoint with: facilities
subclass of: http://lodlaundromat.org/.well-known/genid/2dd581c251e9628cd06f7f0e006f321f#371
subclass of: reference concept
disjoint with: http://lodlaundromat.org/.well-known/genid/2dd581c251e9628cd06f7f0e006f321f#4
disjoint with: prokaryotes
subclass of: http://lodlaundromat.org/.well-known/genid/2dd581c251e9628cd06f7f0e006f321f#177
disjoint with: plants
type: Class
disjoint with: Extraterrestrial
subclass of: http://lodlaundromat.org/.well-known/genid/2dd581c251e9628cd06f7f0e006f321f#602
subclass of: Thing
disjoint with: geopolitical
disjoint with: earthscape
subclass of: http://lodlaundromat.org/.well-known/genid/2dd581c251e9628cd06f7f0e006f321f#556
disjoint with: Nothing
subclass of: http://lodlaundromat.org/.well-known/genid/2dd581c251e9628cd06f7f0e006f321f#484
disjoint with: audio information
disjoint with: animals
subclass of: http://lodlaundromat.org/.well-known/genid/2dd581c251e9628cd06f7f0e006f321f#260
subclass of: http://lodlaundromat.org/.well-known/genid/2dd581c251e9628cd06f7f0e006f321f#419
subclass of: http://lodlaundromat.org/.well-known/genid/2dd581c251e9628cd06f7f0e006f321f#141
disjoint with: numbers
disjoint with: Ordered Collection
subclass of: Concept
subclass of: http://lodlaundromat.org/.well-known/genid/2dd581c251e9628cd06f7f0e006f321f#201
disjoint with: workplaces
disjoint with: Concept Scheme
subclass of: http://lodlaundromat.org/.well-known/genid/2dd581c251e9628cd06f7f0e006f321f#23
subclass of: http://lodlaundromat.org/.well-known/genid/2dd581c251e9628cd06f7f0e006f321f#457
disjoint with: society
disjoint with: chemistry
subclass of: http://lodlaundromat.org/.well-known/genid/2dd581c251e9628cd06f7f0e006f321f#393
subclass of: http://lodlaundromat.org/.well-known/genid/2dd581c251e9628cd06f7f0e006f321f#306
subclass of: http://lodlaundromat.org/.well-known/genid/2dd581c251e9628cd06f7f0e006f321f#70
subclass of: http://lodlaundromat.org/.well-known/genid/1c057c878c7c3a3a1a60afec0f9c51a2#1
disjoint with: http://lodlaundromat.org/.well-known/genid/2dd581c251e9628cd06f7f0e006f321f#162
disjoint with: natural substance
disjoint with: organizations
disjoint with: person types
disjoint with: time
subclass of: http://lodlaundromat.org/.well-known/genid/2dd581c251e9628cd06f7f0e006f321f#344
disjoint with: protists fungus
subclass of: http://lodlaundromat.org/.well-known/genid/2dd581c251e9628cd06f7f0e006f321f#511
subclass of: SuperType
disjoint with: Collection
subclass of: http://lodlaundromat.org/.well-known/genid/2dd581c251e9628cd06f7f0e006f321f#118
subclass of: http://lodlaundromat.org/.well-known/genid/2dd581c251e9628cd06f7f0e006f321f#45
disjoint with: http://lodlaundromat.org/.well-known/genid/2dd581c251e9628cd06f7f0e006f321f#1
definition: These are ongoing activities that result (mostly) from human effort, often conducted by organizations to assist other organizations or individuals (in which case they are known as services, such as medicine, law, printing, consulting or teaching) or individual or group efforts for leisure, fun, sports, games or personal interests (activities)

is in scheme
sub property of: topObjectProperty
property disjoint with: is in semantic relation with
property disjoint with: has member
property disjoint with: has top concept
property disjoint with: has close match
property disjoint with: has exact match
property disjoint with: bottomObjectProperty
type: ObjectProperty
property disjoint with: has narrower
property disjoint with: has narrower match
property disjoint with: has broader
property disjoint with: has narrower transitive
property disjoint with: has broader match
property disjoint with: has related
property disjoint with: has related match
property disjoint with: has member list
property disjoint with: correspondsTo
property disjoint with: is in mapping relation with
property disjoint with: is about
property disjoint with: has broader transitive
definition: Relates a resource (for example a concept) to a concept scheme in which it is included.
scope note: A concept may be a member of more than one concept scheme.
range: Concept Scheme
type: Property

has person type
property disjoint with: has activity
property disjoint with: has product type
property disjoint with: relates to disease
property disjoint with: relates to geopolitical entity
property disjoint with: has member list
property disjoint with: relates to numbers
property disjoint with: relates to finance or economy
property disjoint with: relates to structured information
property disjoint with: relates to natural phenomenon
property disjoint with: has food drink
property disjoint with: relates to earthscape
property disjoint with: relates to extraterrestrial entity
property disjoint with: relates to drug
property disjoint with: relates to facility
property disjoint with: has workplace
property disjoint with: relates to chemistry
type: ObjectProperty
sub property of: topObjectProperty
property disjoint with: has notation
property disjoint with: relates to other organism
property disjoint with: has time
property disjoint with: relates to natural substance
property disjoint with: relates to audio information
property disjoint with: bottomObjectProperty
property disjoint with: has top concept
property disjoint with: relates to plant
property disjoint with: relates to visual information
property disjoint with: has event
property disjoint with: has member
domain: Thing
range: person types
definition: This predicate relates an external entity to the SuperType (ST) shown. It indicates there is a relationship to the ST of a verifiable nature, but which is undetermined as to strength or a full rdf:type relationship

has narrower transitive
sub property of: topObjectProperty
property disjoint with: has member
property disjoint with: has member list
type: TransitiveProperty
property disjoint with: is top concept in scheme
inverse of: has broader transitive
property disjoint with: has top concept
property disjoint with: is in scheme
property disjoint with: bottomObjectProperty
type: ObjectProperty
sub property of: is in semantic relation with
definition: skos:narrowerTransitive is a transitive superproperty of skos:narrower.
scope note: By convention, skos:narrowerTransitive is not used to make assertions. Rather, the properties can be used to draw inferences about the transitive closure of the hierarchical relation, which is useful e.g. when implementing a simple query expansion algorithm in a search application.
type: Property

is about
property disjoint with: has member
property disjoint with: has member list
sub property of: topObjectProperty
property disjoint with: bottomObjectProperty
type: ObjectProperty
property disjoint with: is top concept in scheme
property disjoint with: has top concept
property disjoint with: is in scheme
inverse of: links entity
domain: Thing
range: reference concept
definition: The property umbel:isAbout is used to assert the relation between a named entity (individual) and a Reference Concept class. umbel:isAbout relates the named entity (individual) to the class through the basis of its subject matter. The relation acknowledges that the scope of the class can not be determined solely by the aggregation or extent of its associated individual entity members, and that the nature of the Reference Concept class may not alone bound or define the individual entity. This property is therefore used to create a topical assertion between an individual and a Reference Concept.

chemistry
disjoint with: written information
disjoint with: organizations
subclass of: http://lodlaundromat.org/.well-known/genid/2dd581c251e9628cd06f7f0e006f321f#45
disjoint with: protists fungus
disjoint with: activities
subclass of: http://lodlaundromat.org/.well-known/genid/2dd581c251e9628cd06f7f0e006f321f#4
disjoint with: person types
subclass of: http://lodlaundromat.org/.well-known/genid/2dd581c251e9628cd06f7f0e006f321f#371
disjoint with: Ordered Collection
disjoint with: workplaces
disjoint with: http://lodlaundromat.org/.well-known/genid/2dd581c251e9628cd06f7f0e006f321f#445
disjoint with: fnance and economy
disjoint with: Nothing
subclass of: Thing
disjoint with: visual information
subclass of: http://lodlaundromat.org/.well-known/genid/2dd581c251e9628cd06f7f0e006f321f#177
disjoint with: diseases
disjoint with: plants
subclass of: http://lodlaundromat.org/.well-known/genid/2dd581c251e9628cd06f7f0e006f321f#602
subclass of: http://lodlaundromat.org/.well-known/genid/1c057c878c7c3a3a1a60afec0f9c51a2#1
disjoint with: http://lodlaundromat.org/.well-known/genid/2dd581c251e9628cd06f7f0e006f321f#240
disjoint with: earthscape
disjoint with: Extraterrestrial
subclass of: http://lodlaundromat.org/.well-known/genid/2dd581c251e9628cd06f7f0e006f321f#93
subclass of: http://lodlaundromat.org/.well-known/genid/2dd581c251e9628cd06f7f0e006f321f#419
disjoint with: audio information
disjoint with: http://lodlaundromat.org/.well-known/genid/2dd581c251e9628cd06f7f0e006f321f#70
subclass of: http://lodlaundromat.org/.well-known/genid/2dd581c251e9628cd06f7f0e006f321f#344
disjoint with: natural phenomena
subclass of: http://lodlaundromat.org/.well-known/genid/2dd581c251e9628cd06f7f0e006f321f#625
subclass of: http://lodlaundromat.org/.well-known/genid/2dd581c251e9628cd06f7f0e006f321f#484
disjoint with: prokaryotes
subclass of: http://lodlaundromat.org/.well-known/genid/2dd581c251e9628cd06f7f0e006f321f#141
subclass of: SuperType
disjoint with: time
disjoint with: society
disjoint with: numbers
subclass of: reference concept
subclass of: http://lodlaundromat.org/.well-known/genid/2dd581c251e9628cd06f7f0e006f321f#260
subclass of: http://lodlaundromat.org/.well-known/genid/2dd581c251e9628cd06f7f0e006f321f#393
subclass of: Concept
disjoint with: facilities
disjoint with: Concept Scheme
subclass of: http://lodlaundromat.org/.well-known/genid/2dd581c251e9628cd06f7f0e006f321f#457
disjoint with: geopolitical
disjoint with: notations
type: Class
subclass of: http://lodlaundromat.org/.well-known/genid/2dd581c251e9628cd06f7f0e006f321f#556
subclass of: http://lodlaundromat.org/.well-known/genid/2dd581c251e9628cd06f7f0e006f321f#511
subclass of: http://lodlaundromat.org/.well-known/genid/2dd581c251e9628cd06f7f0e006f321f#201
subclass of: http://lodlaundromat.org/.well-known/genid/2dd581c251e9628cd06f7f0e006f321f#283
disjoint with: Collection
subclass of: http://lodlaundromat.org/.well-known/genid/2dd581c251e9628cd06f7f0e006f321f#223
disjoint with: structured information
subclass of: http://lodlaundromat.org/.well-known/genid/2dd581c251e9628cd06f7f0e006f321f#536
disjoint with: http://lodlaundromat.org/.well-known/genid/2dd581c251e9628cd06f7f0e006f321f#1
definition: This SuperType is a residual category (n.o.c., not otherwise categorized) for chemical bonds, chemical composition groupings, and the like. It is formed by what is not a natural substance or living thing (organic) substance.

relates to extraterrestrial entity
property disjoint with: has member
property disjoint with: relates to numbers
property disjoint with: has notation
property disjoint with: relates to facility
property disjoint with: has food drink
property disjoint with: relates to chemistry
property disjoint with: relates to audio information
sub property of: topObjectProperty
property disjoint with: has activity
property disjoint with: has top concept
property disjoint with: relates to drug
property disjoint with: has organization type
property disjoint with: relates to plant
property disjoint with: has product type
property disjoint with: relates to society
property disjoint with: has time
property disjoint with: has member list
property disjoint with: relates to animal
property disjoint with: relates to geopolitical entity
property disjoint with: relates to other organism
property disjoint with: relates to structured information
type: ObjectProperty
property disjoint with: bottomObjectProperty
property disjoint with: relates to disease
property disjoint with: has person type
property disjoint with: has workplace
property disjoint with: relates to finance or economy
domain: Thing
range: Extraterrestrial
definition: This predicate relates an external entity to the SuperType (ST) shown. It indicates there is a relationship to the ST of a verifiable nature, but which is undetermined as to strength or a full rdf:type relationship.

Heuristic - Not Specified
type: reference concept
type: Concept
type: Thing
type: http://lodlaundromat.org/.well-known/genid/1c057c878c7c3a3a1a60afec0f9c51a2#1
type: qualifier
type: NamedIndividual
definition: Heuristic mapping method applied; script or technique not otherwise specified.

products
disjoint with: Nothing
subclass of: http://lodlaundromat.org/.well-known/genid/2dd581c251e9628cd06f7f0e006f321f#511
type: Class
subclass of: http://lodlaundromat.org/.well-known/genid/2dd581c251e9628cd06f7f0e006f321f#556
subclass of: http://lodlaundromat.org/.well-known/genid/2dd581c251e9628cd06f7f0e006f321f#457
disjoint with: http://lodlaundromat.org/.well-known/genid/2dd581c251e9628cd06f7f0e006f321f#1
subclass of: http://lodlaundromat.org/.well-known/genid/2dd581c251e9628cd06f7f0e006f321f#93
disjoint with: society
disjoint with: protists fungus
disjoint with: Collection
subclass of: http://lodlaundromat.org/.well-known/genid/1c057c878c7c3a3a1a60afec0f9c51a2#1
disjoint with: time
disjoint with: natural phenomena
disjoint with: diseases
disjoint with: Extraterrestrial
subclass of: http://lodlaundromat.org/.well-known/genid/2dd581c251e9628cd06f7f0e006f321f#344
disjoint with: person types
subclass of: http://lodlaundromat.org/.well-known/genid/2dd581c251e9628cd06f7f0e006f321f#283
disjoint with: organizations
subclass of: http://lodlaundromat.org/.well-known/genid/2dd581c251e9628cd06f7f0e006f321f#260
disjoint with: numbers
subclass of: Concept
disjoint with: geopolitical
disjoint with: prokaryotes
disjoint with: Concept Scheme
disjoint with: Ordered Collection
subclass of: Thing
subclass of: http://lodlaundromat.org/.well-known/genid/2dd581c251e9628cd06f7f0e006f321f#371
subclass of: SuperType
subclass of: reference concept
subclass of: http://lodlaundromat.org/.well-known/genid/2dd581c251e9628cd06f7f0e006f321f#177
subclass of: http://lodlaundromat.org/.well-known/genid/2dd581c251e9628cd06f7f0e006f321f#393
subclass of: http://lodlaundromat.org/.well-known/genid/2dd581c251e9628cd06f7f0e006f321f#484
disjoint with: http://lodlaundromat.org/.well-known/genid/2dd581c251e9628cd06f7f0e006f321f#445
definition: This is the largest SuperType and includes any instance offered for sale or performed as a commercial service. Often physical object made by humans that is not a conceptual work or a facility, such as vehicles, cars, trains, aircraft, spaceships, ships, foods, beverages, clothes, drugs, weapons. Products also include the concept of 'state' (e/g/., on/off)

has organization type
property disjoint with: has product type
property disjoint with: relates to facility
property disjoint with: relates to numbers
property disjoint with: relates to structured information
property disjoint with: relates to chemistry
property disjoint with: has food drink
property disjoint with: has activity
property disjoint with: has member
property disjoint with: relates to plant
sub property of: topObjectProperty
property disjoint with: relates to audio information
property disjoint with: relates to other organism
property disjoint with: relates to extraterrestrial entity
property disjoint with: relates to drug
property disjoint with: has top concept
property disjoint with: relates to disease
property disjoint with: relates to natural phenomenon
property disjoint with: has notation
property disjoint with: relates to natural substance
property disjoint with: has event
property disjoint with: bottomObjectProperty
property disjoint with: relates to visual information
type: ObjectProperty
property disjoint with: has time
property disjoint with: has member list
domain: Thing
range: organizations
definition: This predicate relates an external entity to the SuperType (ST) shown. It indicates there is a relationship to the ST of a verifiable nature, but which is undetermined as to strength or a full rdf:type relationship

prokaryotes
disjoint with: geopolitical
disjoint with: organizations
disjoint with: animals
disjoint with: events
subclass of: http://lodlaundromat.org/.well-known/genid/2dd581c251e9628cd06f7f0e006f321f#511
disjoint with: Extraterrestrial
disjoint with: facilities
subclass of: http://lodlaundromat.org/.well-known/genid/2dd581c251e9628cd06f7f0e006f321f#445
subclass of: http://lodlaundromat.org/.well-known/genid/2dd581c251e9628cd06f7f0e006f321f#141
disjoint with: time
subclass of: http://lodlaundromat.org/.well-known/genid/2dd581c251e9628cd06f7f0e006f321f#419
disjoint with: fnance and economy
disjoint with: activities
subclass of: http://lodlaundromat.org/.well-known/genid/2dd581c251e9628cd06f7f0e006f321f#325
subclass of: http://lodlaundromat.org/.well-known/genid/2dd581c251e9628cd06f7f0e006f321f#536
subclass of: http://lodlaundromat.org/.well-known/genid/2dd581c251e9628cd06f7f0e006f321f#23
subclass of: http://lodlaundromat.org/.well-known/genid/2dd581c251e9628cd06f7f0e006f321f#201
disjoint with: society
disjoint with: visual information
subclass of: http://lodlaundromat.org/.well-known/genid/2dd581c251e9628cd06f7f0e006f321f#556
subclass of: Thing
subclass of: http://lodlaundromat.org/.well-known/genid/2dd581c251e9628cd06f7f0e006f321f#584
subclass of: http://lodlaundromat.org/.well-known/genid/2dd581c251e9628cd06f7f0e006f321f#625
disjoint with: workplaces
disjoint with: audio information
subclass of: http://lodlaundromat.org/.well-known/genid/2dd581c251e9628cd06f7f0e006f321f#240
subclass of: http://lodlaundromat.org/.well-known/genid/2dd581c251e9628cd06f7f0e006f321f#177
disjoint with: Collection
subclass of: SuperType
subclass of: http://lodlaundromat.org/.well-known/genid/2dd581c251e9628cd06f7f0e006f321f#70
disjoint with: drugs
disjoint with: notations
disjoint with: Ordered Collection
subclass of: http://lodlaundromat.org/.well-known/genid/2dd581c251e9628cd06f7f0e006f321f#344
subclass of: http://lodlaundromat.org/.well-known/genid/2dd581c251e9628cd06f7f0e006f321f#393
disjoint with: Nothing
subclass of: http://lodlaundromat.org/.well-known/genid/2dd581c251e9628cd06f7f0e006f321f#306
subclass of: http://lodlaundromat.org/.well-known/genid/2dd581c251e9628cd06f7f0e006f321f#223
subclass of: reference concept
disjoint with: chemistry
disjoint with: http://lodlaundromat.org/.well-known/genid/2dd581c251e9628cd06f7f0e006f321f#484
subclass of: http://lodlaundromat.org/.well-known/genid/2dd581c251e9628cd06f7f0e006f321f#602
disjoint with: natural substance
subclass of: Concept
subclass of: http://lodlaundromat.org/.well-known/genid/2dd581c251e9628cd06f7f0e006f321f#283
disjoint with: earthscape
disjoint with: Concept Scheme
subclass of: http://lodlaundromat.org/.well-known/genid/2dd581c251e9628cd06f7f0e006f321f#371
subclass of: http://lodlaundromat.org/.well-known/genid/2dd581c251e9628cd06f7f0e006f321f#45
disjoint with: numbers
disjoint with: natural phenomena
subclass of: http://lodlaundromat.org/.well-known/genid/2dd581c251e9628cd06f7f0e006f321f#118
subclass of: http://lodlaundromat.org/.well-known/genid/2dd581c251e9628cd06f7f0e006f321f#93
disjoint with: products
type: Class
subclass of: http://lodlaundromat.org/.well-known/genid/2dd581c251e9628cd06f7f0e006f321f#260
disjoint with: food or drink
disjoint with: person types
disjoint with: written information
disjoint with: plants
subclass of: http://lodlaundromat.org/.well-known/genid/2dd581c251e9628cd06f7f0e006f321f#4
disjoint with: http://lodlaundromat.org/.well-known/genid/2dd581c251e9628cd06f7f0e006f321f#457
subclass of: http://lodlaundromat.org/.well-known/genid/2dd581c251e9628cd06f7f0e006f321f#1
disjoint with: structured information
disjoint with: diseases
subclass of: http://lodlaundromat.org/.well-known/genid/1c057c878c7c3a3a1a60afec0f9c51a2#1
subclass of: http://lodlaundromat.org/.well-known/genid/2dd581c251e9628cd06f7f0e006f321f#162
definition: The Prokaryotes include all prokaryotic organisms, including the Monera, Archaebacteria, Bacteria, and Blue-green algas. Also included in this SuperType are viruses and prions.

SuperType
disjoint with: Collection
type: Class
subclass of: http://lodlaundromat.org/.well-known/genid/1c057c878c7c3a3a1a60afec0f9c51a2#1
subclass of: reference concept
disjoint with: Nothing
disjoint with: Concept Scheme
disjoint with: Ordered Collection
subclass of: Concept
subclass of: Thing
alternative label: test
definition: SuperTypes are a collection of (mostly) similar Reference Concepts. Most of the SuperType classes have been designed to be (mostly) disjoint from the other SuperType classes. SuperTypes thus provide a higher-level of clustering and organization of Reference Concepts for use in user interfaces and for reasoning purposes.

protists fungus
subclass of: http://lodlaundromat.org/.well-known/genid/2dd581c251e9628cd06f7f0e006f321f#445
type: Class
subclass of: http://lodlaundromat.org/.well-known/genid/2dd581c251e9628cd06f7f0e006f321f#325
disjoint with: written information
disjoint with: numbers
subclass of: http://lodlaundromat.org/.well-known/genid/2dd581c251e9628cd06f7f0e006f321f#23
disjoint with: natural substance
disjoint with: Collection
subclass of: http://lodlaundromat.org/.well-known/genid/2dd581c251e9628cd06f7f0e006f321f#162
subclass of: http://lodlaundromat.org/.well-known/genid/2dd581c251e9628cd06f7f0e006f321f#419
disjoint with: http://lodlaundromat.org/.well-known/genid/2dd581c251e9628cd06f7f0e006f321f#484
disjoint with: organizations
subclass of: http://lodlaundromat.org/.well-known/genid/2dd581c251e9628cd06f7f0e006f321f#283
disjoint with: facilities
subclass of: http://lodlaundromat.org/.well-known/genid/2dd581c251e9628cd06f7f0e006f321f#344
subclass of: http://lodlaundromat.org/.well-known/genid/2dd581c251e9628cd06f7f0e006f321f#556
disjoint with: time
subclass of: http://lodlaundromat.org/.well-known/genid/2dd581c251e9628cd06f7f0e006f321f#1
disjoint with: person types
subclass of: http://lodlaundromat.org/.well-known/genid/2dd581c251e9628cd06f7f0e006f321f#201
disjoint with: society
subclass of: http://lodlaundromat.org/.well-known/genid/2dd581c251e9628cd06f7f0e006f321f#393
disjoint with: fnance and economy
disjoint with: earthscape
disjoint with: animals
subclass of: http://lodlaundromat.org/.well-known/genid/2dd581c251e9628cd06f7f0e006f321f#625
disjoint with: natural phenomena
disjoint with: audio information
subclass of: http://lodlaundromat.org/.well-known/genid/2dd581c251e9628cd06f7f0e006f321f#70
disjoint with: Nothing
subclass of: http://lodlaundromat.org/.well-known/genid/2dd581c251e9628cd06f7f0e006f321f#45
disjoint with: products
subclass of: http://lodlaundromat.org/.well-known/genid/2dd581c251e9628cd06f7f0e006f321f#260
subclass of: http://lodlaundromat.org/.well-known/genid/1c057c878c7c3a3a1a60afec0f9c51a2#1
disjoint with: activities
disjoint with: workplaces
disjoint with: plants
subclass of: http://lodlaundromat.org/.well-known/genid/2dd581c251e9628cd06f7f0e006f321f#536
subclass of: http://lodlaundromat.org/.well-known/genid/2dd581c251e9628cd06f7f0e006f321f#177
subclass of: reference concept
subclass of: http://lodlaundromat.org/.well-known/genid/2dd581c251e9628cd06f7f0e006f321f#602
disjoint with: structured information
subclass of: http://lodlaundromat.org/.well-known/genid/2dd581c251e9628cd06f7f0e006f321f#371
disjoint with: Extraterrestrial
disjoint with: notations
subclass of: http://lodlaundromat.org/.well-known/genid/2dd581c251e9628cd06f7f0e006f321f#4
subclass of: http://lodlaundromat.org/.well-known/genid/2dd581c251e9628cd06f7f0e006f321f#511
disjoint with: geopolitical
subclass of: http://lodlaundromat.org/.well-known/genid/2dd581c251e9628cd06f7f0e006f321f#93
disjoint with: Concept Scheme
subclass of: SuperType
subclass of: Thing
subclass of: http://lodlaundromat.org/.well-known/genid/2dd581c251e9628cd06f7f0e006f321f#141
disjoint with: events
subclass of: http://lodlaundromat.org/.well-known/genid/2dd581c251e9628cd06f7f0e006f321f#306
subclass of: http://lodlaundromat.org/.well-known/genid/2dd581c251e9628cd06f7f0e006f321f#584
disjoint with: diseases
disjoint with: Ordered Collection
disjoint with: chemistry
subclass of: http://lodlaundromat.org/.well-known/genid/2dd581c251e9628cd06f7f0e006f321f#223
subclass of: Concept
disjoint with: visual information
definition: This is the remaining cluster of eukaryotic organisms, specifically including the fungus and the protista (protozoans and slime molds).

has narrower match
property disjoint with: has member
sub property of: has narrower
property disjoint with: bottomObjectProperty
inverse of: has broader match
sub property of: has narrower transitive
sub property of: is in semantic relation with
sub property of: is in mapping relation with
type: ObjectProperty
property disjoint with: is in scheme
property disjoint with: is top concept in scheme
property disjoint with: has member list
property disjoint with: has top concept
sub property of: topObjectProperty
definition: skos:narrowMatch is used to state a hierarchical mapping link between two conceptual resources in different concept schemes.
type: Property

Automatic - Inspected SV
type: reference concept
type: Concept
type: Thing
type: http://lodlaundromat.org/.well-known/genid/1c057c878c7c3a3a1a60afec0f9c51a2#1
type: qualifier
type: NamedIndividual
definition: Mapping based on automatic scoring of concepts using Semantic Vectors, with specific alignment choice based on hand selection.

has workplace
property disjoint with: has member list
property disjoint with: relates to chemistry
property disjoint with: relates to structured information
property disjoint with: has event
property disjoint with: relates to natural substance
property disjoint with: has person type
property disjoint with: relates to drug
property disjoint with: relates to audio information
property disjoint with: bottomObjectProperty
property disjoint with: relates to plant
property disjoint with: has notation
property disjoint with: relates to disease
property disjoint with: has food drink
property disjoint with: has top concept
property disjoint with: relates to society
property disjoint with: relates to animal
sub property of: topObjectProperty
type: ObjectProperty
property disjoint with: relates to visual information
property disjoint with: has time
property disjoint with: relates to other organism
property disjoint with: relates to natural phenomenon
property disjoint with: relates to extraterrestrial entity
property disjoint with: has member
property disjoint with: relates to numbers
property disjoint with: has activity
domain: Thing
range: workplaces
definition: This predicate relates an external entity to the SuperType (ST) shown. It indicates there is a relationship to the ST of a verifiable nature, but which is undetermined as to strength or a full rdf:type relationship

relates to market or industry
sub property of: topObjectProperty
property disjoint with: has member list
property disjoint with: has top concept
property disjoint with: bottomObjectProperty
property disjoint with: has member
type: ObjectProperty
domain: Thing
range: market industries
definition: This predicate relates an external entity to the SuperType (ST) shown. It indicates there is a relationship to the ST of a verifiable nature, but which is undetermined as to strength or a full rdf:type relationship.

time
subclass of: http://lodlaundromat.org/.well-known/genid/2dd581c251e9628cd06f7f0e006f321f#371
subclass of: http://lodlaundromat.org/.well-known/genid/2dd581c251e9628cd06f7f0e006f321f#45
subclass of: http://lodlaundromat.org/.well-known/genid/2dd581c251e9628cd06f7f0e006f321f#457
subclass of: Thing
disjoint with: written information
subclass of: SuperType
disjoint with: earthscape
disjoint with: http://lodlaundromat.org/.well-known/genid/2dd581c251e9628cd06f7f0e006f321f#162
subclass of: http://lodlaundromat.org/.well-known/genid/2dd581c251e9628cd06f7f0e006f321f#584
disjoint with: organizations
disjoint with: Nothing
disjoint with: http://lodlaundromat.org/.well-known/genid/2dd581c251e9628cd06f7f0e006f321f#1
disjoint with: chemistry
subclass of: http://lodlaundromat.org/.well-known/genid/2dd581c251e9628cd06f7f0e006f321f#306
subclass of: http://lodlaundromat.org/.well-known/genid/2dd581c251e9628cd06f7f0e006f321f#484
disjoint with: food or drink
subclass of: http://lodlaundromat.org/.well-known/genid/2dd581c251e9628cd06f7f0e006f321f#344
disjoint with: protists fungus
type: Class
disjoint with: workplaces
disjoint with: fnance and economy
disjoint with: Extraterrestrial
disjoint with: diseases
subclass of: http://lodlaundromat.org/.well-known/genid/2dd581c251e9628cd06f7f0e006f321f#201
disjoint with: http://lodlaundromat.org/.well-known/genid/2dd581c251e9628cd06f7f0e006f321f#556
disjoint with: notations
subclass of: http://lodlaundromat.org/.well-known/genid/2dd581c251e9628cd06f7f0e006f321f#23
subclass of: http://lodlaundromat.org/.well-known/genid/2dd581c251e9628cd06f7f0e006f321f#283
subclass of: http://lodlaundromat.org/.well-known/genid/2dd581c251e9628cd06f7f0e006f321f#393
subclass of: http://lodlaundromat.org/.well-known/genid/2dd581c251e9628cd06f7f0e006f321f#325
disjoint with: natural substance
disjoint with: numbers
subclass of: http://lodlaundromat.org/.well-known/genid/1c057c878c7c3a3a1a60afec0f9c51a2#1
subclass of: http://lodlaundromat.org/.well-known/genid/2dd581c251e9628cd06f7f0e006f321f#625
subclass of: http://lodlaundromat.org/.well-known/genid/2dd581c251e9628cd06f7f0e006f321f#118
subclass of: http://lodlaundromat.org/.well-known/genid/2dd581c251e9628cd06f7f0e006f321f#260
disjoint with: Concept Scheme
disjoint with: structured information
subclass of: http://lodlaundromat.org/.well-known/genid/2dd581c251e9628cd06f7f0e006f321f#511
disjoint with: plants
subclass of: http://lodlaundromat.org/.well-known/genid/2dd581c251e9628cd06f7f0e006f321f#445
subclass of: http://lodlaundromat.org/.well-known/genid/2dd581c251e9628cd06f7f0e006f321f#93
subclass of: http://lodlaundromat.org/.well-known/genid/2dd581c251e9628cd06f7f0e006f321f#177
subclass of: http://lodlaundromat.org/.well-known/genid/2dd581c251e9628cd06f7f0e006f321f#602
disjoint with: drugs
disjoint with: animals
disjoint with: products
disjoint with: Collection
subclass of: http://lodlaundromat.org/.well-known/genid/2dd581c251e9628cd06f7f0e006f321f#70
disjoint with: activities
disjoint with: person types
subclass of: http://lodlaundromat.org/.well-known/genid/2dd581c251e9628cd06f7f0e006f321f#141
disjoint with: geopolitical
disjoint with: natural phenomena
subclass of: Concept
disjoint with: Ordered Collection
disjoint with: facilities
disjoint with: society
subclass of: http://lodlaundromat.org/.well-known/genid/2dd581c251e9628cd06f7f0e006f321f#240
subclass of: http://lodlaundromat.org/.well-known/genid/2dd581c251e9628cd06f7f0e006f321f#4
subclass of: http://lodlaundromat.org/.well-known/genid/2dd581c251e9628cd06f7f0e006f321f#223
subclass of: http://lodlaundromat.org/.well-known/genid/2dd581c251e9628cd06f7f0e006f321f#419
disjoint with: audio information
subclass of: reference concept
disjoint with: prokaryotes
disjoint with: visual information
subclass of: http://lodlaundromat.org/.well-known/genid/2dd581c251e9628cd06f7f0e006f321f#536
definition: This SuperType is for specific time or date or period (such as eras, or days, weeks, months type intervals) references in various formats

notation
sub property of: topDataProperty
property disjoint with: bottomDataProperty
type: DatatypeProperty
definition: A notation, also known as classification code, is a string of characters such as "T58.5" or "303.4833" used to uniquely identify a concept within the scope of a given concept scheme.
scope note: By convention, skos:notation is used with a typed literal in the object position of the triple.
type: Property

person types
subclass of: http://lodlaundromat.org/.well-known/genid/2dd581c251e9628cd06f7f0e006f321f#283
subclass of: http://lodlaundromat.org/.well-known/genid/2dd581c251e9628cd06f7f0e006f321f#457
subclass of: http://lodlaundromat.org/.well-known/genid/2dd581c251e9628cd06f7f0e006f321f#584
disjoint with: plants
subclass of: http://lodlaundromat.org/.well-known/genid/2dd581c251e9628cd06f7f0e006f321f#201
disjoint with: drugs
disjoint with: diseases
disjoint with: http://lodlaundromat.org/.well-known/genid/2dd581c251e9628cd06f7f0e006f321f#371
disjoint with: http://lodlaundromat.org/.well-known/genid/2dd581c251e9628cd06f7f0e006f321f#1
subclass of: http://lodlaundromat.org/.well-known/genid/2dd581c251e9628cd06f7f0e006f321f#419
subclass of: reference concept
disjoint with: products
disjoint with: events
disjoint with: food or drink
subclass of: http://lodlaundromat.org/.well-known/genid/2dd581c251e9628cd06f7f0e006f321f#223
disjoint with: protists fungus
disjoint with: notations
disjoint with: http://lodlaundromat.org/.well-known/genid/2dd581c251e9628cd06f7f0e006f321f#23
subclass of: http://lodlaundromat.org/.well-known/genid/2dd581c251e9628cd06f7f0e006f321f#484
subclass of: Concept
disjoint with: Concept Scheme
subclass of: http://lodlaundromat.org/.well-known/genid/2dd581c251e9628cd06f7f0e006f321f#602
disjoint with: Collection
disjoint with: Nothing
disjoint with: Ordered Collection
disjoint with: facilities
subclass of: http://lodlaundromat.org/.well-known/genid/2dd581c251e9628cd06f7f0e006f321f#141
disjoint with: fnance and economy
disjoint with: chemistry
disjoint with: natural phenomena
subclass of: http://lodlaundromat.org/.well-known/genid/2dd581c251e9628cd06f7f0e006f321f#325
subclass of: http://lodlaundromat.org/.well-known/genid/2dd581c251e9628cd06f7f0e006f321f#625
disjoint with: natural substance
subclass of: http://lodlaundromat.org/.well-known/genid/2dd581c251e9628cd06f7f0e006f321f#306
type: Class
disjoint with: structured information
subclass of: http://lodlaundromat.org/.well-known/genid/2dd581c251e9628cd06f7f0e006f321f#162
subclass of: http://lodlaundromat.org/.well-known/genid/2dd581c251e9628cd06f7f0e006f321f#45
subclass of: http://lodlaundromat.org/.well-known/genid/2dd581c251e9628cd06f7f0e006f321f#70
disjoint with: workplaces
disjoint with: written information
subclass of: http://lodlaundromat.org/.well-known/genid/2dd581c251e9628cd06f7f0e006f321f#556
disjoint with: Extraterrestrial
subclass of: http://lodlaundromat.org/.well-known/genid/2dd581c251e9628cd06f7f0e006f321f#93
disjoint with: http://lodlaundromat.org/.well-known/genid/2dd581c251e9628cd06f7f0e006f321f#393
disjoint with: time
subclass of: http://lodlaundromat.org/.well-known/genid/2dd581c251e9628cd06f7f0e006f321f#177
subclass of: http://lodlaundromat.org/.well-known/genid/2dd581c251e9628cd06f7f0e006f321f#118
disjoint with: audio information
disjoint with: prokaryotes
subclass of: http://lodlaundromat.org/.well-known/genid/2dd581c251e9628cd06f7f0e006f321f#260
disjoint with: earthscape
subclass of: http://lodlaundromat.org/.well-known/genid/2dd581c251e9628cd06f7f0e006f321f#4
disjoint with: geopolitical
subclass of: SuperType
subclass of: http://lodlaundromat.org/.well-known/genid/2dd581c251e9628cd06f7f0e006f321f#536
subclass of: Thing
disjoint with: activities
subclass of: http://lodlaundromat.org/.well-known/genid/2dd581c251e9628cd06f7f0e006f321f#445
subclass of: http://lodlaundromat.org/.well-known/genid/2dd581c251e9628cd06f7f0e006f321f#240
disjoint with: numbers
disjoint with: visual information
disjoint with: http://lodlaundromat.org/.well-known/genid/2dd581c251e9628cd06f7f0e006f321f#511
subclass of: http://lodlaundromat.org/.well-known/genid/1c057c878c7c3a3a1a60afec0f9c51a2#1
subclass of: http://lodlaundromat.org/.well-known/genid/2dd581c251e9628cd06f7f0e006f321f#344
preferred label: The appropriate SuperType for all named, individual human beings. This SuperType also includes the assignment of formal, honorific or cultural titles given to specific human individuals. It further includes names given to humans who conduct specific jobs or activities (the latter case is known as an avocation). Examples include steelworker, waitress, lawyer, plumber, artisan. Ethnic groups are specifically included.

abstract level
disjoint with: Ordered Collection
subclass of: SuperType
disjoint with: Concept Scheme
disjoint with: Collection
subclass of: reference concept
type: Class
subclass of: http://lodlaundromat.org/.well-known/genid/1c057c878c7c3a3a1a60afec0f9c51a2#1
disjoint with: Nothing
subclass of: Thing
subclass of: Concept
definition: This general SuperType category is largely composed of former AbstractConcepts, and represent some of the more abstract upper-level nodes for connecting the UMBEL structure together. This SuperType also includes theories or processes or methods for humans to do stuff or any human technology

relates to disease
property disjoint with: relates to drug
property disjoint with: has food drink
property disjoint with: has notation
property disjoint with: relates to chemistry
property disjoint with: has top concept
property disjoint with: relates to extraterrestrial entity
property disjoint with: relates to structured information
property disjoint with: has workplace
property disjoint with: relates to natural substance
property disjoint with: relates to plant
type: ObjectProperty
property disjoint with: relates to earthscape
property disjoint with: has time
property disjoint with: relates to society
property disjoint with: relates to visual information
property disjoint with: has person type
property disjoint with: bottomObjectProperty
sub property of: topObjectProperty
property disjoint with: relates to geopolitical entity
property disjoint with: has member
property disjoint with: relates to other organism
property disjoint with: relates to finance or economy
property disjoint with: relates to facility
property disjoint with: relates to natural phenomenon
property disjoint with: has organization type
property disjoint with: has member list
property disjoint with: relates to numbers
property disjoint with: has product type
property disjoint with: relates to audio information
domain: Thing
range: diseases
definition: This predicate relates an external entity to the SuperType (ST) shown. It indicates there is a relationship to the ST of a verifiable nature, but which is undetermined as to strength or a full rdf:type relationship.

facilities
disjoint with: Ordered Collection
subclass of: Concept
subclass of: http://lodlaundromat.org/.well-known/genid/2dd581c251e9628cd06f7f0e006f321f#240
disjoint with: diseases
subclass of: http://lodlaundromat.org/.well-known/genid/2dd581c251e9628cd06f7f0e006f321f#484
disjoint with: http://lodlaundromat.org/.well-known/genid/2dd581c251e9628cd06f7f0e006f321f#1
disjoint with: society
type: Class
subclass of: http://lodlaundromat.org/.well-known/genid/2dd581c251e9628cd06f7f0e006f321f#177
subclass of: http://lodlaundromat.org/.well-known/genid/2dd581c251e9628cd06f7f0e006f321f#70
subclass of: http://lodlaundromat.org/.well-known/genid/2dd581c251e9628cd06f7f0e006f321f#23
disjoint with: natural phenomena
disjoint with: drugs
disjoint with: Extraterrestrial
subclass of: http://lodlaundromat.org/.well-known/genid/2dd581c251e9628cd06f7f0e006f321f#325
subclass of: reference concept
disjoint with: written information
disjoint with: http://lodlaundromat.org/.well-known/genid/2dd581c251e9628cd06f7f0e006f321f#201
disjoint with: Concept Scheme
subclass of: http://lodlaundromat.org/.well-known/genid/2dd581c251e9628cd06f7f0e006f321f#4
disjoint with: events
disjoint with: person types
subclass of: http://lodlaundromat.org/.well-known/genid/2dd581c251e9628cd06f7f0e006f321f#162
subclass of: http://lodlaundromat.org/.well-known/genid/1c057c878c7c3a3a1a60afec0f9c51a2#1
subclass of: http://lodlaundromat.org/.well-known/genid/2dd581c251e9628cd06f7f0e006f321f#536
disjoint with: Collection
subclass of: http://lodlaundromat.org/.well-known/genid/2dd581c251e9628cd06f7f0e006f321f#419
disjoint with: food or drink
disjoint with: protists fungus
subclass of: http://lodlaundromat.org/.well-known/genid/2dd581c251e9628cd06f7f0e006f321f#625
subclass of: http://lodlaundromat.org/.well-known/genid/2dd581c251e9628cd06f7f0e006f321f#93
disjoint with: prokaryotes
disjoint with: activities
subclass of: http://lodlaundromat.org/.well-known/genid/2dd581c251e9628cd06f7f0e006f321f#393
disjoint with: animals
disjoint with: numbers
subclass of: http://lodlaundromat.org/.well-known/genid/2dd581c251e9628cd06f7f0e006f321f#45
disjoint with: notations
subclass of: http://lodlaundromat.org/.well-known/genid/2dd581c251e9628cd06f7f0e006f321f#118
subclass of: http://lodlaundromat.org/.well-known/genid/2dd581c251e9628cd06f7f0e006f321f#457
subclass of: Thing
disjoint with: plants
subclass of: http://lodlaundromat.org/.well-known/genid/2dd581c251e9628cd06f7f0e006f321f#556
disjoint with: organizations
disjoint with: structured information
subclass of: http://lodlaundromat.org/.well-known/genid/2dd581c251e9628cd06f7f0e006f321f#344
disjoint with: audio information
subclass of: http://lodlaundromat.org/.well-known/genid/2dd581c251e9628cd06f7f0e006f321f#283
subclass of: http://lodlaundromat.org/.well-known/genid/2dd581c251e9628cd06f7f0e006f321f#371
disjoint with: chemistry
subclass of: http://lodlaundromat.org/.well-known/genid/2dd581c251e9628cd06f7f0e006f321f#511
disjoint with: time
disjoint with: Nothing
subclass of: SuperType
definition: Facilities are physical places or buildings constructed by humans, such as schools, public institutions, markets, museums, amusement parks, worship places, stations, airports, ports, carstops, lines, railroads, roads, waterways, tunnels, bridges, parks, sport facilities, monuments. All can be geospatially located. Facilities also include animal pens and enclosures and general human "activity" areas (golf course, archeology sites, etc.). Iportantly Facilities include infrastructure systems such as roadways and physical networks. Facilities also include the component parts that go into making them (such as foundations, doors, windows, roofs, etc.)

diseases
disjoint with: person types
subclass of: http://lodlaundromat.org/.well-known/genid/2dd581c251e9628cd06f7f0e006f321f#118
disjoint with: http://lodlaundromat.org/.well-known/genid/2dd581c251e9628cd06f7f0e006f321f#93
disjoint with: geopolitical
disjoint with: Nothing
disjoint with: Concept Scheme
subclass of: http://lodlaundromat.org/.well-known/genid/2dd581c251e9628cd06f7f0e006f321f#306
disjoint with: food or drink
disjoint with: audio information
subclass of: http://lodlaundromat.org/.well-known/genid/2dd581c251e9628cd06f7f0e006f321f#484
disjoint with: drugs
subclass of: http://lodlaundromat.org/.well-known/genid/2dd581c251e9628cd06f7f0e006f321f#177
subclass of: http://lodlaundromat.org/.well-known/genid/2dd581c251e9628cd06f7f0e006f321f#556
subclass of: http://lodlaundromat.org/.well-known/genid/2dd581c251e9628cd06f7f0e006f321f#240
disjoint with: Extraterrestrial
disjoint with: plants
disjoint with: structured information
subclass of: http://lodlaundromat.org/.well-known/genid/2dd581c251e9628cd06f7f0e006f321f#625
subclass of: http://lodlaundromat.org/.well-known/genid/2dd581c251e9628cd06f7f0e006f321f#141
disjoint with: products
subclass of: http://lodlaundromat.org/.well-known/genid/2dd581c251e9628cd06f7f0e006f321f#602
subclass of: http://lodlaundromat.org/.well-known/genid/2dd581c251e9628cd06f7f0e006f321f#371
subclass of: http://lodlaundromat.org/.well-known/genid/2dd581c251e9628cd06f7f0e006f321f#260
subclass of: http://lodlaundromat.org/.well-known/genid/2dd581c251e9628cd06f7f0e006f321f#45
subclass of: http://lodlaundromat.org/.well-known/genid/1c057c878c7c3a3a1a60afec0f9c51a2#1
subclass of: http://lodlaundromat.org/.well-known/genid/2dd581c251e9628cd06f7f0e006f321f#325
subclass of: Thing
disjoint with: http://lodlaundromat.org/.well-known/genid/2dd581c251e9628cd06f7f0e006f321f#1
disjoint with: chemistry
subclass of: Concept
type: Class
subclass of: SuperType
subclass of: http://lodlaundromat.org/.well-known/genid/2dd581c251e9628cd06f7f0e006f321f#223
disjoint with: facilities
disjoint with: fnance and economy
subclass of: http://lodlaundromat.org/.well-known/genid/2dd581c251e9628cd06f7f0e006f321f#584
disjoint with: natural substance
disjoint with: workplaces
subclass of: reference concept
disjoint with: society
subclass of: http://lodlaundromat.org/.well-known/genid/2dd581c251e9628cd06f7f0e006f321f#201
disjoint with: visual information
disjoint with: Ordered Collection
disjoint with: protists fungus
disjoint with: prokaryotes
subclass of: http://lodlaundromat.org/.well-known/genid/2dd581c251e9628cd06f7f0e006f321f#393
subclass of: http://lodlaundromat.org/.well-known/genid/2dd581c251e9628cd06f7f0e006f321f#536
disjoint with: earthscape
subclass of: http://lodlaundromat.org/.well-known/genid/2dd581c251e9628cd06f7f0e006f321f#445
subclass of: http://lodlaundromat.org/.well-known/genid/2dd581c251e9628cd06f7f0e006f321f#419
disjoint with: time
subclass of: http://lodlaundromat.org/.well-known/genid/2dd581c251e9628cd06f7f0e006f321f#344
subclass of: http://lodlaundromat.org/.well-known/genid/2dd581c251e9628cd06f7f0e006f321f#511
disjoint with: numbers
disjoint with: organizations
subclass of: http://lodlaundromat.org/.well-known/genid/2dd581c251e9628cd06f7f0e006f321f#70
disjoint with: natural phenomena
disjoint with: notations
subclass of: http://lodlaundromat.org/.well-known/genid/2dd581c251e9628cd06f7f0e006f321f#457
disjoint with: Collection
disjoint with: written information
definition: Diseases are atypical or unusual or unhealthy conditions for (mostly human) living things, generally known as conditions, disorders, infections, diseases or syndromes. Diseases only affect living things and sometimes are caused by living things. This SuperType also includes impairments, disease vectors, wounds and injuries, and poisoning.

animals
disjoint with: plants
disjoint with: numbers
disjoint with: Concept Scheme
subclass of: http://lodlaundromat.org/.well-known/genid/1c057c878c7c3a3a1a60afec0f9c51a2#1
disjoint with: drugs
disjoint with: fnance and economy
subclass of: http://lodlaundromat.org/.well-known/genid/2dd581c251e9628cd06f7f0e006f321f#223
subclass of: Thing
subclass of: Concept
subclass of: http://lodlaundromat.org/.well-known/genid/2dd581c251e9628cd06f7f0e006f321f#45
disjoint with: http://lodlaundromat.org/.well-known/genid/2dd581c251e9628cd06f7f0e006f321f#1
disjoint with: Ordered Collection
disjoint with: Extraterrestrial
subclass of: http://lodlaundromat.org/.well-known/genid/2dd581c251e9628cd06f7f0e006f321f#602
subclass of: SuperType
subclass of: http://lodlaundromat.org/.well-known/genid/2dd581c251e9628cd06f7f0e006f321f#325
subclass of: http://lodlaundromat.org/.well-known/genid/2dd581c251e9628cd06f7f0e006f321f#118
subclass of: http://lodlaundromat.org/.well-known/genid/2dd581c251e9628cd06f7f0e006f321f#283
subclass of: http://lodlaundromat.org/.well-known/genid/2dd581c251e9628cd06f7f0e006f321f#201
subclass of: http://lodlaundromat.org/.well-known/genid/2dd581c251e9628cd06f7f0e006f321f#584
disjoint with: geopolitical
subclass of: http://lodlaundromat.org/.well-known/genid/2dd581c251e9628cd06f7f0e006f321f#162
disjoint with: audio information
type: Class
subclass of: http://lodlaundromat.org/.well-known/genid/2dd581c251e9628cd06f7f0e006f321f#260
disjoint with: workplaces
disjoint with: http://lodlaundromat.org/.well-known/genid/2dd581c251e9628cd06f7f0e006f321f#23
disjoint with: natural substance
subclass of: http://lodlaundromat.org/.well-known/genid/2dd581c251e9628cd06f7f0e006f321f#484
disjoint with: events
disjoint with: prokaryotes
disjoint with: natural phenomena
subclass of: http://lodlaundromat.org/.well-known/genid/2dd581c251e9628cd06f7f0e006f321f#141
subclass of: http://lodlaundromat.org/.well-known/genid/2dd581c251e9628cd06f7f0e006f321f#536
subclass of: reference concept
disjoint with: structured information
subclass of: http://lodlaundromat.org/.well-known/genid/2dd581c251e9628cd06f7f0e006f321f#344
disjoint with: facilities
subclass of: http://lodlaundromat.org/.well-known/genid/2dd581c251e9628cd06f7f0e006f321f#556
subclass of: http://lodlaundromat.org/.well-known/genid/2dd581c251e9628cd06f7f0e006f321f#457
disjoint with: earthscape
disjoint with: Collection
disjoint with: protists fungus
disjoint with: notations
disjoint with: Nothing
disjoint with: activities
subclass of: http://lodlaundromat.org/.well-known/genid/2dd581c251e9628cd06f7f0e006f321f#4
disjoint with: time
disjoint with: visual information
subclass of: http://lodlaundromat.org/.well-known/genid/2dd581c251e9628cd06f7f0e006f321f#177
disjoint with: written information
subclass of: http://lodlaundromat.org/.well-known/genid/2dd581c251e9628cd06f7f0e006f321f#419
subclass of: http://lodlaundromat.org/.well-known/genid/2dd581c251e9628cd06f7f0e006f321f#625
definition: This large SuperType includes all animal types, including specific animal types and vertebrates, invertebrates, insects, crustaceans, fish, reptiles, amphibia, birds, mammals, and animal body parts. Animal parts are specifically included. Also, groupings of such animals are included. Humans, as an animal, are included (versus as an individual Person). Diseases are specifically excluded. Animals have many of the similar overlaps to Plants. However, in addition, there are more terms for animal groups, animal parts, animal secretions, etc. Also Animals can include some human traits (posture, dead animal, etc)

written information
subclass of: http://lodlaundromat.org/.well-known/genid/2dd581c251e9628cd06f7f0e006f321f#201
disjoint with: workplaces
disjoint with: Ordered Collection
disjoint with: protists fungus
subclass of: http://lodlaundromat.org/.well-known/genid/2dd581c251e9628cd06f7f0e006f321f#371
disjoint with: audio information
subclass of: SuperType
disjoint with: numbers
subclass of: Thing
subclass of: http://lodlaundromat.org/.well-known/genid/2dd581c251e9628cd06f7f0e006f321f#457
subclass of: http://lodlaundromat.org/.well-known/genid/2dd581c251e9628cd06f7f0e006f321f#344
disjoint with: Extraterrestrial
subclass of: http://lodlaundromat.org/.well-known/genid/1c057c878c7c3a3a1a60afec0f9c51a2#1
subclass of: http://lodlaundromat.org/.well-known/genid/2dd581c251e9628cd06f7f0e006f321f#602
disjoint with: http://lodlaundromat.org/.well-known/genid/2dd581c251e9628cd06f7f0e006f321f#1
disjoint with: Nothing
subclass of: http://lodlaundromat.org/.well-known/genid/2dd581c251e9628cd06f7f0e006f321f#93
subclass of: http://lodlaundromat.org/.well-known/genid/2dd581c251e9628cd06f7f0e006f321f#23
subclass of: http://lodlaundromat.org/.well-known/genid/2dd581c251e9628cd06f7f0e006f321f#556
subclass of: http://lodlaundromat.org/.well-known/genid/2dd581c251e9628cd06f7f0e006f321f#118
subclass of: http://lodlaundromat.org/.well-known/genid/2dd581c251e9628cd06f7f0e006f321f#70
subclass of: http://lodlaundromat.org/.well-known/genid/2dd581c251e9628cd06f7f0e006f321f#240
disjoint with: geopolitical
disjoint with: natural phenomena
disjoint with: organizations
disjoint with: http://lodlaundromat.org/.well-known/genid/2dd581c251e9628cd06f7f0e006f321f#625
subclass of: http://lodlaundromat.org/.well-known/genid/2dd581c251e9628cd06f7f0e006f321f#177
type: Class
disjoint with: facilities
subclass of: http://lodlaundromat.org/.well-known/genid/2dd581c251e9628cd06f7f0e006f321f#393
disjoint with: Collection
disjoint with: animals
disjoint with: drugs
subclass of: http://lodlaundromat.org/.well-known/genid/2dd581c251e9628cd06f7f0e006f321f#141
subclass of: Concept
disjoint with: earthscape
disjoint with: diseases
disjoint with: prokaryotes
subclass of: http://lodlaundromat.org/.well-known/genid/2dd581c251e9628cd06f7f0e006f321f#283
disjoint with: natural substance
disjoint with: chemistry
disjoint with: plants
disjoint with: person types
subclass of: http://lodlaundromat.org/.well-known/genid/2dd581c251e9628cd06f7f0e006f321f#45
disjoint with: Concept Scheme
subclass of: http://lodlaundromat.org/.well-known/genid/2dd581c251e9628cd06f7f0e006f321f#306
subclass of: reference concept
subclass of: http://lodlaundromat.org/.well-known/genid/2dd581c251e9628cd06f7f0e006f321f#260
subclass of: http://lodlaundromat.org/.well-known/genid/2dd581c251e9628cd06f7f0e006f321f#419
disjoint with: time
disjoint with: food or drink
subclass of: http://lodlaundromat.org/.well-known/genid/2dd581c251e9628cd06f7f0e006f321f#484
definition: This SuperType includes any general material written by humans including books, blogs, articles, manuscripts, but any written information conveyed via text.

food or drink
subclass of: http://lodlaundromat.org/.well-known/genid/2dd581c251e9628cd06f7f0e006f321f#141
disjoint with: geopolitical
subclass of: SuperType
disjoint with: Collection
subclass of: http://lodlaundromat.org/.well-known/genid/2dd581c251e9628cd06f7f0e006f321f#602
subclass of: Concept
disjoint with: fnance and economy
disjoint with: Concept Scheme
subclass of: http://lodlaundromat.org/.well-known/genid/2dd581c251e9628cd06f7f0e006f321f#45
subclass of: http://lodlaundromat.org/.well-known/genid/2dd581c251e9628cd06f7f0e006f321f#536
subclass of: http://lodlaundromat.org/.well-known/genid/2dd581c251e9628cd06f7f0e006f321f#283
subclass of: reference concept
disjoint with: visual information
disjoint with: Extraterrestrial
subclass of: http://lodlaundromat.org/.well-known/genid/2dd581c251e9628cd06f7f0e006f321f#393
disjoint with: audio information
disjoint with: facilities
subclass of: http://lodlaundromat.org/.well-known/genid/2dd581c251e9628cd06f7f0e006f321f#625
disjoint with: notations
subclass of: http://lodlaundromat.org/.well-known/genid/2dd581c251e9628cd06f7f0e006f321f#584
disjoint with: earthscape
subclass of: http://lodlaundromat.org/.well-known/genid/2dd581c251e9628cd06f7f0e006f321f#511
disjoint with: structured information
disjoint with: Nothing
disjoint with: natural phenomena
disjoint with: time
disjoint with: diseases
subclass of: http://lodlaundromat.org/.well-known/genid/2dd581c251e9628cd06f7f0e006f321f#325
subclass of: http://lodlaundromat.org/.well-known/genid/2dd581c251e9628cd06f7f0e006f321f#93
subclass of: http://lodlaundromat.org/.well-known/genid/2dd581c251e9628cd06f7f0e006f321f#223
disjoint with: written information
subclass of: http://lodlaundromat.org/.well-known/genid/2dd581c251e9628cd06f7f0e006f321f#177
disjoint with: numbers
disjoint with: prokaryotes
subclass of: http://lodlaundromat.org/.well-known/genid/2dd581c251e9628cd06f7f0e006f321f#371
subclass of: http://lodlaundromat.org/.well-known/genid/2dd581c251e9628cd06f7f0e006f321f#556
disjoint with: workplaces
type: Class
subclass of: Thing
disjoint with: person types
subclass of: http://lodlaundromat.org/.well-known/genid/1c057c878c7c3a3a1a60afec0f9c51a2#1
disjoint with: organizations
disjoint with: http://lodlaundromat.org/.well-known/genid/2dd581c251e9628cd06f7f0e006f321f#240
disjoint with: society
subclass of: http://lodlaundromat.org/.well-known/genid/2dd581c251e9628cd06f7f0e006f321f#260
disjoint with: Ordered Collection
subclass of: http://lodlaundromat.org/.well-known/genid/2dd581c251e9628cd06f7f0e006f321f#201
subclass of: http://lodlaundromat.org/.well-known/genid/2dd581c251e9628cd06f7f0e006f321f#344
definition: This SuperType is any edible substance grown, made or harvested by humans. The category also specifically includes the concept of cuisines

geopolitical
subclass of: http://lodlaundromat.org/.well-known/genid/2dd581c251e9628cd06f7f0e006f321f#584
subclass of: http://lodlaundromat.org/.well-known/genid/2dd581c251e9628cd06f7f0e006f321f#162
disjoint with: structured information
subclass of: http://lodlaundromat.org/.well-known/genid/2dd581c251e9628cd06f7f0e006f321f#325
disjoint with: time
subclass of: http://lodlaundromat.org/.well-known/genid/2dd581c251e9628cd06f7f0e006f321f#283
disjoint with: food or drink
disjoint with: Collection
subclass of: http://lodlaundromat.org/.well-known/genid/2dd581c251e9628cd06f7f0e006f321f#344
subclass of: http://lodlaundromat.org/.well-known/genid/2dd581c251e9628cd06f7f0e006f321f#556
subclass of: http://lodlaundromat.org/.well-known/genid/2dd581c251e9628cd06f7f0e006f321f#177
disjoint with: http://lodlaundromat.org/.well-known/genid/2dd581c251e9628cd06f7f0e006f321f#141
disjoint with: written information
disjoint with: numbers
subclass of: http://lodlaundromat.org/.well-known/genid/2dd581c251e9628cd06f7f0e006f321f#45
disjoint with: natural phenomena
disjoint with: Ordered Collection
disjoint with: Concept Scheme
disjoint with: http://lodlaundromat.org/.well-known/genid/2dd581c251e9628cd06f7f0e006f321f#1
disjoint with: person types
disjoint with: prokaryotes
subclass of: http://lodlaundromat.org/.well-known/genid/1c057c878c7c3a3a1a60afec0f9c51a2#1
disjoint with: protists fungus
disjoint with: events
subclass of: http://lodlaundromat.org/.well-known/genid/2dd581c251e9628cd06f7f0e006f321f#445
subclass of: Concept
type: Class
subclass of: http://lodlaundromat.org/.well-known/genid/2dd581c251e9628cd06f7f0e006f321f#393
disjoint with: animals
disjoint with: chemistry
disjoint with: Extraterrestrial
disjoint with: audio information
subclass of: http://lodlaundromat.org/.well-known/genid/2dd581c251e9628cd06f7f0e006f321f#93
subclass of: http://lodlaundromat.org/.well-known/genid/2dd581c251e9628cd06f7f0e006f321f#457
disjoint with: activities
subclass of: http://lodlaundromat.org/.well-known/genid/2dd581c251e9628cd06f7f0e006f321f#4
disjoint with: notations
disjoint with: http://lodlaundromat.org/.well-known/genid/2dd581c251e9628cd06f7f0e006f321f#223
subclass of: http://lodlaundromat.org/.well-known/genid/2dd581c251e9628cd06f7f0e006f321f#511
subclass of: SuperType
disjoint with: plants
subclass of: http://lodlaundromat.org/.well-known/genid/2dd581c251e9628cd06f7f0e006f321f#625
subclass of: http://lodlaundromat.org/.well-known/genid/2dd581c251e9628cd06f7f0e006f321f#536
disjoint with: society
disjoint with: visual information
subclass of: http://lodlaundromat.org/.well-known/genid/2dd581c251e9628cd06f7f0e006f321f#419
disjoint with: http://lodlaundromat.org/.well-known/genid/2dd581c251e9628cd06f7f0e006f321f#260
disjoint with: drugs
subclass of: http://lodlaundromat.org/.well-known/genid/2dd581c251e9628cd06f7f0e006f321f#70
disjoint with: diseases
subclass of: Thing
subclass of: http://lodlaundromat.org/.well-known/genid/2dd581c251e9628cd06f7f0e006f321f#118
disjoint with: Nothing
subclass of: http://lodlaundromat.org/.well-known/genid/2dd581c251e9628cd06f7f0e006f321f#23
subclass of: http://lodlaundromat.org/.well-known/genid/2dd581c251e9628cd06f7f0e006f321f#240
disjoint with: products
subclass of: http://lodlaundromat.org/.well-known/genid/2dd581c251e9628cd06f7f0e006f321f#484
subclass of: reference concept
definition: Named places that have some informal or formal political (authorized) component. Important subcollections include Country, IndependentCountry, State_Geopolitical, City, and Province.

society
subclass of: http://lodlaundromat.org/.well-known/genid/2dd581c251e9628cd06f7f0e006f321f#162
subclass of: http://lodlaundromat.org/.well-known/genid/2dd581c251e9628cd06f7f0e006f321f#260
disjoint with: prokaryotes
disjoint with: structured information
disjoint with: protists fungus
subclass of: http://lodlaundromat.org/.well-known/genid/2dd581c251e9628cd06f7f0e006f321f#419
subclass of: http://lodlaundromat.org/.well-known/genid/2dd581c251e9628cd06f7f0e006f321f#445
subclass of: http://lodlaundromat.org/.well-known/genid/2dd581c251e9628cd06f7f0e006f321f#141
subclass of: http://lodlaundromat.org/.well-known/genid/2dd581c251e9628cd06f7f0e006f321f#70
disjoint with: products
subclass of: http://lodlaundromat.org/.well-known/genid/2dd581c251e9628cd06f7f0e006f321f#536
subclass of: http://lodlaundromat.org/.well-known/genid/2dd581c251e9628cd06f7f0e006f321f#177
subclass of: http://lodlaundromat.org/.well-known/genid/2dd581c251e9628cd06f7f0e006f321f#306
subclass of: http://lodlaundromat.org/.well-known/genid/2dd581c251e9628cd06f7f0e006f321f#484
disjoint with: facilities
disjoint with: activities
disjoint with: audio information
subclass of: http://lodlaundromat.org/.well-known/genid/2dd581c251e9628cd06f7f0e006f321f#118
disjoint with: notations
disjoint with: numbers
disjoint with: plants
disjoint with: earthscape
disjoint with: http://lodlaundromat.org/.well-known/genid/2dd581c251e9628cd06f7f0e006f321f#1
subclass of: http://lodlaundromat.org/.well-known/genid/2dd581c251e9628cd06f7f0e006f321f#457
subclass of: http://lodlaundromat.org/.well-known/genid/2dd581c251e9628cd06f7f0e006f321f#556
disjoint with: events
disjoint with: natural substance
disjoint with: time
disjoint with: Concept Scheme
disjoint with: visual information
disjoint with: natural phenomena
subclass of: http://lodlaundromat.org/.well-known/genid/2dd581c251e9628cd06f7f0e006f321f#223
subclass of: SuperType
disjoint with: Ordered Collection
disjoint with: diseases
disjoint with: drugs
subclass of: Concept
disjoint with: fnance and economy
subclass of: http://lodlaundromat.org/.well-known/genid/2dd581c251e9628cd06f7f0e006f321f#201
subclass of: Thing
disjoint with: geopolitical
disjoint with: Nothing
type: Class
subclass of: http://lodlaundromat.org/.well-known/genid/2dd581c251e9628cd06f7f0e006f321f#93
disjoint with: http://lodlaundromat.org/.well-known/genid/2dd581c251e9628cd06f7f0e006f321f#511
subclass of: http://lodlaundromat.org/.well-known/genid/2dd581c251e9628cd06f7f0e006f321f#602
disjoint with: workplaces
subclass of: http://lodlaundromat.org/.well-known/genid/2dd581c251e9628cd06f7f0e006f321f#584
subclass of: http://lodlaundromat.org/.well-known/genid/2dd581c251e9628cd06f7f0e006f321f#4
subclass of: http://lodlaundromat.org/.well-known/genid/2dd581c251e9628cd06f7f0e006f321f#325
disjoint with: Collection
subclass of: http://lodlaundromat.org/.well-known/genid/1c057c878c7c3a3a1a60afec0f9c51a2#1
disjoint with: chemistry
subclass of: http://lodlaundromat.org/.well-known/genid/2dd581c251e9628cd06f7f0e006f321f#45
subclass of: http://lodlaundromat.org/.well-known/genid/2dd581c251e9628cd06f7f0e006f321f#283
subclass of: http://lodlaundromat.org/.well-known/genid/2dd581c251e9628cd06f7f0e006f321f#344
subclass of: http://lodlaundromat.org/.well-known/genid/2dd581c251e9628cd06f7f0e006f321f#240
disjoint with: Extraterrestrial
disjoint with: food or drink
subclass of: reference concept
definition: This category includes concepts related to political systems, laws, rules or cultural mores governing societal or community behavior, or doctrinal, faith or religious bases or entities (such as gods, angels, totems) governing spiritual human matters. Culture, Issues, beliefs and various activisms (most -isms) are included

has top concept
property disjoint with: has activity
property disjoint with: is in semantic relation with
property disjoint with: has topic
property disjoint with: has event
property disjoint with: relates to geopolitical entity
property disjoint with: has abstraction
property disjoint with: has related
property disjoint with: bottomObjectProperty
property disjoint with: relates to natural substance
property disjoint with: has narrower match
property disjoint with: has close match
property disjoint with: has exact match
property disjoint with: has attribute
sub property of: topObjectProperty
property disjoint with: relates to chemistry
property disjoint with: has product type
property disjoint with: relates to society
property disjoint with: has member
property disjoint with: has food drink
property disjoint with: correspondsTo
property disjoint with: relates to facility
property disjoint with: relates to audio information
property disjoint with: relates to extraterrestrial entity
property disjoint with: relates to natural phenomenon
property disjoint with: is about
property disjoint with: relates to other organism
property disjoint with: is in scheme
property disjoint with: has organization type
property disjoint with: has broader match
property disjoint with: has broader transitive
type: ObjectProperty
property disjoint with: has workplace
property disjoint with: relates to written information
property disjoint with: relates to animal
property disjoint with: has related match
property disjoint with: is top concept in scheme
property disjoint with: is like
property disjoint with: has mapping
property disjoint with: has member list
property disjoint with: relates to structured information
property disjoint with: has time
property disjoint with: relates to finance or economy
property disjoint with: relates to market or industry
property disjoint with: relates to drug
inverse of: is top concept in scheme
property disjoint with: relates to numbers
property disjoint with: links entity
property disjoint with: is in mapping relation with
property disjoint with: relates to visual information
property disjoint with: has person type
property disjoint with: has notation
property disjoint with: has narrower
property disjoint with: relates to disease
property disjoint with: relates to plant
property disjoint with: relates to earthscape
property disjoint with: has narrower transitive
property disjoint with: has broader
definition: Relates, by convention, a concept scheme to a concept which is topmost in the broader/narrower concept hierarchies for that scheme, providing an entry point to these hierarchies.
domain: Concept Scheme
range: Concept
type: Property

relates to audio information
property disjoint with: has workplace
property disjoint with: relates to drug
property disjoint with: relates to society
property disjoint with: relates to facility
property disjoint with: relates to natural substance
property disjoint with: has organization type
property disjoint with: relates to plant
property disjoint with: relates to geopolitical entity
property disjoint with: relates to finance or economy
sub property of: topObjectProperty
property disjoint with: relates to extraterrestrial entity
property disjoint with: has activity
property disjoint with: relates to chemistry
property disjoint with: relates to numbers
property disjoint with: has food drink
property disjoint with: has person type
type: ObjectProperty
property disjoint with: relates to natural phenomenon
property disjoint with: relates to earthscape
property disjoint with: relates to disease
property disjoint with: has member
property disjoint with: has member list
property disjoint with: bottomObjectProperty
property disjoint with: relates to structured information
property disjoint with: has time
property disjoint with: relates to other organism
property disjoint with: relates to animal
property disjoint with: has top concept
domain: Thing
range: audio information
definition: This predicate relates an external entity to the SuperType (ST) shown. It indicates there is a relationship to the ST of a verifiable nature, but which is undetermined as to strength or a full rdf:type relationship

is in mapping relation with
property disjoint with: is in scheme
type: ObjectProperty
property disjoint with: has top concept
property disjoint with: bottomObjectProperty
property disjoint with: has member list
sub property of: topObjectProperty
sub property of: is in semantic relation with
property disjoint with: has member
property disjoint with: is top concept in scheme
definition: Relates two concepts coming, by convention, from different schemes, and that have comparable meanings
comment: These concept mapping relations mirror semantic relations, and the data model defined below is similar (with the exception of skos:exactMatch) to the data model defined for semantic relations. A distinct vocabulary is provided for concept mapping relations, to provide a convenient way to differentiate links within a concept scheme from links between concept schemes. However, this pattern of usage is not a formal requirement of the SKOS data model, and relies on informal definitions of best practice.
type: Property

notations
disjoint with: protists fungus
disjoint with: Extraterrestrial
subclass of: http://lodlaundromat.org/.well-known/genid/2dd581c251e9628cd06f7f0e006f321f#419
disjoint with: organizations
subclass of: http://lodlaundromat.org/.well-known/genid/2dd581c251e9628cd06f7f0e006f321f#201
disjoint with: facilities
disjoint with: society
disjoint with: earthscape
type: Class
disjoint with: natural phenomena
disjoint with: person types
subclass of: http://lodlaundromat.org/.well-known/genid/2dd581c251e9628cd06f7f0e006f321f#283
subclass of: http://lodlaundromat.org/.well-known/genid/2dd581c251e9628cd06f7f0e006f321f#556
disjoint with: geopolitical
disjoint with: prokaryotes
disjoint with: plants
subclass of: http://lodlaundromat.org/.well-known/genid/2dd581c251e9628cd06f7f0e006f321f#457
disjoint with: Concept Scheme
subclass of: Thing
disjoint with: Collection
disjoint with: food or drink
subclass of: http://lodlaundromat.org/.well-known/genid/2dd581c251e9628cd06f7f0e006f321f#371
subclass of: http://lodlaundromat.org/.well-known/genid/2dd581c251e9628cd06f7f0e006f321f#141
disjoint with: chemistry
disjoint with: Ordered Collection
subclass of: http://lodlaundromat.org/.well-known/genid/2dd581c251e9628cd06f7f0e006f321f#177
disjoint with: animals
subclass of: reference concept
subclass of: http://lodlaundromat.org/.well-known/genid/2dd581c251e9628cd06f7f0e006f321f#602
disjoint with: http://lodlaundromat.org/.well-known/genid/2dd581c251e9628cd06f7f0e006f321f#1
subclass of: SuperType
disjoint with: drugs
disjoint with: time
disjoint with: workplaces
subclass of: http://lodlaundromat.org/.well-known/genid/2dd581c251e9628cd06f7f0e006f321f#118
subclass of: http://lodlaundromat.org/.well-known/genid/1c057c878c7c3a3a1a60afec0f9c51a2#1
subclass of: http://lodlaundromat.org/.well-known/genid/2dd581c251e9628cd06f7f0e006f321f#393
subclass of: http://lodlaundromat.org/.well-known/genid/2dd581c251e9628cd06f7f0e006f321f#511
subclass of: http://lodlaundromat.org/.well-known/genid/2dd581c251e9628cd06f7f0e006f321f#93
disjoint with: http://lodlaundromat.org/.well-known/genid/2dd581c251e9628cd06f7f0e006f321f#325
disjoint with: diseases
subclass of: http://lodlaundromat.org/.well-known/genid/2dd581c251e9628cd06f7f0e006f321f#23
subclass of: http://lodlaundromat.org/.well-known/genid/2dd581c251e9628cd06f7f0e006f321f#484
subclass of: Concept
subclass of: http://lodlaundromat.org/.well-known/genid/2dd581c251e9628cd06f7f0e006f321f#70
subclass of: http://lodlaundromat.org/.well-known/genid/2dd581c251e9628cd06f7f0e006f321f#306
disjoint with: natural substance
disjoint with: Nothing
subclass of: http://lodlaundromat.org/.well-known/genid/2dd581c251e9628cd06f7f0e006f321f#260
subclass of: http://lodlaundromat.org/.well-known/genid/2dd581c251e9628cd06f7f0e006f321f#240
definition: Akin to conceptual works, these are codified means of human expression. Examples range from human languages themselves, to more domain-specific cases such as chemical symbols, genetic code (A-G-C-T), protocols, and computer languages, mathematical and set notations, etc. Identifiers (numeric or alphanumeric identifiers for objects, often in a highly patterned way, such as phone numbers, URLs, zip and postal codes, SKUs, product codes, etc.), Units (any of the various ways in which measurement, space, volume, weight, speed, intensity, temperature, calories, siesmic intensity or other quantitative descriptions of phenomena can be made) and key reference types are also included in this SuperType

has member list
property disjoint with: correspondsTo
property disjoint with: relates to structured information
property disjoint with: is in mapping relation with
property disjoint with: has related match
sub property of: topObjectProperty
property disjoint with: relates to audio information
property disjoint with: has narrower
property disjoint with: has top concept
property disjoint with: has product type
property disjoint with: has broader match
property disjoint with: relates to visual information
property disjoint with: has broader
property disjoint with: has notation
property disjoint with: has close match
property disjoint with: has event
property disjoint with: has time
property disjoint with: relates to earthscape
property disjoint with: relates to natural phenomenon
property disjoint with: is in semantic relation with
property disjoint with: has member
property disjoint with: has narrower match
property disjoint with: bottomObjectProperty
property disjoint with: is in scheme
property disjoint with: relates to plant
property disjoint with: relates to finance or economy
property disjoint with: relates to drug
property disjoint with: has narrower transitive
property disjoint with: relates to chemistry
type: FunctionalProperty
property disjoint with: has related
type: ObjectProperty
property disjoint with: relates to extraterrestrial entity
property disjoint with: relates to geopolitical entity
property disjoint with: has topic
property disjoint with: has mapping
property disjoint with: is top concept in scheme
property disjoint with: has person type
property disjoint with: has attribute
property disjoint with: relates to disease
property disjoint with: relates to numbers
property disjoint with: has broader transitive
property disjoint with: has exact match
property disjoint with: relates to market or industry
property disjoint with: relates to society
property disjoint with: relates to natural substance
property disjoint with: relates to animal
property disjoint with: has abstraction
property disjoint with: is like
property disjoint with: relates to facility
property disjoint with: has activity
property disjoint with: relates to written information
property disjoint with: has organization type
property disjoint with: has food drink
property disjoint with: relates to other organism
property disjoint with: has workplace
property disjoint with: links entity
property disjoint with: is about
definition: Relates an ordered collection to the RDF list containing its members.
domain: Ordered Collection
comment: For any resource, every item in the list given as the value of the skos:memberList property is also a value of the skos:member property.
type: Property

relates to animal
sub property of: topObjectProperty
property disjoint with: relates to visual information
property disjoint with: has member
property disjoint with: relates to finance or economy
property disjoint with: relates to extraterrestrial entity
property disjoint with: has activity
property disjoint with: has notation
property disjoint with: relates to numbers
property disjoint with: has workplace
property disjoint with: has member list
property disjoint with: bottomObjectProperty
type: ObjectProperty
property disjoint with: relates to audio information
property disjoint with: relates to geopolitical entity
property disjoint with: has time
property disjoint with: relates to facility
property disjoint with: relates to plant
property disjoint with: has event
property disjoint with: relates to earthscape
property disjoint with: relates to natural phenomenon
property disjoint with: has top concept
property disjoint with: relates to other organism
property disjoint with: relates to drug
property disjoint with: relates to natural substance
property disjoint with: relates to structured information
domain: Thing
range: animals
definition: This predicate relates an external entity to the SuperType (ST) shown. It indicates there is a relationship to the ST of a verifiable nature, but which is undetermined as to strength or a full rdf:type relationship

External - OpenCyc Mapping
type: reference concept
type: Concept
type: Thing
type: http://lodlaundromat.org/.well-known/genid/1c057c878c7c3a3a1a60afec0f9c51a2#1
type: qualifier
type: NamedIndividual
definition: Mapping based on existing OpenCyc assertion.

organizations
subclass of: http://lodlaundromat.org/.well-known/genid/2dd581c251e9628cd06f7f0e006f321f#93
subclass of: http://lodlaundromat.org/.well-known/genid/2dd581c251e9628cd06f7f0e006f321f#325
subclass of: http://lodlaundromat.org/.well-known/genid/2dd581c251e9628cd06f7f0e006f321f#484
disjoint with: Nothing
disjoint with: chemistry
disjoint with: http://lodlaundromat.org/.well-known/genid/2dd581c251e9628cd06f7f0e006f321f#371
disjoint with: notations
disjoint with: natural substance
disjoint with: http://lodlaundromat.org/.well-known/genid/2dd581c251e9628cd06f7f0e006f321f#1
disjoint with: drugs
subclass of: http://lodlaundromat.org/.well-known/genid/2dd581c251e9628cd06f7f0e006f321f#4
subclass of: http://lodlaundromat.org/.well-known/genid/2dd581c251e9628cd06f7f0e006f321f#419
subclass of: http://lodlaundromat.org/.well-known/genid/2dd581c251e9628cd06f7f0e006f321f#162
subclass of: SuperType
disjoint with: plants
subclass of: http://lodlaundromat.org/.well-known/genid/2dd581c251e9628cd06f7f0e006f321f#201
disjoint with: prokaryotes
disjoint with: protists fungus
subclass of: Concept
subclass of: http://lodlaundromat.org/.well-known/genid/2dd581c251e9628cd06f7f0e006f321f#45
subclass of: Thing
disjoint with: written information
disjoint with: natural phenomena
subclass of: http://lodlaundromat.org/.well-known/genid/2dd581c251e9628cd06f7f0e006f321f#306
disjoint with: Concept Scheme
disjoint with: products
type: Class
subclass of: http://lodlaundromat.org/.well-known/genid/2dd581c251e9628cd06f7f0e006f321f#625
disjoint with: visual information
subclass of: http://lodlaundromat.org/.well-known/genid/2dd581c251e9628cd06f7f0e006f321f#445
subclass of: http://lodlaundromat.org/.well-known/genid/2dd581c251e9628cd06f7f0e006f321f#584
subclass of: http://lodlaundromat.org/.well-known/genid/2dd581c251e9628cd06f7f0e006f321f#556
subclass of: http://lodlaundromat.org/.well-known/genid/2dd581c251e9628cd06f7f0e006f321f#457
disjoint with: facilities
subclass of: http://lodlaundromat.org/.well-known/genid/1c057c878c7c3a3a1a60afec0f9c51a2#1
subclass of: http://lodlaundromat.org/.well-known/genid/2dd581c251e9628cd06f7f0e006f321f#240
disjoint with: structured information
subclass of: reference concept
disjoint with: time
subclass of: http://lodlaundromat.org/.well-known/genid/2dd581c251e9628cd06f7f0e006f321f#344
subclass of: http://lodlaundromat.org/.well-known/genid/2dd581c251e9628cd06f7f0e006f321f#536
disjoint with: audio information
disjoint with: events
disjoint with: diseases
subclass of: http://lodlaundromat.org/.well-known/genid/2dd581c251e9628cd06f7f0e006f321f#118
disjoint with: food or drink
disjoint with: Collection
disjoint with: numbers
subclass of: http://lodlaundromat.org/.well-known/genid/2dd581c251e9628cd06f7f0e006f321f#177
disjoint with: Extraterrestrial
disjoint with: activities
disjoint with: Ordered Collection
subclass of: http://lodlaundromat.org/.well-known/genid/2dd581c251e9628cd06f7f0e006f321f#70
subclass of: http://lodlaundromat.org/.well-known/genid/2dd581c251e9628cd06f7f0e006f321f#283
definition: Organization is a broad SuperType and includes formal collections of humans, sometimes by legal means, charter, agreement or some mode of formal understanding. Examples include geoplotical entities such as nations, municipalities or countries; or companies, institutes, governments, universities, militaries, political parties, game groups, international organizations, trade associations, etc. All institutions, for example, are organizations. Also included are informal collections of humans. Informal or less defined groupings of humans may result from ethnicity or tribes or nationality or from shared interests (such as social networks or mailing lists) or expertise ("communities of practice"). This dimension also includes the notion of identifiable human groups with set members at any given point in time. Examples include music groups, cast members of a play, directors on a corporate Board, TV show members, gangs, mobs, juries, generations, minorities, etc. Finally, Organizations contain the concepts of Industries and Programs and Communities.

is in semantic relation with
property disjoint with: bottomObjectProperty
property disjoint with: has member list
property disjoint with: has member
sub property of: topObjectProperty
property disjoint with: is in scheme
type: ObjectProperty
property disjoint with: has top concept
property disjoint with: is top concept in scheme
definition: Links a concept to a concept related by meaning.
scope note: This property should not be used directly, but as a super-property for all properties denoting a relationship of meaning between concepts.
domain: Concept
range: Concept
type: Property

Automatic - Inspected S-Match
type: reference concept
type: Concept
type: Thing
type: http://lodlaundromat.org/.well-known/genid/1c057c878c7c3a3a1a60afec0f9c51a2#1
type: qualifier
type: NamedIndividual
definition: Mapping based on automatic scoring of concepts using S-Match, with specific alignment choice based on hand selection.

Collection
subclass of: chemistry
subclass of: http://lodlaundromat.org/.well-known/genid/2dd581c251e9628cd06f7f0e006f321f#260
disjoint with: abstract level
disjoint with: activities
subclass of: time
disjoint with: natural phenomena
disjoint with: attributes
subclass of: http://lodlaundromat.org/.well-known/genid/2dd581c251e9628cd06f7f0e006f321f#141
disjoint with: products
disjoint with: plants
subclass of: abstract level
disjoint with: http://lodlaundromat.org/.well-known/genid/2dd581c251e9628cd06f7f0e006f321f#23
subclass of: numbers
disjoint with: diseases
complement of: http://lodlaundromat.org/.well-known/genid/1c057c878c7c3a3a1a60afec0f9c51a2#1
subclass of: http://lodlaundromat.org/.well-known/genid/2dd581c251e9628cd06f7f0e006f321f#393
subclass of: http://lodlaundromat.org/.well-known/genid/2dd581c251e9628cd06f7f0e006f321f#45
disjoint with: http://lodlaundromat.org/.well-known/genid/2dd581c251e9628cd06f7f0e006f321f#484
subclass of: http://lodlaundromat.org/.well-known/genid/2dd581c251e9628cd06f7f0e006f321f#344
disjoint with: http://lodlaundromat.org/.well-known/genid/2dd581c251e9628cd06f7f0e006f321f#70
subclass of: http://lodlaundromat.org/.well-known/genid/2dd581c251e9628cd06f7f0e006f321f#177
subclass of: activities
subclass of: http://lodlaundromat.org/.well-known/genid/2dd581c251e9628cd06f7f0e006f321f#162
disjoint with: http://lodlaundromat.org/.well-known/genid/2dd581c251e9628cd06f7f0e006f321f#511
disjoint with: reference concept
disjoint with: animals
disjoint with: http://lodlaundromat.org/.well-known/genid/2dd581c251e9628cd06f7f0e006f321f#602
disjoint with: http://lodlaundromat.org/.well-known/genid/2dd581c251e9628cd06f7f0e006f321f#118
disjoint with: geopolitical
disjoint with: http://lodlaundromat.org/.well-known/genid/2dd581c251e9628cd06f7f0e006f321f#371
disjoint with: http://lodlaundromat.org/.well-known/genid/2dd581c251e9628cd06f7f0e006f321f#141
disjoint with: visual information
disjoint with: facilities
equivalent class: Nothing
disjoint with: http://lodlaundromat.org/.well-known/genid/2dd581c251e9628cd06f7f0e006f321f#536
equivalent class: Concept Scheme
disjoint with: http://lodlaundromat.org/.well-known/genid/2dd581c251e9628cd06f7f0e006f321f#344
subclass of: protists fungus
disjoint with: http://lodlaundromat.org/.well-known/genid/2dd581c251e9628cd06f7f0e006f321f#393
disjoint with: SuperType
subclass of: SuperType
subclass of: Ordered Collection
complement of: reference concept
subclass of: http://lodlaundromat.org/.well-known/genid/2dd581c251e9628cd06f7f0e006f321f#240
disjoint with: Nothing
subclass of: attributes
disjoint with: http://lodlaundromat.org/.well-known/genid/2dd581c251e9628cd06f7f0e006f321f#419
subclass of: http://lodlaundromat.org/.well-known/genid/2dd581c251e9628cd06f7f0e006f321f#457
subclass of: Class
subclass of: http://lodlaundromat.org/.well-known/genid/2dd581c251e9628cd06f7f0e006f321f#419
equivalent class: Ordered Collection
subclass of: qualifier
disjoint with: society
disjoint with: written information
subclass of: http://lodlaundromat.org/.well-known/genid/2dd581c251e9628cd06f7f0e006f321f#70
subclass of: http://lodlaundromat.org/.well-known/genid/2dd581c251e9628cd06f7f0e006f321f#306
subclass of: products
disjoint with: Extraterrestrial
subclass of: http://lodlaundromat.org/.well-known/genid/2dd581c251e9628cd06f7f0e006f321f#445
disjoint with: http://lodlaundromat.org/.well-known/genid/2dd581c251e9628cd06f7f0e006f321f#162
subclass of: http://lodlaundromat.org/.well-known/genid/2dd581c251e9628cd06f7f0e006f321f#511
subclass of: audio information
disjoint with: drugs
disjoint with: food or drink
disjoint with: structured information
disjoint with: audio information
disjoint with: http://lodlaundromat.org/.well-known/genid/2dd581c251e9628cd06f7f0e006f321f#325
disjoint with: time
subclass of: Concept
subclass of: fnance and economy
disjoint with: http://lodlaundromat.org/.well-known/genid/2dd581c251e9628cd06f7f0e006f321f#201
disjoint with: topics categories
disjoint with: events
subclass of: organizations
disjoint with: http://lodlaundromat.org/.well-known/genid/2dd581c251e9628cd06f7f0e006f321f#260
subclass of: http://lodlaundromat.org/.well-known/genid/2dd581c251e9628cd06f7f0e006f321f#625
subclass of: http://lodlaundromat.org/.well-known/genid/2dd581c251e9628cd06f7f0e006f321f#484
disjoint with: chemistry
subclass of: http://lodlaundromat.org/.well-known/genid/2dd581c251e9628cd06f7f0e006f321f#283
subclass of: http://lodlaundromat.org/.well-known/genid/2dd581c251e9628cd06f7f0e006f321f#325

is top concept in scheme
type: ObjectProperty
property disjoint with: has narrower transitive
property disjoint with: has broader transitive
property disjoint with: has top concept
property disjoint with: has exact match
property disjoint with: correspondsTo
property disjoint with: has broader match
sub property of: topObjectProperty
sub property of: is in scheme
property disjoint with: is in mapping relation with
property disjoint with: is in semantic relation with
property disjoint with: has member
property disjoint with: has member list
property disjoint with: has narrower match
property disjoint with: has broader
inverse of: has top concept
property disjoint with: has close match
property disjoint with: has narrower
property disjoint with: has related match
property disjoint with: has related
property disjoint with: bottomObjectProperty
property disjoint with: is about
definition: Relates a concept to the concept scheme that it is a top level concept of.
type: Property
domain: Concept
range: Concept Scheme

qualifier
subclass of: Thing
disjoint with: Concept Scheme
subclass of: reference concept
disjoint with: Collection
disjoint with: Ordered Collection
type: Class
subclass of: Concept
disjoint with: Nothing
subclass of: http://lodlaundromat.org/.well-known/genid/1c057c878c7c3a3a1a60afec0f9c51a2#1
definition: The Qualifier class is a set of descriptions that indicate the method used in order to establish an isAbout relationship between an UMBEL reference concept (RC) and an external entity. This description should be complete enough to aid understanding of the nature and reliability of the "aboutness" assertion and to be usable for filtering or user interface information. The descriptions may be literal strings or may refer to literal numeric values resulting from an automated alignment technique.

has exact match
sub property of: is in mapping relation with
sub property of: has close match
property disjoint with: bottomObjectProperty
sub property of: topObjectProperty
property disjoint with: is in scheme
property disjoint with: is top concept in scheme
property disjoint with: has member list
property disjoint with: has member
type: SymmetricProperty
sub property of: is in semantic relation with
property disjoint with: has top concept
type: ObjectProperty
type: TransitiveProperty
definition: skos:exactMatch is used to link two concepts, indicating a high degree of confidence that the concepts can be used interchangeably across a wide range of information retrieval applications. skos:exactMatch is a transitive property, and is a sub-property of skos:closeMatch.
comment: skos:exactMatch is disjoint with each of the properties skos:broadMatch and skos:relatedMatch.
type: Property

has attribute
sub property of: topObjectProperty
property disjoint with: has member list
property disjoint with: has top concept
property disjoint with: bottomObjectProperty
property disjoint with: has member
type: ObjectProperty
domain: Thing
range: attributes
definition: This predicate relates an external entity to the SuperType (ST) shown. It indicates there is a relationship to the ST of a verifiable nature, but which is undetermined as to strength or a full rdf:type relationship

has notation
property disjoint with: has organization type
property disjoint with: relates to other organism
property disjoint with: relates to facility
property disjoint with: relates to plant
property disjoint with: has person type
property disjoint with: relates to extraterrestrial entity
property disjoint with: relates to drug
property disjoint with: relates to earthscape
property disjoint with: has top concept
property disjoint with: has time
sub property of: topObjectProperty
property disjoint with: has member list
property disjoint with: relates to animal
property disjoint with: relates to society
property disjoint with: has member
property disjoint with: has food drink
property disjoint with: has workplace
property disjoint with: relates to natural substance
property disjoint with: relates to natural phenomenon
property disjoint with: relates to disease
property disjoint with: relates to chemistry
property disjoint with: bottomObjectProperty
property disjoint with: relates to geopolitical entity
type: ObjectProperty
domain: Thing
range: notations
definition: This predicate relates an external entity to the SuperType (ST) shown. It indicates there is a relationship to the ST of a verifiable nature, but which is undetermined as to strength or a full rdf:type relationship

has event
property disjoint with: has workplace
property disjoint with: has organization type
sub property of: topObjectProperty
property disjoint with: relates to other organism
property disjoint with: relates to natural substance
property disjoint with: relates to earthscape
property disjoint with: has member
property disjoint with: relates to society
property disjoint with: relates to numbers
property disjoint with: relates to facility
type: ObjectProperty
property disjoint with: has person type
property disjoint with: has top concept
property disjoint with: relates to plant
property disjoint with: relates to animal
property disjoint with: relates to geopolitical entity
property disjoint with: bottomObjectProperty
property disjoint with: relates to drug
property disjoint with: has member list
domain: Thing
range: events
definition: This predicate relates an external entity to the SuperType (ST) shown. It indicates there is a relationship to the ST of a verifiable nature, but which is undetermined as to strength or a full rdf:type relationship

relates to earthscape
property disjoint with: has member
property disjoint with: relates to disease
property disjoint with: has event
property disjoint with: relates to other organism
property disjoint with: relates to chemistry
property disjoint with: has food drink
sub property of: topObjectProperty
property disjoint with: relates to animal
property disjoint with: relates to plant
property disjoint with: has activity
property disjoint with: relates to numbers
property disjoint with: relates to visual information
property disjoint with: has member list
property disjoint with: relates to structured information
property disjoint with: bottomObjectProperty
property disjoint with: has notation
property disjoint with: has time
property disjoint with: relates to natural phenomenon
property disjoint with: has person type
property disjoint with: relates to drug
property disjoint with: relates to audio information
type: ObjectProperty
property disjoint with: relates to society
property disjoint with: has top concept
domain: Thing
range: earthscape
definition: This predicate relates an external entity to the SuperType (ST) shown. It indicates there is a relationship to the ST of a verifiable nature, but which is undetermined as to strength or a full rdf:type relationship.

natural substance
subclass of: http://lodlaundromat.org/.well-known/genid/2dd581c251e9628cd06f7f0e006f321f#4
disjoint with: natural phenomena
disjoint with: Collection
disjoint with: Concept Scheme
disjoint with: events
subclass of: http://lodlaundromat.org/.well-known/genid/2dd581c251e9628cd06f7f0e006f321f#584
subclass of: http://lodlaundromat.org/.well-known/genid/2dd581c251e9628cd06f7f0e006f321f#625
subclass of: http://lodlaundromat.org/.well-known/genid/2dd581c251e9628cd06f7f0e006f321f#556
disjoint with: visual information
disjoint with: time
disjoint with: http://lodlaundromat.org/.well-known/genid/2dd581c251e9628cd06f7f0e006f321f#1
disjoint with: protists fungus
subclass of: http://lodlaundromat.org/.well-known/genid/2dd581c251e9628cd06f7f0e006f321f#371
disjoint with: society
disjoint with: organizations
subclass of: http://lodlaundromat.org/.well-known/genid/2dd581c251e9628cd06f7f0e006f321f#325
subclass of: http://lodlaundromat.org/.well-known/genid/2dd581c251e9628cd06f7f0e006f321f#45
disjoint with: http://lodlaundromat.org/.well-known/genid/2dd581c251e9628cd06f7f0e006f321f#306
disjoint with: activities
subclass of: reference concept
subclass of: http://lodlaundromat.org/.well-known/genid/2dd581c251e9628cd06f7f0e006f321f#419
subclass of: http://lodlaundromat.org/.well-known/genid/2dd581c251e9628cd06f7f0e006f321f#283
disjoint with: numbers
subclass of: http://lodlaundromat.org/.well-known/genid/2dd581c251e9628cd06f7f0e006f321f#393
disjoint with: notations
disjoint with: workplaces
disjoint with: animals
subclass of: http://lodlaundromat.org/.well-known/genid/2dd581c251e9628cd06f7f0e006f321f#162
disjoint with: prokaryotes
subclass of: Thing
disjoint with: written information
subclass of: SuperType
disjoint with: person types
subclass of: http://lodlaundromat.org/.well-known/genid/1c057c878c7c3a3a1a60afec0f9c51a2#1
subclass of: Concept
disjoint with: audio information
subclass of: http://lodlaundromat.org/.well-known/genid/2dd581c251e9628cd06f7f0e006f321f#511
type: Class
disjoint with: structured information
subclass of: http://lodlaundromat.org/.well-known/genid/2dd581c251e9628cd06f7f0e006f321f#536
subclass of: http://lodlaundromat.org/.well-known/genid/2dd581c251e9628cd06f7f0e006f321f#457
subclass of: http://lodlaundromat.org/.well-known/genid/2dd581c251e9628cd06f7f0e006f321f#23
disjoint with: diseases
disjoint with: plants
disjoint with: Nothing
subclass of: http://lodlaundromat.org/.well-known/genid/2dd581c251e9628cd06f7f0e006f321f#344
subclass of: http://lodlaundromat.org/.well-known/genid/2dd581c251e9628cd06f7f0e006f321f#484
subclass of: http://lodlaundromat.org/.well-known/genid/2dd581c251e9628cd06f7f0e006f321f#602
disjoint with: Ordered Collection
definition: Notable inclusions are minerals, compounds, chemicals, or physical objects that are not the outcome of purposeful human effort, but are found naturally occurring. Other natural objects (such as rock, fossil, etc.) are also found under this SuperType. Natural Substances include subatomic particles. The contrast is with Earthscape, which covers natural "features" or living substances, which are covered under the appropriate SuperTypes. Chemicals can be Natural Substances, but only if they are naturally occurring, such as limestone or salt.

has close match
sub property of: is in mapping relation with
type: SymmetricProperty
property disjoint with: is in scheme
sub property of: topObjectProperty
property disjoint with: is top concept in scheme
sub property of: is in semantic relation with
property disjoint with: has member
type: ObjectProperty
property disjoint with: bottomObjectProperty
property disjoint with: has member list
property disjoint with: has top concept
definition: skos:closeMatch is used to link two concepts that are sufficiently similar that they can be used interchangeably in some information retrieval applications. In order to avoid the possibility of "compound errors" when combining mappings across more than two concept schemes, skos:closeMatch is not declared to be a transitive property.
type: Property

earthscape
subclass of: http://lodlaundromat.org/.well-known/genid/2dd581c251e9628cd06f7f0e006f321f#283
disjoint with: food or drink
subclass of: Concept
subclass of: http://lodlaundromat.org/.well-known/genid/2dd581c251e9628cd06f7f0e006f321f#457
disjoint with: written information
subclass of: http://lodlaundromat.org/.well-known/genid/2dd581c251e9628cd06f7f0e006f321f#23
subclass of: http://lodlaundromat.org/.well-known/genid/1c057c878c7c3a3a1a60afec0f9c51a2#1
disjoint with: Collection
subclass of: http://lodlaundromat.org/.well-known/genid/2dd581c251e9628cd06f7f0e006f321f#162
disjoint with: structured information
disjoint with: http://lodlaundromat.org/.well-known/genid/2dd581c251e9628cd06f7f0e006f321f#1
disjoint with: person types
disjoint with: visual information
disjoint with: animals
disjoint with: natural phenomena
disjoint with: prokaryotes
disjoint with: audio information
disjoint with: drugs
subclass of: http://lodlaundromat.org/.well-known/genid/2dd581c251e9628cd06f7f0e006f321f#556
disjoint with: time
subclass of: http://lodlaundromat.org/.well-known/genid/2dd581c251e9628cd06f7f0e006f321f#240
subclass of: http://lodlaundromat.org/.well-known/genid/2dd581c251e9628cd06f7f0e006f321f#45
subclass of: http://lodlaundromat.org/.well-known/genid/2dd581c251e9628cd06f7f0e006f321f#70
subclass of: http://lodlaundromat.org/.well-known/genid/2dd581c251e9628cd06f7f0e006f321f#536
disjoint with: plants
disjoint with: notations
subclass of: http://lodlaundromat.org/.well-known/genid/2dd581c251e9628cd06f7f0e006f321f#325
subclass of: http://lodlaundromat.org/.well-known/genid/2dd581c251e9628cd06f7f0e006f321f#93
subclass of: http://lodlaundromat.org/.well-known/genid/2dd581c251e9628cd06f7f0e006f321f#419
subclass of: http://lodlaundromat.org/.well-known/genid/2dd581c251e9628cd06f7f0e006f321f#484
disjoint with: events
disjoint with: chemistry
subclass of: http://lodlaundromat.org/.well-known/genid/2dd581c251e9628cd06f7f0e006f321f#118
subclass of: http://lodlaundromat.org/.well-known/genid/2dd581c251e9628cd06f7f0e006f321f#584
disjoint with: http://lodlaundromat.org/.well-known/genid/2dd581c251e9628cd06f7f0e006f321f#141
disjoint with: Nothing
disjoint with: activities
disjoint with: diseases
disjoint with: numbers
subclass of: http://lodlaundromat.org/.well-known/genid/2dd581c251e9628cd06f7f0e006f321f#4
disjoint with: Concept Scheme
subclass of: reference concept
subclass of: http://lodlaundromat.org/.well-known/genid/2dd581c251e9628cd06f7f0e006f321f#511
disjoint with: protists fungus
subclass of: http://lodlaundromat.org/.well-known/genid/2dd581c251e9628cd06f7f0e006f321f#393
subclass of: http://lodlaundromat.org/.well-known/genid/2dd581c251e9628cd06f7f0e006f321f#344
subclass of: http://lodlaundromat.org/.well-known/genid/2dd581c251e9628cd06f7f0e006f321f#625
disjoint with: Ordered Collection
disjoint with: society
subclass of: Thing
subclass of: SuperType
type: Class
definition: The Natural Feature SuperType is the collection of cartographic features that occur on the surface of the Earth. Positive examples include Mountain, Ocean, and Mesa. Artificial features such as canals are excluded. Most instances of these features have a fixed location in space. Underground and underwater are also explicitly contained. This SuperType is explicitly disjoint with Extraterrestrial (see below).

has time
property disjoint with: relates to numbers
property disjoint with: relates to other organism
property disjoint with: relates to structured information
property disjoint with: has person type
sub property of: topObjectProperty
property disjoint with: relates to plant
property disjoint with: relates to finance or economy
property disjoint with: has food drink
property disjoint with: relates to geopolitical entity
property disjoint with: has notation
property disjoint with: relates to animal
property disjoint with: relates to drug
property disjoint with: relates to extraterrestrial entity
property disjoint with: relates to disease
property disjoint with: has activity
property disjoint with: has organization type
property disjoint with: relates to earthscape
property disjoint with: relates to society
property disjoint with: has product type
property disjoint with: relates to facility
property disjoint with: relates to natural substance
property disjoint with: bottomObjectProperty
type: ObjectProperty
property disjoint with: has member
property disjoint with: has top concept
property disjoint with: relates to chemistry
property disjoint with: relates to natural phenomenon
property disjoint with: has workplace
property disjoint with: has member list
property disjoint with: relates to visual information
property disjoint with: relates to audio information
domain: Thing
range: time
definition: This predicate relates an external entity to the SuperType (ST) shown. It indicates there is a relationship to the ST of a verifiable nature, but which is undetermined as to strength or a full rdf:type relationship

relates to written information
sub property of: topObjectProperty
property disjoint with: has member list
property disjoint with: has top concept
property disjoint with: bottomObjectProperty
property disjoint with: has member
type: ObjectProperty
domain: Thing
definition: This predicate relates an external entity to the SuperType (ST) shown. It indicates there is a relationship to the ST of a verifiable nature, but which is undetermined as to strength or a full rdf:type relationship.

relates to natural phenomenon
property disjoint with: relates to animal
property disjoint with: relates to natural substance
property disjoint with: has person type
property disjoint with: relates to drug
property disjoint with: relates to geopolitical entity
property disjoint with: relates to facility
property disjoint with: relates to chemistry
property disjoint with: relates to society
property disjoint with: relates to finance or economy
property disjoint with: has food drink
property disjoint with: relates to other organism
property disjoint with: relates to plant
property disjoint with: has time
sub property of: topObjectProperty
property disjoint with: has member
property disjoint with: has notation
property disjoint with: relates to disease
property disjoint with: bottomObjectProperty
property disjoint with: has workplace
property disjoint with: has top concept
type: ObjectProperty
property disjoint with: has member list
property disjoint with: has organization type
property disjoint with: relates to audio information
property disjoint with: has product type
property disjoint with: relates to numbers
property disjoint with: relates to earthscape
domain: Thing
range: natural phenomena
definition: This predicate relates an external entity to the SuperType (ST) shown. It indicates there is a relationship to the ST of a verifiable nature, but which is undetermined as to strength or a full rdf:type relationship.

has abstraction
sub property of: topObjectProperty
property disjoint with: has member list
property disjoint with: has top concept
property disjoint with: bottomObjectProperty
property disjoint with: has member
type: ObjectProperty
domain: Thing
range: abstract level
definition: This predicate relates an external entity to the SuperType (ST) shown. It indicates there is a relationship to the ST of a verifiable nature, but which is undetermined as to strength or a full rdf:type relationship

has member
property disjoint with: has activity
property disjoint with: has notation
property disjoint with: has abstraction
sub property of: topObjectProperty
property disjoint with: is like
property disjoint with: has narrower
property disjoint with: relates to chemistry
property disjoint with: has person type
property disjoint with: relates to visual information
property disjoint with: is top concept in scheme
property disjoint with: correspondsTo
property disjoint with: relates to drug
property disjoint with: has food drink
property disjoint with: relates to extraterrestrial entity
property disjoint with: bottomObjectProperty
property disjoint with: relates to facility
property disjoint with: is about
property disjoint with: has time
property disjoint with: relates to natural phenomenon
property disjoint with: has broader match
property disjoint with: relates to society
property disjoint with: relates to structured information
property disjoint with: has top concept
property disjoint with: has workplace
property disjoint with: relates to animal
property disjoint with: relates to finance or economy
property disjoint with: relates to audio information
property disjoint with: has close match
property disjoint with: has exact match
property disjoint with: is in mapping relation with
property disjoint with: relates to plant
property disjoint with: has product type
property disjoint with: has organization type
property disjoint with: has broader
property disjoint with: has attribute
property disjoint with: relates to geopolitical entity
property disjoint with: has narrower match
property disjoint with: relates to disease
property disjoint with: relates to natural substance
property disjoint with: relates to other organism
type: ObjectProperty
property disjoint with: has broader transitive
property disjoint with: relates to market or industry
property disjoint with: relates to numbers
property disjoint with: has related
property disjoint with: links entity
property disjoint with: is in semantic relation with
property disjoint with: has member list
property disjoint with: relates to earthscape
property disjoint with: is in scheme
property disjoint with: has event
property disjoint with: has topic
property disjoint with: has narrower transitive
property disjoint with: relates to written information
property disjoint with: has related match
property disjoint with: has mapping
definition: Relates a collection to one of its members.
domain: Collection
range: http://lodlaundromat.org/.well-known/genid/1c057c878c7c3a3a1a60afec0f9c51a2#1
type: Property

relates to other organism
property disjoint with: relates to audio information
property disjoint with: relates to extraterrestrial entity
type: ObjectProperty
property disjoint with: relates to structured information
property disjoint with: relates to chemistry
property disjoint with: relates to finance or economy
property disjoint with: has top concept
property disjoint with: relates to plant
property disjoint with: has time
sub property of: topObjectProperty
property disjoint with: relates to natural phenomenon
property disjoint with: has event
property disjoint with: relates to numbers
property disjoint with: relates to natural substance
property disjoint with: has workplace
property disjoint with: relates to disease
property disjoint with: has activity
property disjoint with: has product type
property disjoint with: relates to facility
property disjoint with: has member
property disjoint with: relates to society
property disjoint with: has notation
property disjoint with: has organization type
property disjoint with: relates to earthscape
property disjoint with: bottomObjectProperty
property disjoint with: relates to animal
property disjoint with: relates to geopolitical entity
property disjoint with: has member list
property disjoint with: relates to visual information
property disjoint with: has person type
domain: Thing
range: http://lodlaundromat.org/.well-known/genid/2dd581c251e9628cd06f7f0e006f321f#1
definition: This predicate relates an external entity to the SuperType (ST) shown. It indicates there is a relationship to the ST of a verifiable nature, but which is undetermined as to strength or a full rdf:type relationship.

relates to geopolitical entity
property disjoint with: relates to chemistry
property disjoint with: relates to disease
property disjoint with: relates to other organism
property disjoint with: has event
property disjoint with: relates to visual information
property disjoint with: has member list
type: ObjectProperty
property disjoint with: relates to animal
property disjoint with: has top concept
property disjoint with: relates to audio information
property disjoint with: has notation
property disjoint with: has activity
property disjoint with: relates to extraterrestrial entity
property disjoint with: has food drink
sub property of: topObjectProperty
property disjoint with: relates to drug
property disjoint with: relates to natural phenomenon
property disjoint with: has person type
property disjoint with: relates to plant
property disjoint with: has member
property disjoint with: relates to numbers
property disjoint with: has product type
property disjoint with: relates to structured information
property disjoint with: bottomObjectProperty
property disjoint with: relates to society
property disjoint with: has time
domain: Thing
range: geopolitical
definition: This predicate relates an external entity to the SuperType (ST) shown. It indicates there is a relationship to the ST of a verifiable nature, but which is undetermined as to strength or a full rdf:type relationship.

relates to natural substance
property disjoint with: relates to society
property disjoint with: relates to disease
property disjoint with: has member list
property disjoint with: has organization type
property disjoint with: relates to other organism
property disjoint with: relates to animal
sub property of: topObjectProperty
property disjoint with: has notation
property disjoint with: relates to plant
property disjoint with: relates to visual information
property disjoint with: has event
property disjoint with: has person type
property disjoint with: bottomObjectProperty
property disjoint with: relates to numbers
property disjoint with: has time
type: ObjectProperty
property disjoint with: relates to natural phenomenon
property disjoint with: relates to structured information
property disjoint with: has activity
property disjoint with: has member
property disjoint with: relates to audio information
property disjoint with: has top concept
property disjoint with: has workplace
domain: Thing
range: natural substance
definition: This predicate relates an external entity to the SuperType (ST) shown. It indicates there is a relationship to the ST of a verifiable nature, but which is undetermined as to strength or a full rdf:type relationship.

links entity
sub property of: topObjectProperty
property disjoint with: has member list
property disjoint with: has top concept
property disjoint with: bottomObjectProperty
property disjoint with: has member
inverse of: is about
type: ObjectProperty
domain: reference concept
range: Thing
definition: Check the definition of umbel:isAbout for the definition of this property; isRelatedTo is the inverse property of isAbout.

External - GeoNames Mapping
type: reference concept
type: Concept
type: Thing
type: http://lodlaundromat.org/.well-known/genid/1c057c878c7c3a3a1a60afec0f9c51a2#1
type: qualifier
type: NamedIndividual
definition: Mapping based on existing GeoNames assertion.

is like
sub property of: topObjectProperty
type: ObjectProperty
property disjoint with: has top concept
property disjoint with: has member
type: SymmetricProperty
property disjoint with: bottomObjectProperty
property disjoint with: has member list
domain: Thing
range: Thing
definition: The property umbel:isLike is used to assert an associative link between similar individuals who may or may not be identical, but are believed to be so. This property is not intended as a general expression of similarity, but rather the likely but uncertain same identity of the two resources being related. This property can and should be changed if the certainty of the sameness of identity is subsequently determined. In general, we may not be able to assert that two individuals are the same based solely on current information on hand. However, there may be quite reasonable bases or methods that the two individuals are likely the same without being one hundred percent sure. umbel:isLike has the semantics of likely identity, but where there is some uncertainty that the two resources indeed refer to the exact same individual with the same identity. Such uncertainty can arise when, for example, common names may be used for different individuals (e.g., John Smith). It is appropriate to use this property when there is strong belief the two resources refer to the same individual with the same identity, but that association can not be asserted at the present time with certitude.

relates to plant
property disjoint with: has member
property disjoint with: has time
type: ObjectProperty
property disjoint with: relates to geopolitical entity
property disjoint with: bottomObjectProperty
property disjoint with: relates to natural substance
property disjoint with: relates to structured information
property disjoint with: relates to numbers
property disjoint with: relates to other organism
property disjoint with: has notation
property disjoint with: relates to finance or economy
property disjoint with: relates to facility
property disjoint with: has member list
property disjoint with: has event
property disjoint with: relates to chemistry
property disjoint with: relates to visual information
property disjoint with: has activity
property disjoint with: relates to society
property disjoint with: relates to natural phenomenon
sub property of: topObjectProperty
property disjoint with: has workplace
property disjoint with: relates to disease
property disjoint with: relates to extraterrestrial entity
property disjoint with: relates to animal
property disjoint with: has organization type
property disjoint with: has top concept
property disjoint with: relates to earthscape
property disjoint with: relates to audio information
property disjoint with: has person type
domain: Thing
range: plants
definition: This predicate relates an external entity to the SuperType (ST) shown. It indicates there is a relationship to the ST of a verifiable nature, but which is undetermined as to strength or a full rdf:type relationship.

relates to society
property disjoint with: relates to extraterrestrial entity
property disjoint with: relates to numbers
property disjoint with: relates to natural substance
property disjoint with: relates to chemistry
property disjoint with: has activity
property disjoint with: relates to visual information
property disjoint with: has product type
property disjoint with: relates to audio information
property disjoint with: has workplace
property disjoint with: relates to disease
property disjoint with: has member
property disjoint with: has member list
property disjoint with: relates to other organism
property disjoint with: has top concept
property disjoint with: relates to natural phenomenon
property disjoint with: has food drink
property disjoint with: relates to finance or economy
property disjoint with: relates to drug
property disjoint with: has notation
property disjoint with: has event
type: ObjectProperty
property disjoint with: relates to structured information
property disjoint with: has time
property disjoint with: relates to facility
property disjoint with: bottomObjectProperty
property disjoint with: relates to plant
sub property of: topObjectProperty
property disjoint with: relates to geopolitical entity
property disjoint with: relates to earthscape
domain: Thing
range: society
definition: This predicate relates an external entity to the SuperType (ST) shown. It indicates there is a relationship to the ST of a verifiable nature, but which is undetermined as to strength or a full rdf:type relationship.

has characteristic
type: AnnotationProperty
definition: The property umbel:hasCharacteristic is used to assert the relation between a Reference Concept and external properties that may be used in external ontologies to characterize, describe, or provide attributes for data records associated with that concept. It is via this property or its inverse, umbel:isCharacteristicOf, that external data characterizations may be incorporated and modeled within a domain ontology based on the UMBEL vocabulary.

editorial note
definition: A note for an editor, translator or maintainer of the vocabulary.
type: AnnotationProperty
type: Property

note
definition: A general note, for any purpose.
scope note: This property may be used directly, or as a super-property for more specific note types.
type: AnnotationProperty
type: Property

alternative label
definition: An alternative lexical label for a resource.
example: Acronyms, abbreviations, spelling variants, and irregular plural/singular forms may be included among the alternative labels for a concept. Mis-spelled terms are normally included as hidden labels (see skos:hiddenLabel).
comment: The range of skos:altLabel is the class of RDF plain literals.
comment: skos:prefLabel, skos:altLabel and skos:hiddenLabel are pairwise disjoint properties.
type: Property
type: AnnotationProperty

example
definition: An example of the use of a concept.
type: AnnotationProperty
type: Property

Upper Mapping and Binding Exchange Layer (UMBEL) Vocabulary
creator: Ontotext AD
creator: Structured Dynamics LLC
preferred namespace prefix: com.hp.hpl.jena.datatypes.BaseDatatype$TypedValue@5281e234
preferred namespace uri: com.hp.hpl.jena.datatypes.BaseDatatype$TypedValue@840e2ac9
type: Ontology
imports: skos-owl1-dl.rdf
version IRI: v100#
definition: UMBEL (Upper Mapping and Binding Exchange Layer) vocabulary provides a general vocabulary (the UMBEL "vocabulary") of classes and predicates for describing domain ontologies, with the specific aim of promoting interoperability with external datasets and domains.

definition
definition: A statement or formal explanation of the meaning of a concept.
type: Property
type: AnnotationProperty

preferred label
definition: The preferred lexical label for a resource, in a given language.
comment: A resource has no more than one value of skos:prefLabel per language tag, and no more than one value of skos:prefLabel without language tag.
comment: The range of skos:prefLabel is the class of RDF plain literals.
comment: skos:prefLabel, skos:altLabel and skos:hiddenLabel are pairwise disjoint properties.
type: Property
type: AnnotationProperty

scope note
definition: A note that helps to clarify the meaning and/or the use of a concept.
type: AnnotationProperty
type: Property

history note
definition: A note about the past state/use/meaning of a concept.
type: AnnotationProperty
type: Property

change note
definition: A note about a modification to a concept.
type: AnnotationProperty
type: Property

is characteristic of
type: AnnotationProperty
definition: The property umbel:isCharacteristicOf is used to assert the relation between a property and a Reference Concept (or its punned individual) to which it applies. Such properties may be used in external ontologies to characterize, describe, or provide attributes for data records associated with that concept. It is via this property or its inverse, umbel:hasCharacteristic, that external data characterizations may be incorporated and modeled within a domain ontology based on the UMBEL vocabulary.

hidden label
definition: A lexical label for a resource that should be hidden when generating visual displays of the resource, but should still be accessible to free text search operations.
type: AnnotationProperty
comment: The range of skos:hiddenLabel is the class of RDF plain literals.
comment: skos:prefLabel, skos:altLabel and skos:hiddenLabel are pairwise disjoint properties.
type: Property