http://lodlaundromat.org/.well-known/genid/2d08f44861fc6eb7c0bf70ed42c7dcb9#100
type: Restriction
max cardinality: 1
on property: name

http://lodlaundromat.org/.well-known/genid/2d08f44861fc6eb7c0bf70ed42c7dcb9#101
type: Restriction
max cardinality: 1
on property: id

http://lodlaundromat.org/.well-known/genid/2d08f44861fc6eb7c0bf70ed42c7dcb9#102
type: Restriction
max cardinality: 1
on property: revision

http://lodlaundromat.org/.well-known/genid/2d08f44861fc6eb7c0bf70ed42c7dcb9#104
type: Restriction
max cardinality: 1
on property: normative URL

http://lodlaundromat.org/.well-known/genid/2d08f44861fc6eb7c0bf70ed42c7dcb9#105
type: Restriction
min cardinality: 0
on property: url

http://lodlaundromat.org/.well-known/genid/2d08f44861fc6eb7c0bf70ed42c7dcb9#107
type: Restriction
max cardinality: 1
on property: title

http://lodlaundromat.org/.well-known/genid/2d08f44861fc6eb7c0bf70ed42c7dcb9#108
type: Restriction
max cardinality: 1
on property: documented at

http://lodlaundromat.org/.well-known/genid/2d08f44861fc6eb7c0bf70ed42c7dcb9#109
type: Restriction
max cardinality: 1
on property: dateCreated

http://lodlaundromat.org/.well-known/genid/2d08f44861fc6eb7c0bf70ed42c7dcb9#10
type: Restriction
max cardinality: 1
on property: title

http://lodlaundromat.org/.well-known/genid/2d08f44861fc6eb7c0bf70ed42c7dcb9#110
type: Restriction
max cardinality: 1
on property: has governance

http://lodlaundromat.org/.well-known/genid/2d08f44861fc6eb7c0bf70ed42c7dcb9#111
type: Restriction
max cardinality: 1
on property: name

http://lodlaundromat.org/.well-known/genid/2d08f44861fc6eb7c0bf70ed42c7dcb9#112
type: Restriction
max cardinality: 1
on property: id

http://lodlaundromat.org/.well-known/genid/2d08f44861fc6eb7c0bf70ed42c7dcb9#113
type: Restriction
max cardinality: 1
on property: has logo

http://lodlaundromat.org/.well-known/genid/2d08f44861fc6eb7c0bf70ed42c7dcb9#114
type: Restriction
max cardinality: 1
on property: has owner

http://lodlaundromat.org/.well-known/genid/2d08f44861fc6eb7c0bf70ed42c7dcb9#115
type: Restriction
max cardinality: 1
on property: is FOSS

http://lodlaundromat.org/.well-known/genid/2d08f44861fc6eb7c0bf70ed42c7dcb9#116
type: Restriction
max cardinality: 1
on property: has confidentiality

http://lodlaundromat.org/.well-known/genid/2d08f44861fc6eb7c0bf70ed42c7dcb9#117
type: Restriction
cardinality: 1
on property: has protocol

http://lodlaundromat.org/.well-known/genid/2d08f44861fc6eb7c0bf70ed42c7dcb9#11
type: Restriction
min cardinality: 0
on property: url

http://lodlaundromat.org/.well-known/genid/2d08f44861fc6eb7c0bf70ed42c7dcb9#126
type: Restriction
cardinality: 1
on property: has approval status

http://lodlaundromat.org/.well-known/genid/2d08f44861fc6eb7c0bf70ed42c7dcb9#127
type: Restriction
max cardinality: 1
on property: is ITAR

http://lodlaundromat.org/.well-known/genid/2d08f44861fc6eb7c0bf70ed42c7dcb9#12
type: Restriction
max cardinality: 1
on property: description

http://lodlaundromat.org/.well-known/genid/2d08f44861fc6eb7c0bf70ed42c7dcb9#131
type: Restriction
max cardinality: 1
on property: image map

http://lodlaundromat.org/.well-known/genid/2d08f44861fc6eb7c0bf70ed42c7dcb9#132
type: Restriction
max cardinality: 1
on property: width

http://lodlaundromat.org/.well-known/genid/2d08f44861fc6eb7c0bf70ed42c7dcb9#133
type: Restriction
max cardinality: 1
on property: height

http://lodlaundromat.org/.well-known/genid/2d08f44861fc6eb7c0bf70ed42c7dcb9#134
type: Restriction
max cardinality: 1
on property: caption

http://lodlaundromat.org/.well-known/genid/2d08f44861fc6eb7c0bf70ed42c7dcb9#135
type: Restriction
cardinality: 1
on property: image

http://lodlaundromat.org/.well-known/genid/2d08f44861fc6eb7c0bf70ed42c7dcb9#13
type: Restriction
max cardinality: 1
on property: name

http://lodlaundromat.org/.well-known/genid/2d08f44861fc6eb7c0bf70ed42c7dcb9#144
type: Restriction
min cardinality: 1
on property: has stakeholder

http://lodlaundromat.org/.well-known/genid/2d08f44861fc6eb7c0bf70ed42c7dcb9#14
type: Restriction
max cardinality: 1
on property: dateCreated

http://lodlaundromat.org/.well-known/genid/2d08f44861fc6eb7c0bf70ed42c7dcb9#156
type: Restriction
cardinality: 1
on property: performed by

http://lodlaundromat.org/.well-known/genid/2d08f44861fc6eb7c0bf70ed42c7dcb9#15
type: Restriction
max cardinality: 1
on property: lastUpdated

http://lodlaundromat.org/.well-known/genid/2d08f44861fc6eb7c0bf70ed42c7dcb9#161
type: Restriction
max cardinality: 1
on property: id

http://lodlaundromat.org/.well-known/genid/2d08f44861fc6eb7c0bf70ed42c7dcb9#162
type: Restriction
max cardinality: 1
on property: has approval process

http://lodlaundromat.org/.well-known/genid/2d08f44861fc6eb7c0bf70ed42c7dcb9#164
type: Restriction
cardinality: 1
on property: is governed by

http://lodlaundromat.org/.well-known/genid/2d08f44861fc6eb7c0bf70ed42c7dcb9#168
type: Restriction
max cardinality: 1
on property: has change management process

http://lodlaundromat.org/.well-known/genid/2d08f44861fc6eb7c0bf70ed42c7dcb9#177
type: Restriction
max cardinality: 1
on property: has issue resolution process

http://lodlaundromat.org/.well-known/genid/2d08f44861fc6eb7c0bf70ed42c7dcb9#178
type: Restriction
cardinality: 3
on property: has process

http://lodlaundromat.org/.well-known/genid/2d08f44861fc6eb7c0bf70ed42c7dcb9#17
type: Restriction
max cardinality: 1
on property: has maturity

http://lodlaundromat.org/.well-known/genid/2d08f44861fc6eb7c0bf70ed42c7dcb9#19
type: Restriction
max cardinality: 1
on property: has accredidation

http://lodlaundromat.org/.well-known/genid/2d08f44861fc6eb7c0bf70ed42c7dcb9#1
type: Restriction
max cardinality: 1
on property: name

http://lodlaundromat.org/.well-known/genid/2d08f44861fc6eb7c0bf70ed42c7dcb9#21
type: Restriction
max cardinality: 1
on property: usage

http://lodlaundromat.org/.well-known/genid/2d08f44861fc6eb7c0bf70ed42c7dcb9#27
type: Restriction
max cardinality: 1
on property: url

http://lodlaundromat.org/.well-known/genid/2d08f44861fc6eb7c0bf70ed42c7dcb9#28
type: Restriction
cardinality: 1
on property: curated graph URI

http://lodlaundromat.org/.well-known/genid/2d08f44861fc6eb7c0bf70ed42c7dcb9#2
type: Restriction
max cardinality: 1
on property: id

http://lodlaundromat.org/.well-known/genid/2d08f44861fc6eb7c0bf70ed42c7dcb9#30
type: Restriction
cardinality: 1
on property: namespace

http://lodlaundromat.org/.well-known/genid/2d08f44861fc6eb7c0bf70ed42c7dcb9#33
type: Restriction
cardinality: 1
on property: namespacePrefix

http://lodlaundromat.org/.well-known/genid/2d08f44861fc6eb7c0bf70ed42c7dcb9#34
type: Restriction
max cardinality: 1
on property: hasLicenseType

http://lodlaundromat.org/.well-known/genid/2d08f44861fc6eb7c0bf70ed42c7dcb9#36
type: Restriction
max cardinality: 1
on property: downloads

http://lodlaundromat.org/.well-known/genid/2d08f44861fc6eb7c0bf70ed42c7dcb9#37
type: Restriction
max cardinality: 1
on property: url of turtle file

http://lodlaundromat.org/.well-known/genid/2d08f44861fc6eb7c0bf70ed42c7dcb9#39
type: Restriction
max cardinality: 1
on property: hasGraphRole

http://lodlaundromat.org/.well-known/genid/2d08f44861fc6eb7c0bf70ed42c7dcb9#3
type: Restriction
max cardinality: 1
on property: name

http://lodlaundromat.org/.well-known/genid/2d08f44861fc6eb7c0bf70ed42c7dcb9#41
type: Restriction
max cardinality: 1
on property: has logo

http://lodlaundromat.org/.well-known/genid/2d08f44861fc6eb7c0bf70ed42c7dcb9#42
type: Restriction
max cardinality: 1
on property: url address of RDF file

http://lodlaundromat.org/.well-known/genid/2d08f44861fc6eb7c0bf70ed42c7dcb9#44
type: Restriction
cardinality: 1
on property: attribution text

http://lodlaundromat.org/.well-known/genid/2d08f44861fc6eb7c0bf70ed42c7dcb9#47
type: Restriction
max cardinality: 1
on property: revision

http://lodlaundromat.org/.well-known/genid/2d08f44861fc6eb7c0bf70ed42c7dcb9#49
type: Restriction
min cardinality: 1
on property: source

http://lodlaundromat.org/.well-known/genid/2d08f44861fc6eb7c0bf70ed42c7dcb9#4
type: Restriction
max cardinality: 1
on property: id

http://lodlaundromat.org/.well-known/genid/2d08f44861fc6eb7c0bf70ed42c7dcb9#51
type: Restriction
min cardinality: 0
on property: derived from

http://lodlaundromat.org/.well-known/genid/2d08f44861fc6eb7c0bf70ed42c7dcb9#52
type: Restriction
max cardinality: 1
on property: has pedigree

http://lodlaundromat.org/.well-known/genid/2d08f44861fc6eb7c0bf70ed42c7dcb9#57
type: Restriction
cardinality: 1
on property: timestamp

http://lodlaundromat.org/.well-known/genid/2d08f44861fc6eb7c0bf70ed42c7dcb9#59
type: Restriction
max cardinality: 1
on property: lastUpdated

http://lodlaundromat.org/.well-known/genid/2d08f44861fc6eb7c0bf70ed42c7dcb9#60
type: Restriction
cardinality: 1
on property: user ID

http://lodlaundromat.org/.well-known/genid/2d08f44861fc6eb7c0bf70ed42c7dcb9#61
type: Restriction
max cardinality: 1
on property: priority

http://lodlaundromat.org/.well-known/genid/2d08f44861fc6eb7c0bf70ed42c7dcb9#63
type: Restriction
cardinality: 1
on property: title

http://lodlaundromat.org/.well-known/genid/2d08f44861fc6eb7c0bf70ed42c7dcb9#64
type: Restriction
cardinality: 1
on property: disposition

http://lodlaundromat.org/.well-known/genid/2d08f44861fc6eb7c0bf70ed42c7dcb9#65
type: Restriction
cardinality: 1
on property: has status

http://lodlaundromat.org/.well-known/genid/2d08f44861fc6eb7c0bf70ed42c7dcb9#66
type: Restriction
max cardinality: 1
on property: id

http://lodlaundromat.org/.well-known/genid/2d08f44861fc6eb7c0bf70ed42c7dcb9#67
type: Restriction
max cardinality: 1
on property: description

http://lodlaundromat.org/.well-known/genid/2d08f44861fc6eb7c0bf70ed42c7dcb9#70
type: Restriction
max cardinality: 1
on property: has logo

http://lodlaundromat.org/.well-known/genid/2d08f44861fc6eb7c0bf70ed42c7dcb9#72
type: Restriction
min cardinality: 0
on property: url

http://lodlaundromat.org/.well-known/genid/2d08f44861fc6eb7c0bf70ed42c7dcb9#73
type: Restriction
max cardinality: 1
on property: has logo

http://lodlaundromat.org/.well-known/genid/2d08f44861fc6eb7c0bf70ed42c7dcb9#76
type: Restriction
max cardinality: 1
on property: name

http://lodlaundromat.org/.well-known/genid/2d08f44861fc6eb7c0bf70ed42c7dcb9#77
type: Restriction
max cardinality: 1
on property: id

http://lodlaundromat.org/.well-known/genid/2d08f44861fc6eb7c0bf70ed42c7dcb9#78
type: Restriction
max cardinality: 1
on property: image

http://lodlaundromat.org/.well-known/genid/2d08f44861fc6eb7c0bf70ed42c7dcb9#79
type: Restriction
max cardinality: 1
on property: url

http://lodlaundromat.org/.well-known/genid/2d08f44861fc6eb7c0bf70ed42c7dcb9#81
type: Restriction
max cardinality: 1
on property: acronym

http://lodlaundromat.org/.well-known/genid/2d08f44861fc6eb7c0bf70ed42c7dcb9#84
type: Restriction
max cardinality: 1
on property: has logo

http://lodlaundromat.org/.well-known/genid/2d08f44861fc6eb7c0bf70ed42c7dcb9#86
type: Restriction
cardinality: 1
on property: name

http://lodlaundromat.org/.well-known/genid/2d08f44861fc6eb7c0bf70ed42c7dcb9#87
type: Restriction
max cardinality: 1
on property: url

http://lodlaundromat.org/.well-known/genid/2d08f44861fc6eb7c0bf70ed42c7dcb9#89
type: Restriction
max cardinality: 1
on property: description

http://lodlaundromat.org/.well-known/genid/2d08f44861fc6eb7c0bf70ed42c7dcb9#90
type: Restriction
max cardinality: 1
on property: id

http://lodlaundromat.org/.well-known/genid/2d08f44861fc6eb7c0bf70ed42c7dcb9#91
type: Restriction
max cardinality: 1
on property: event date

http://lodlaundromat.org/.well-known/genid/2d08f44861fc6eb7c0bf70ed42c7dcb9#92
type: Restriction
max cardinality: 1
on property: end date

http://lodlaundromat.org/.well-known/genid/2d08f44861fc6eb7c0bf70ed42c7dcb9#93
type: Restriction
max cardinality: 1
on property: name

http://lodlaundromat.org/.well-known/genid/2d08f44861fc6eb7c0bf70ed42c7dcb9#95
type: Restriction
max cardinality: 1
on property: start date

http://lodlaundromat.org/.well-known/genid/2d08f44861fc6eb7c0bf70ed42c7dcb9#96
type: Restriction
max cardinality: 1
on property: instigated by

http://lodlaundromat.org/.well-known/genid/2d08f44861fc6eb7c0bf70ed42c7dcb9#97
type: Restriction
max cardinality: 1
on property: has provenance

http://lodlaundromat.org/.well-known/genid/2d08f44861fc6eb7c0bf70ed42c7dcb9#98
type: Restriction
max cardinality: 1
on property: description

http://lodlaundromat.org/.well-known/genid/2d08f44861fc6eb7c0bf70ed42c7dcb9#99
type: Restriction
max cardinality: 1
on property: lastUpdated

subject
type: AnnotationProperty
range: string

title
type: AnnotationProperty
range: string

VOID Dataset
description: A set of RDF triples that are published, maintained or aggregated by a single provider.
type: Class
subclass of: Governed Object

Vocabulary Of Attribution and Governance
author: Ralph Hodgson
subject: Licensing, Attribution and Governance
intent: Provides a schema for intellectual capital rights, attribution and governance. Uses the PROVO ontology for provenance. Typical use of the ontology is to refer to its resources, as opposed to importing the ontology.
date created: 2011-01-31T10:00:00
description: VOAG stands for "Vocabulary Of Attribution and Governance". The ontology is intended to specify licensing, attribution, provenance and governance of an ontology. VOAG captures many common license types and their restrictions. Where a license requires attribution, VOAG provides resources that allow the attribution should be made. Provenance is defined in terms of source and pedigree. A miminal model of governance is provided based on how issues, releases and changes are managed. VOAG does not import, but makes uses of some concepts from VOID (http://vocab.deri.ie/void), notably void:Dataset.
has catalog entry: VOAG Catalog Entry
has graph role: SchemaGraph
last updated: 2012-11-01
name: VOAG
namespace: http://voag.linkedmodel.org/voag
namespace prefix: voag
revision: 1.0
url: http://voag.linkedmodel.org/1.0/owl/schema/voag
uses non imported resource: author
uses non imported resource: contributor
uses non imported resource: description
uses non imported resource: subject
uses non imported resource: title
uses non imported resource: TopQuadrant attribution
uses non imported resource: VOAG Catalog Entry
with attribution to: TopQuadrant attribution
type: Ontology
imports: void
imports: vaem-xics
imports: dtype
imports: vaem-xina
imports: vaem
imports: prov

Accredidation
type: Class
subclass of: Qualifier

Administrative Event
description: An event that is associated with the admistration aspect of governance. Typically these are curation events.
type: Class
subclass of: Event

Annually
value: annual
type: Change frequency

Append change
type: Change type

Approval Event
description: A "Governance Event".
type: Class
subclass of: Event
disjoint with: Rejection Event

Approval Process
description: A "Governance Process".
type: Class
subclass of: Governance Process

Approved Issue
value: approved
type: Issue Status

Assigned role
type: Class
subclass of: Thing

Attributed Source
description: An 'Attribution' specifies how credit should be given when citing the creators of a piece of work. Attribution must use the specified attribution text and optionally use logos that are provided in the attribution details below., with the names of points of contact.
description: The name, url and other details of an attribution.
type: Class
subclass of: http://lodlaundromat.org/.well-known/genid/2d08f44861fc6eb7c0bf70ed42c7dcb9#84
subclass of: http://lodlaundromat.org/.well-known/genid/2d08f44861fc6eb7c0bf70ed42c7dcb9#85
subclass of: http://lodlaundromat.org/.well-known/genid/2d08f44861fc6eb7c0bf70ed42c7dcb9#86
subclass of: http://lodlaundromat.org/.well-known/genid/2d08f44861fc6eb7c0bf70ed42c7dcb9#87
subclass of: http://lodlaundromat.org/.well-known/genid/2d08f44861fc6eb7c0bf70ed42c7dcb9#88
subclass of: Qualifier

Attribution logo
type: Class
subclass of: Logo

Bi monthly
value: bi-monthly
type: Change frequency

Bi quarterly
value: bi-quarterly
type: Change frequency

Bi-Weekly
value: bi-weekly
type: Change frequency

Creative Commons Attribution-Share Alike 3.0 United States License
type: License Model

Creative Commons Commercial Use
description: Exercising rights for commercial purposes
type: Creative Commons Prohibition

High income nation use
description: Use in a non-developing country
type: Creative Commons Prohibition
label: Creative Commons High Income Nation Use

Derivative works
description: Distribution of derivative works
type: Creative Commons Permission
label: Creative Commons Derivative Works

Distribution
description: Creative Commons - distribution, public display, and publicly performance
type: Creative Commons Permission
label: Creative Commons Distribution

Reproduction
description: making multiple copies
type: Creative Commons Permission
label: Creative Commons Reproduction

Sharing
description: permits commercial derivatives, but only non-commercial distribution
type: Creative Commons Permission
label: Creative Commons Sharing

Creative Commons Attribution
description: Credit to be given to copyright holder and/or author
type: Requirement

Creative Commons Copyleft
description: Copyleft is a general method for making a program (or other work) free, and requiring all modified and extended versions of the program to be free as well. The simplest way to make a program free software is to put it in the public domain, uncopyrighted. This allows people to share the program and their improvements, if they are so minded. But it also allows uncooperative people to convert the program into proprietary software. They can make changes, many or few, and distribute the result as a proprietary product. People who receive the program in that modified form do not have the freedom that the original author gave them; the middleman has stripped it away. In the GNU project, Copyleft says that anyone who redistributes the software, with or without changes, must pass along the freedom to further copy and change it. Copyleft guarantees that every user has freedom.
description: combined works must be licensed under specified terms, similar to those on the original work
url: http://www.gnu.org/copyleft/copyleft.html
type: Requirement

Creative Commons Lesser Copyleft
description: derivative works must be licensed under specified terms, with at least the same conditions as the original work; combinations with the work may be licensed under different terms
type: Requirement

Creative Commons Notice
description: copyright and license notices be kept intact
type: Requirement

Creative Commons Share Alike
description: derivative works be licensed under the same terms or compatible terms as the original work
type: Requirement

Creative Commons Source Code
description: Source code (the preferred form for making modifications) must be provided when exercising some rights granted by the license.
type: Requirement

None
code: 0
order: 1
value: none
type: Confidentiality level

Restricted
code: 1
order: 2
value: restricted
description: During and before World War II, the U.S. had a category of classified information called restricted, which was below confidential. The U.S. no longer has a restricted classification, but many other nations and NATO do. The U.S. treats "restricted" information it receives from other governments as confidential. The U.S. does use the term restricted data in a completely different way to refer to nuclear secrets.
type: Confidentiality level

Secret
code: 5
order: 6
value: secret
description: "Secret" shall be applied to information, the unauthorized disclosure of which reasonably could be expected to cause serious damage to the national security that the original classification authority is able to identify or describe [US Executive Order 12958].
type: Confidentiality level

Sensitive but Unclassified
code: 3
order: 4
value: sbu
description: Sensitive but Unclassified (SBU) information should not be disclosed but is not national security information and cannot be classified according to Executive Order (EO)12958, as amended. These materials must be: properly marked, locked up when not under the supervision of an authorized person, and encrypted while in transit over a non-secure network. Some examples are: trade secrets, proprietary information, financial information, personnel and medical records, procurement-sensitive information, IT system security plans, contingency plans, audit logs (recordings of exceptions and other security-related events), vulnerability reports, incident reports and Personally Identifiable Information (PII).
type: Confidentiality level

Top secret
code: 6
order: 7
value: topsecret
description: "Top Secret" shall be applied to information, the unauthorized disclosure of which reasonably could be expected to cause exceptionally grave damage to the national security that the original classification authority is able to identify or describe [US Executive Order 12958].
type: Confidentiality level

Unclassified
code: 2
order: 3
value: unclassified
description: Unclassified is not technically a "classification"; this is the default, and refers to information that can be released to individuals without a clearance (Level 0). Information that is unclassified is sometimes restricted in its dissemination as SBU or FOUO. For example, the "law enforcement bulletins" often reported by the U.S. media when United States Department of Homeland Security raises the U.S. terror threat level are usually classified as "U//LES" or "Unclassified - Law Enforcement Sensitive." This information is only supposed to be released to Law Enforcement groups (Sheriff, Police, etc.) Because the information is unclassified, however, it is sometimes released to the public as well. Information which is unclassified, but which the government does not believe should be subject to Freedom of Information Act requests is often classified as U//FOUO - "Unclassified - For Official Use Only". In addition to FOUO information, information can be categorized according to its availability to be distributed (Distribution D may only be released to approved Department of Defense and Government Contractor personnel). Also, the statement of NOFORN (meaning No Foreign Nationals) is applied to any information which may not be released to any non-US Citizen. NOFORN and Distribution statements are often used in conjunction with classified information or alone on SBU information. Documents subject to export controls have a specific warning to that effect.
type: Confidentiality level

Catalog
description: An index to a set of resources
type: Class
subclass of: http://lodlaundromat.org/.well-known/genid/2d08f44861fc6eb7c0bf70ed42c7dcb9#113
subclass of: Governed Object

Change frequency
type: Class
subclass of: Metadata Enumerated value
one of: http://lodlaundromat.org/.well-known/genid/2d08f44861fc6eb7c0bf70ed42c7dcb9#146

Change Management Process
description: A "Governance Process".
type: Class
subclass of: Governance Process

Change type
description: Change Type provides an indicator for how an artifact has or will change in the future. This indicator is important to understanding the stability of an ontology.
type: Class
subclass of: Metadata Enumerated value

Closed
value: closed
type: Issue Status

Concurrence event
description: A Governance Event.
type: Class
subclass of: Event
disjoint with: Non-Concurrence Event

Confidentiality level
description: An enumerated codelist for values thath pertain to the security of a set of resources, or a resource. In 'lmc' an ontology can carry a property to denote its confidentiality.
type: Class
subclass of: Metadata Enumerated value

Creative commons jurisdiction
description: the legal jurisdiction of a license
type: Class
label: Creative Commons Jurisdiction
subclass of: Thing

Creative Commons Permission
description: An action that may or may not be allowed or desired
type: Class
subclass of: Metadata Enumerated value

Creative Commons Prohibition
description: something you may be asked not to do
type: Class
subclass of: Metadata Enumerated value

Requirement
description: an action that may or may not be requested of you
description: An action that may or may not be requested of you
type: Class
subclass of: Metadata Enumerated value

Creative commons work
description: A potentially copyrightable work
type: Class
label: Creative Commons Work
subclass of: http://lodlaundromat.org/.well-known/genid/2d08f44861fc6eb7c0bf70ed42c7dcb9#27
subclass of: Thing

Daily
type: Change frequency

Deferred
value: deferred
type: Issue Status

Deletion Event
description: A "Archival Event".
type: Class
subclass of: Event

Designated Governance Role
description: A "Assigned Role" with the following instance(s): "Assurer", "Project Management", "Resource & Process Policy", "Technical Definitions", "User", "Verifier".
type: Class
subclass of: http://lodlaundromat.org/.well-known/genid/2d08f44861fc6eb7c0bf70ed42c7dcb9#156
subclass of: http://lodlaundromat.org/.well-known/genid/2d08f44861fc6eb7c0bf70ed42c7dcb9#157
subclass of: Event

Disapproved Issue
type: Issue Status

Document
type: Class
subclass of: http://lodlaundromat.org/.well-known/genid/2d08f44861fc6eb7c0bf70ed42c7dcb9#10
subclass of: http://lodlaundromat.org/.well-known/genid/2d08f44861fc6eb7c0bf70ed42c7dcb9#11
subclass of: http://lodlaundromat.org/.well-known/genid/2d08f44861fc6eb7c0bf70ed42c7dcb9#12
subclass of: http://lodlaundromat.org/.well-known/genid/2d08f44861fc6eb7c0bf70ed42c7dcb9#13
subclass of: http://lodlaundromat.org/.well-known/genid/2d08f44861fc6eb7c0bf70ed42c7dcb9#14
subclass of: http://lodlaundromat.org/.well-known/genid/2d08f44861fc6eb7c0bf70ed42c7dcb9#15
subclass of: Thing

Documentation change
type: Change type

Early adoption
type: Maturity

Metadata Enumerated value
description: The base class in LMC for enumerated values
type: Class
subclass of: EnumeratedValue

Event
type: Class
subclass of: http://lodlaundromat.org/.well-known/genid/2d08f44861fc6eb7c0bf70ed42c7dcb9#89
subclass of: http://lodlaundromat.org/.well-known/genid/2d08f44861fc6eb7c0bf70ed42c7dcb9#90
subclass of: http://lodlaundromat.org/.well-known/genid/2d08f44861fc6eb7c0bf70ed42c7dcb9#91
subclass of: http://lodlaundromat.org/.well-known/genid/2d08f44861fc6eb7c0bf70ed42c7dcb9#92
subclass of: http://lodlaundromat.org/.well-known/genid/2d08f44861fc6eb7c0bf70ed42c7dcb9#93
subclass of: http://lodlaundromat.org/.well-known/genid/2d08f44861fc6eb7c0bf70ed42c7dcb9#94
subclass of: http://lodlaundromat.org/.well-known/genid/2d08f44861fc6eb7c0bf70ed42c7dcb9#95
subclass of: http://lodlaundromat.org/.well-known/genid/2d08f44861fc6eb7c0bf70ed42c7dcb9#96
subclass of: Thing

Experimental
type: Maturity

Figure
description: An illustration of some kind.
type: Class
subclass of: http://lodlaundromat.org/.well-known/genid/2d08f44861fc6eb7c0bf70ed42c7dcb9#131
subclass of: Image

Authorizer
value: authorizer
type: Governance Role

Steward
value: steward
type: Governance Role

Submitter
value: submitter
type: Governance Role

Governance
description: Governance is mainly concerned with how an artifact is provisioned and managed over its lifecycle. Governance also concerns the status tracking and processes that need to exist on information objects and services for a successful initiaitve, mission, program, or project. Such governance needs to outline the relationships between all internal and external groups involved, describe the proper flow of information regarding to all stakeholders, ensure the appropriate review of issues encountered and ensure that required approvals and direction are obtained at each appropriate stage.
type: Class
subclass of: http://lodlaundromat.org/.well-known/genid/2d08f44861fc6eb7c0bf70ed42c7dcb9#114
subclass of: http://lodlaundromat.org/.well-known/genid/2d08f44861fc6eb7c0bf70ed42c7dcb9#115
subclass of: http://lodlaundromat.org/.well-known/genid/2d08f44861fc6eb7c0bf70ed42c7dcb9#116
subclass of: http://lodlaundromat.org/.well-known/genid/2d08f44861fc6eb7c0bf70ed42c7dcb9#117
subclass of: http://lodlaundromat.org/.well-known/genid/2d08f44861fc6eb7c0bf70ed42c7dcb9#118
subclass of: http://lodlaundromat.org/.well-known/genid/2d08f44861fc6eb7c0bf70ed42c7dcb9#119
subclass of: http://lodlaundromat.org/.well-known/genid/2d08f44861fc6eb7c0bf70ed42c7dcb9#120
subclass of: http://lodlaundromat.org/.well-known/genid/2d08f44861fc6eb7c0bf70ed42c7dcb9#121
subclass of: http://lodlaundromat.org/.well-known/genid/2d08f44861fc6eb7c0bf70ed42c7dcb9#122
subclass of: http://lodlaundromat.org/.well-known/genid/2d08f44861fc6eb7c0bf70ed42c7dcb9#123
subclass of: http://lodlaundromat.org/.well-known/genid/2d08f44861fc6eb7c0bf70ed42c7dcb9#124
subclass of: http://lodlaundromat.org/.well-known/genid/2d08f44861fc6eb7c0bf70ed42c7dcb9#125
subclass of: http://lodlaundromat.org/.well-known/genid/2d08f44861fc6eb7c0bf70ed42c7dcb9#126
subclass of: http://lodlaundromat.org/.well-known/genid/2d08f44861fc6eb7c0bf70ed42c7dcb9#127
subclass of: http://lodlaundromat.org/.well-known/genid/2d08f44861fc6eb7c0bf70ed42c7dcb9#128
subclass of: http://lodlaundromat.org/.well-known/genid/2d08f44861fc6eb7c0bf70ed42c7dcb9#129
subclass of: http://lodlaundromat.org/.well-known/genid/2d08f44861fc6eb7c0bf70ed42c7dcb9#130
subclass of: Qualifier

Governance Event
description: A "Governance Event".
type: Class
subclass of: Event

Governance Process
description: A "Process".
type: Class
subclass of: Process

Governance Protocol
description: Governance is used to mean the processes that need to exist for a successful initiaitve, mission, program, or project. Such governance needs to outline the relationships between all internal and external groups involved, describe the proper flow of information regarding to all stakeholders, ensure the appropriate review of issues encountered and ensure that required approvals and direction for a 'GovernedEntity' is obtained at each appropriate stage.
type: Class
subclass of: http://lodlaundromat.org/.well-known/genid/2d08f44861fc6eb7c0bf70ed42c7dcb9#158
subclass of: http://lodlaundromat.org/.well-known/genid/2d08f44861fc6eb7c0bf70ed42c7dcb9#159
subclass of: http://lodlaundromat.org/.well-known/genid/2d08f44861fc6eb7c0bf70ed42c7dcb9#160
subclass of: http://lodlaundromat.org/.well-known/genid/2d08f44861fc6eb7c0bf70ed42c7dcb9#161
subclass of: http://lodlaundromat.org/.well-known/genid/2d08f44861fc6eb7c0bf70ed42c7dcb9#162
subclass of: http://lodlaundromat.org/.well-known/genid/2d08f44861fc6eb7c0bf70ed42c7dcb9#163
subclass of: http://lodlaundromat.org/.well-known/genid/2d08f44861fc6eb7c0bf70ed42c7dcb9#164
subclass of: http://lodlaundromat.org/.well-known/genid/2d08f44861fc6eb7c0bf70ed42c7dcb9#165
subclass of: http://lodlaundromat.org/.well-known/genid/2d08f44861fc6eb7c0bf70ed42c7dcb9#166
subclass of: http://lodlaundromat.org/.well-known/genid/2d08f44861fc6eb7c0bf70ed42c7dcb9#167
subclass of: http://lodlaundromat.org/.well-known/genid/2d08f44861fc6eb7c0bf70ed42c7dcb9#168
subclass of: http://lodlaundromat.org/.well-known/genid/2d08f44861fc6eb7c0bf70ed42c7dcb9#176
subclass of: http://lodlaundromat.org/.well-known/genid/2d08f44861fc6eb7c0bf70ed42c7dcb9#177
subclass of: http://lodlaundromat.org/.well-known/genid/2d08f44861fc6eb7c0bf70ed42c7dcb9#178
subclass of: http://lodlaundromat.org/.well-known/genid/2d08f44861fc6eb7c0bf70ed42c7dcb9#179
subclass of: http://lodlaundromat.org/.well-known/genid/2d08f44861fc6eb7c0bf70ed42c7dcb9#180
subclass of: Qualifier
equivalent class: http://lodlaundromat.org/.well-known/genid/2d08f44861fc6eb7c0bf70ed42c7dcb9#169

Governance Role
description: A "Role" with the following instance(s): "authorizer", "steward", "submitter".
type: Class
subclass of: Metadata Enumerated value

Governed Object
description: An abstract class for all governed entities
type: Class
subclass of: http://lodlaundromat.org/.well-known/genid/2d08f44861fc6eb7c0bf70ed42c7dcb9#100
subclass of: http://lodlaundromat.org/.well-known/genid/2d08f44861fc6eb7c0bf70ed42c7dcb9#101
subclass of: http://lodlaundromat.org/.well-known/genid/2d08f44861fc6eb7c0bf70ed42c7dcb9#102
subclass of: http://lodlaundromat.org/.well-known/genid/2d08f44861fc6eb7c0bf70ed42c7dcb9#103
subclass of: http://lodlaundromat.org/.well-known/genid/2d08f44861fc6eb7c0bf70ed42c7dcb9#104
subclass of: http://lodlaundromat.org/.well-known/genid/2d08f44861fc6eb7c0bf70ed42c7dcb9#105
subclass of: http://lodlaundromat.org/.well-known/genid/2d08f44861fc6eb7c0bf70ed42c7dcb9#106
subclass of: http://lodlaundromat.org/.well-known/genid/2d08f44861fc6eb7c0bf70ed42c7dcb9#107
subclass of: http://lodlaundromat.org/.well-known/genid/2d08f44861fc6eb7c0bf70ed42c7dcb9#108
subclass of: http://lodlaundromat.org/.well-known/genid/2d08f44861fc6eb7c0bf70ed42c7dcb9#109
subclass of: http://lodlaundromat.org/.well-known/genid/2d08f44861fc6eb7c0bf70ed42c7dcb9#110
subclass of: http://lodlaundromat.org/.well-known/genid/2d08f44861fc6eb7c0bf70ed42c7dcb9#97
subclass of: http://lodlaundromat.org/.well-known/genid/2d08f44861fc6eb7c0bf70ed42c7dcb9#98
subclass of: http://lodlaundromat.org/.well-known/genid/2d08f44861fc6eb7c0bf70ed42c7dcb9#99
subclass of: Entity

Governed service
type: Class
subclass of: Service

Graph
description: A set of RDF triples in an ontology graph specified according to VOAG.
type: Class
subclass of: http://lodlaundromat.org/.well-known/genid/2d08f44861fc6eb7c0bf70ed42c7dcb9#28
subclass of: http://lodlaundromat.org/.well-known/genid/2d08f44861fc6eb7c0bf70ed42c7dcb9#29
subclass of: http://lodlaundromat.org/.well-known/genid/2d08f44861fc6eb7c0bf70ed42c7dcb9#30
subclass of: http://lodlaundromat.org/.well-known/genid/2d08f44861fc6eb7c0bf70ed42c7dcb9#31
subclass of: http://lodlaundromat.org/.well-known/genid/2d08f44861fc6eb7c0bf70ed42c7dcb9#32
subclass of: http://lodlaundromat.org/.well-known/genid/2d08f44861fc6eb7c0bf70ed42c7dcb9#33
subclass of: http://lodlaundromat.org/.well-known/genid/2d08f44861fc6eb7c0bf70ed42c7dcb9#34
subclass of: http://lodlaundromat.org/.well-known/genid/2d08f44861fc6eb7c0bf70ed42c7dcb9#35
subclass of: http://lodlaundromat.org/.well-known/genid/2d08f44861fc6eb7c0bf70ed42c7dcb9#36
subclass of: http://lodlaundromat.org/.well-known/genid/2d08f44861fc6eb7c0bf70ed42c7dcb9#37
subclass of: http://lodlaundromat.org/.well-known/genid/2d08f44861fc6eb7c0bf70ed42c7dcb9#38
subclass of: http://lodlaundromat.org/.well-known/genid/2d08f44861fc6eb7c0bf70ed42c7dcb9#39
subclass of: http://lodlaundromat.org/.well-known/genid/2d08f44861fc6eb7c0bf70ed42c7dcb9#40
subclass of: http://lodlaundromat.org/.well-known/genid/2d08f44861fc6eb7c0bf70ed42c7dcb9#41
subclass of: http://lodlaundromat.org/.well-known/genid/2d08f44861fc6eb7c0bf70ed42c7dcb9#42
subclass of: http://lodlaundromat.org/.well-known/genid/2d08f44861fc6eb7c0bf70ed42c7dcb9#43
subclass of: http://lodlaundromat.org/.well-known/genid/2d08f44861fc6eb7c0bf70ed42c7dcb9#44
subclass of: http://lodlaundromat.org/.well-known/genid/2d08f44861fc6eb7c0bf70ed42c7dcb9#45
subclass of: VOID Dataset

Icon
description: A logo of some kind
type: Class
subclass of: Image

Image
description: Image is a class for figures, pictures, logos, and icons of various kinds
type: Class
subclass of: http://lodlaundromat.org/.well-known/genid/2d08f44861fc6eb7c0bf70ed42c7dcb9#132
subclass of: http://lodlaundromat.org/.well-known/genid/2d08f44861fc6eb7c0bf70ed42c7dcb9#133
subclass of: http://lodlaundromat.org/.well-known/genid/2d08f44861fc6eb7c0bf70ed42c7dcb9#134
subclass of: http://lodlaundromat.org/.well-known/genid/2d08f44861fc6eb7c0bf70ed42c7dcb9#135
subclass of: Thing

In development
type: Maturity

Issue
description: captures issues such as raising of an issue related to a particular entity in a registry
type: Class
subclass of: http://lodlaundromat.org/.well-known/genid/2d08f44861fc6eb7c0bf70ed42c7dcb9#60
subclass of: http://lodlaundromat.org/.well-known/genid/2d08f44861fc6eb7c0bf70ed42c7dcb9#61
subclass of: http://lodlaundromat.org/.well-known/genid/2d08f44861fc6eb7c0bf70ed42c7dcb9#62
subclass of: http://lodlaundromat.org/.well-known/genid/2d08f44861fc6eb7c0bf70ed42c7dcb9#63
subclass of: http://lodlaundromat.org/.well-known/genid/2d08f44861fc6eb7c0bf70ed42c7dcb9#64
subclass of: http://lodlaundromat.org/.well-known/genid/2d08f44861fc6eb7c0bf70ed42c7dcb9#65
subclass of: http://lodlaundromat.org/.well-known/genid/2d08f44861fc6eb7c0bf70ed42c7dcb9#66
subclass of: http://lodlaundromat.org/.well-known/genid/2d08f44861fc6eb7c0bf70ed42c7dcb9#67
subclass of: http://lodlaundromat.org/.well-known/genid/2d08f44861fc6eb7c0bf70ed42c7dcb9#68
subclass of: http://lodlaundromat.org/.well-known/genid/2d08f44861fc6eb7c0bf70ed42c7dcb9#69
subclass of: Thing

Issue Resolution Process
description: A "Governance Process".
type: Class
subclass of: Governance Process

Issue Status
description: The status of an issue: "Closed", "Deferred", "Non issue", "Open", "Resolved".
type: Class
subclass of: Metadata Enumerated value

License Model
description: A License Model describes the licensing conditions associated with a software artifact.
type: Class
subclass of: http://lodlaundromat.org/.well-known/genid/2d08f44861fc6eb7c0bf70ed42c7dcb9#78
subclass of: http://lodlaundromat.org/.well-known/genid/2d08f44861fc6eb7c0bf70ed42c7dcb9#79
subclass of: http://lodlaundromat.org/.well-known/genid/2d08f44861fc6eb7c0bf70ed42c7dcb9#80
subclass of: http://lodlaundromat.org/.well-known/genid/2d08f44861fc6eb7c0bf70ed42c7dcb9#81
subclass of: http://lodlaundromat.org/.well-known/genid/2d08f44861fc6eb7c0bf70ed42c7dcb9#82
subclass of: http://lodlaundromat.org/.well-known/genid/2d08f44861fc6eb7c0bf70ed42c7dcb9#83
subclass of: Governed Object

LinkedModel ICON 200 x 80
caption: LinkedModel Standard ICON
height: 80
width: 200
description: LinkedModel Logo
type: Logo

Logo
description: Logo is ...
type: Class
subclass of: Image

Maturity
type: Class
subclass of: Metadata Enumerated value
union of: http://lodlaundromat.org/.well-known/genid/2d08f44861fc6eb7c0bf70ed42c7dcb9#136

Modification change
type: Change type

Monthly
type: Change frequency

Never
type: Change frequency

No attribution specified
type: Attributed Source

No governance specified
type: Governance

No pedigree specified
type: Pedigree

No provenance specified
type: Provenance

Non-Concurrence Event
description: A "Governance Event".
type: Class
subclass of: Governance Event

Non-issue
value: non-issue
type: Issue Status

Open
value: open
description: An issue with undetermined disposition,
type: Issue Status

Organization
type: Class
subclass of: http://lodlaundromat.org/.well-known/genid/2d08f44861fc6eb7c0bf70ed42c7dcb9#72
subclass of: http://lodlaundromat.org/.well-known/genid/2d08f44861fc6eb7c0bf70ed42c7dcb9#73
subclass of: http://lodlaundromat.org/.well-known/genid/2d08f44861fc6eb7c0bf70ed42c7dcb9#74
subclass of: Party
subclass of: Organization

Organization logo
description: A logo for an organization
type: Class
subclass of: Logo

Draft Status
value: draft
type: Publication Status

Final Status
type: Publication Status

Interim Status
value: interim
type: Publication Status

Obsolete
value: obsolete
type: Publication Status

Review
value: review
type: Publication Status

Unknown Status
value: unknown
type: Publication Status

High priority
value: high
type: Priority value

Low priority
value: low
type: Priority value

Medium priority
value: medium
type: Priority value

Not Applicable
value: na
type: Priority value

TBD
value: tbd
type: Priority value

Party
type: Class
subclass of: http://lodlaundromat.org/.well-known/genid/2d08f44861fc6eb7c0bf70ed42c7dcb9#1
subclass of: http://lodlaundromat.org/.well-known/genid/2d08f44861fc6eb7c0bf70ed42c7dcb9#2

Pedigree
description: The origin or source of something. The primary purpose of provenance is to capture the time, place, and if appropriate the person responsible, for the creation, production or provisioning of some information object.
description: Pedigree captures aspects of an artifact that have to do with maturity, quality, salience, and accredidation.
type: Class
subclass of: http://lodlaundromat.org/.well-known/genid/2d08f44861fc6eb7c0bf70ed42c7dcb9#16
subclass of: http://lodlaundromat.org/.well-known/genid/2d08f44861fc6eb7c0bf70ed42c7dcb9#17
subclass of: http://lodlaundromat.org/.well-known/genid/2d08f44861fc6eb7c0bf70ed42c7dcb9#18
subclass of: http://lodlaundromat.org/.well-known/genid/2d08f44861fc6eb7c0bf70ed42c7dcb9#19
subclass of: http://lodlaundromat.org/.well-known/genid/2d08f44861fc6eb7c0bf70ed42c7dcb9#20
subclass of: http://lodlaundromat.org/.well-known/genid/2d08f44861fc6eb7c0bf70ed42c7dcb9#21
subclass of: Qualifier

Person
type: Class
subclass of: Party
subclass of: Person

Priority value
type: Class
subclass of: Metadata Enumerated value

Process
type: Class
subclass of: http://lodlaundromat.org/.well-known/genid/2d08f44861fc6eb7c0bf70ed42c7dcb9#76
subclass of: http://lodlaundromat.org/.well-known/genid/2d08f44861fc6eb7c0bf70ed42c7dcb9#77
subclass of: Thing

Product logo
description: Product logo is used for products, solutions, etc.
type: Class
subclass of: Logo

Proposed
type: Maturity

Provenance
description: The origin or source of something. The primary purpose of provenance is to capture the time, place, and if appropriate the person responsible, for the creation, production or provisioning of some information object.
description: Provenance specifies the origin or source of some artifact. The primary purpose of provenance is to capture the time, place, and if appropriate the person responsible, for the creation, production or provisioning of The artifact. Provenance also captures a record of how a version may have been superceded by another version of the artifact.
type: Class
subclass of: http://lodlaundromat.org/.well-known/genid/2d08f44861fc6eb7c0bf70ed42c7dcb9#46
subclass of: http://lodlaundromat.org/.well-known/genid/2d08f44861fc6eb7c0bf70ed42c7dcb9#47
subclass of: http://lodlaundromat.org/.well-known/genid/2d08f44861fc6eb7c0bf70ed42c7dcb9#48
subclass of: http://lodlaundromat.org/.well-known/genid/2d08f44861fc6eb7c0bf70ed42c7dcb9#49
subclass of: http://lodlaundromat.org/.well-known/genid/2d08f44861fc6eb7c0bf70ed42c7dcb9#50
subclass of: http://lodlaundromat.org/.well-known/genid/2d08f44861fc6eb7c0bf70ed42c7dcb9#51
subclass of: http://lodlaundromat.org/.well-known/genid/2d08f44861fc6eb7c0bf70ed42c7dcb9#52
subclass of: http://lodlaundromat.org/.well-known/genid/2d08f44861fc6eb7c0bf70ed42c7dcb9#53
subclass of: http://lodlaundromat.org/.well-known/genid/2d08f44861fc6eb7c0bf70ed42c7dcb9#57
subclass of: http://lodlaundromat.org/.well-known/genid/2d08f44861fc6eb7c0bf70ed42c7dcb9#58
subclass of: http://lodlaundromat.org/.well-known/genid/2d08f44861fc6eb7c0bf70ed42c7dcb9#59
subclass of: Qualifier

Publication Status
type: Class
subclass of: Metadata Enumerated value

Qualifier
type: Class
subclass of: http://lodlaundromat.org/.well-known/genid/2d08f44861fc6eb7c0bf70ed42c7dcb9#3
subclass of: http://lodlaundromat.org/.well-known/genid/2d08f44861fc6eb7c0bf70ed42c7dcb9#4
subclass of: Thing

Quarterly
type: Change frequency

RDF Icon 32 X 35
caption: RDF Standard ICON
height: 35
width: 32
description: RDF Standard
type: Icon

Refactoring change
type: Change type

Rejection Event
description: A "Governance Event".
type: Class
subclass of: Event

Resolved
value: resolved
type: Issue Status

Retreival Event
description: A "Archival Event".
type: Class
subclass of: Event

Review
description: A "Governance Event".
type: Class
subclass of: http://lodlaundromat.org/.well-known/genid/2d08f44861fc6eb7c0bf70ed42c7dcb9#75
subclass of: Governance Event

SPARQL ICON 80 X 15
caption: SPARQL Standard ICON
height: 15
width: 80
description: SPARQL Standard
type: Icon

Schema graph
type: Class
subclass of: http://lodlaundromat.org/.well-known/genid/2d08f44861fc6eb7c0bf70ed42c7dcb9#26
subclass of: Graph
equivalent class: http://lodlaundromat.org/.well-known/genid/2d08f44861fc6eb7c0bf70ed42c7dcb9#22

Service
type: Class
subclass of: http://lodlaundromat.org/.well-known/genid/2d08f44861fc6eb7c0bf70ed42c7dcb9#111
subclass of: http://lodlaundromat.org/.well-known/genid/2d08f44861fc6eb7c0bf70ed42c7dcb9#112
subclass of: Thing

Some adoption
type: Maturity

Stakeholder Group
description: A Stakeholder Group is a party of people who have common interests and concerns.
type: Class
subclass of: http://lodlaundromat.org/.well-known/genid/2d08f44861fc6eb7c0bf70ed42c7dcb9#144
subclass of: http://lodlaundromat.org/.well-known/genid/2d08f44861fc6eb7c0bf70ed42c7dcb9#145
subclass of: Party
subclass of: Organization
equivalent class: http://lodlaundromat.org/.well-known/genid/2d08f44861fc6eb7c0bf70ed42c7dcb9#143

Standard
description: An industry, de facto or de jure standard
type: Class
subclass of: http://lodlaundromat.org/.well-known/genid/2d08f44861fc6eb7c0bf70ed42c7dcb9#70
subclass of: http://lodlaundromat.org/.well-known/genid/2d08f44861fc6eb7c0bf70ed42c7dcb9#71
subclass of: Governed Object

TopQuadrant attribution
has logo: TopQuadrant Logo 613 x 150
point of contact: Ralph Hodgson, TopQuadrant, Inc.
url: http://www.topquadrant.com
name: TopQuadrant, Inc.
type: Attributed Source

TopQuadrant Logo 613 x 150
height: 150
width: 613
description: TopQuadrant's logo - diamond with company name to the right
type: Attribution logo
type: Organization logo

Turtle Icon 32 X 35
caption: Turtle ICON
height: 35
width: 32
description: Turtle is a representation format for RDF/OWL.
type: Icon

Uncertain frequency
type: Change frequency

Unknown maturity
type: Maturity

VOAG Catalog Entry
type: Schema graph
type: CatalogEntry

VOAG Logo
caption: VOAG Logo
height: 55
width: 180
type: Product logo

Vocab graph
type: Class
subclass of: http://lodlaundromat.org/.well-known/genid/2d08f44861fc6eb7c0bf70ed42c7dcb9#9
subclass of: Graph
equivalent class: http://lodlaundromat.org/.well-known/genid/2d08f44861fc6eb7c0bf70ed42c7dcb9#5

Weekly
type: Change frequency

Widely adopted
type: Maturity

accountable for
description: An object property used in governance that refers a resource to the party that is accountable for it.
type: ObjectProperty

approves
description: An object property that specifies that a party governs the approval of a resource.
type: ObjectProperty
sub property of: governs
inverse of: is approved by

attribution text
type: DatatypeProperty
range: string

caption
description: A short description, typically used on a table or a figure.
type: DatatypeProperty
range: string

compatible with
type: ObjectProperty
type: SymmetricProperty

curated graph URI
description: The property 'voag:curatedGraphURI' provides a means to specify the base URI of the specific version of the onotlogy that is being documented. In each versioned graph the 'vaem:namespace' carries a URI without a version number.
type: DatatypeProperty
range: anyURI

deprecated on
type: Property
type: AnnotationProperty
domain: License Model
range: dateUnion

derived from
type: Property

disposition
type: DatatypeProperty
comment: used to connect to the text describing disposition of something, for example, a disposition of an issue
range: string

disposition status
description: An object propoert that denotes the state of a governance issue.
type: ObjectProperty
sub property of: has approval status

documented at
description: The property 'vaem:documentedAt' is intended for general use as the name implies. In some cases the property could have scalar values and in other cases may need to refer to a first class concept that holds more information about a documentation resource. For this reason, the type of this property is set as 'rdf:Property' and the property is rangeless.
type: Property

downloads
type: DatatypeProperty
range: integer

end date
type: DatatypeProperty
range: dateUnion

event date
type: DatatypeProperty
range: dateUnion

exclude
type: AnnotationProperty
range: boolean

frequency of change
type: ObjectProperty

gives concurrence for
description: An object property that specifies what a party may need to give consent, in the form of agreement, either written or verbally for in the approval of some govenance concern. This is the inverse property of 'mayNeedConcurrenceFrom' and, as such, may be deprecated in the future.
type: ObjectProperty
sub property of: governs
inverse of: may need concurrence from

governs
description: A super-property of governance properties: 'approves', 'gives concurrence for', 'reviews' and 'witness to'.
type: ObjectProperty
inverse of: is governed by

has accredidation
type: ObjectProperty

has anticipated change type
type: ObjectProperty

has applicable document
description: A document that is of help to application of the subject matter. Documents include specifications, models, standards, guidelines, handbooks and other special publications.
type: ObjectProperty

has approval process
description: An object property that specifies a process that is used for approval in a 'Governance Protocol'.
type: ObjectProperty

has approval status
description: An object property that referes to an enumerated value that denotes the state of an approval.
type: ObjectProperty

has category
type: ObjectProperty

has change management process
description: An object property that specifies a process that is used for managing change in a 'Governance Protocol'.
type: ObjectProperty
sub property of: has process

has change type
type: ObjectProperty

has confidentiality
description: An object property that specifies a level of confidentiality. Typicall the range of this property will be 'voag:Confidentiality'.
type: ObjectProperty

has governance
type: ObjectProperty

has governance event
description: An event associated with governance processes.
type: ObjectProperty

has identifier
type: ObjectProperty

has issue
description: A pointer to an issue that exists on a subject of interest.
type: ObjectProperty
range: Issue

has issue resolution process
type: ObjectProperty
sub property of: has process

has logo
description: A property to reference an image that is used as a logo.
type: ObjectProperty
range: Logo

has maturity
type: ObjectProperty

has normative document
type: ObjectProperty

has ontology architecture diagram
type: ObjectProperty

has owner
type: ObjectProperty

has pedigree
description: A reference to a description about the pedigree of something.
type: ObjectProperty

has process
description: A reference to a process description.
type: ObjectProperty

has protocol
description: A pointer to a record that holds governance information for one or more governed entities. Often governance can be shared across entities.
type: ObjectProperty

has provenance
description: A pointer to a provenance record that details the source, version and time of some subject of interest.
type: ObjectProperty

has reference document
type: ObjectProperty

has stakeholder
type: ObjectProperty

has status
type: ObjectProperty

has steward
description: A pointer to the person that is a curator.
type: ObjectProperty

has value
type: ObjectProperty
range: Resource

height
description: Height is typically used to specify an image's height attribute.
type: DatatypeProperty
range: string

id
type: DatatypeProperty
range: anySimpleType

image
description: The property 'vaem:image' points to an image using a URL.
type: DatatypeProperty
range: anyURI

image map
type: Property

incompatible with
type: ObjectProperty
type: SymmetricProperty

instigated by
type: ObjectProperty

instigating event
type: ObjectProperty

intent
type: DatatypeProperty
range: string

interest in
type: ObjectProperty
inverse of: interest of

is approved by
description: References to which parties approve an entity.
type: ObjectProperty
sub property of: is governed by

is FOSS
description: A boolean property to specify whether or not software is free or open source. Free and open-source software (F/OSS, FOSS) or free/libre/open-source software (FLOSS) is software that is liberally licensed to grant the right of users to use, study, change, and improve its design through the availability of its source code.
type: DatatypeProperty
range: boolean

is governed by
description: A pointer to who is responsible for the governance of some entity of interest. This is a two-way reference with the inverse property 'governs'.
type: ObjectProperty

is ITAR
description: International Traffic in Arms Regulations (ITAR) is a set of United States government regulations that control the export and import of defense-related articles and services on the United States Munitions List. These regulations implement the provisions of the Arms Export Control Act, and are described in Title 22 (Foreign Relations), Chapter I (Department of State), Subchapter M of the Code of Federal Regulations. The Department of State interprets and enforces ITAR. Its goal is to advance national strategic objectives and U.S. foreign policy via the trade controls. For practical purposes, ITAR regulations dictate that information and material pertaining to defense and military related technologies may only be shared with US Persons unless approval from the Department of State is received or a special exemption is used.
type: DatatypeProperty
type: DeprecatedProperty
range: boolean

interest of
description: A pointer to parties who have an interest in an entity. This is a two-way reference with the inverse property 'interestIn'.
type: ObjectProperty

jurisdiction
type: Property
type: ObjectProperty
domain: License Model
range: Creative commons jurisdiction

legalcode
type: Property
type: ObjectProperty
domain: License Model
range: Resource

licence
type: DatatypeProperty
range: string

may need concurrence from
description: An object property that specifies that a party may need to give consent, in the form of agreement, either written or verbally to the approval of some govenance concern.
type: ObjectProperty
sub property of: is governed by
inverse of: gives concurrence for

more permissions
type: Property
type: ObjectProperty
domain: Creative commons work
range: Resource

normative reference
type: ObjectProperty

normative URL
type: DatatypeProperty
range: anyURI

obsoleted by
type: ObjectProperty

owned by
type: DatatypeProperty
range: string

owner
type: ObjectProperty

owns
type: ObjectProperty

participant
type: ObjectProperty

performed by
type: ObjectProperty

permits
type: Property
type: ObjectProperty
domain: License Model
range: Creative Commons Permission

point of contact
type: DatatypeProperty
range: string

prepared by
type: ObjectProperty
sub property of: is governed by

priority
type: ObjectProperty

prohibits
type: Property
type: ObjectProperty
domain: License Model
range: Creative Commons Prohibition

proprietary
description: A boolean flag to indicate if an information asset is propretary.
type: DatatypeProperty
range: boolean

related issue
type: ObjectProperty
comment: This property connects two issue events. Issues connected by this property must be about the same subject
domain: Issue
range: Issue

related to
type: ObjectProperty
type: SymmetricProperty

release date
type: DatatypeProperty
range: dateUnion

requires
type: Property
type: ObjectProperty
domain: License Model
range: Requirement

reviewed by
description: References to which parties review a data or information asset.
type: ObjectProperty
sub property of: is governed by
inverse of: reviews

reviews
type: ObjectProperty
sub property of: governs
inverse of: reviewed by

subject
type: DatatypeProperty
range: string

source
type: ObjectProperty

start date
type: DatatypeProperty
range: dateUnion

subject
type: DatatypeProperty
range: string

submitted by
type: ObjectProperty
sub property of: is governed by

superceded by
description: A pointer to one or more 'GovernedEntities' that replace this entity.
type: ObjectProperty
type: TransitiveProperty
inverse of: supercedes

supercedes
description: A pointer to one or more 'GovernedEntities' that are replaced by this entity.
type: ObjectProperty
type: TransitiveProperty
inverse of: superceded by

supervised by
type: ObjectProperty
sub property of: is governed by

timestamp
type: DatatypeProperty
range: dateTime

title
type: DatatypeProperty
range: string

url
type: DatatypeProperty
range: anyURI

url for HTML
type: DatatypeProperty
range: anyURI

url address of RDF file
description: Used to refer to a an RDF XML representation of an ontology
type: DatatypeProperty
range: anyURI

url of turtle file
description: Used to refer to a Turtle (N3) representation of an ontology
type: DatatypeProperty
range: anyURI

usage
type: DatatypeProperty
range: string

use guidelines
type: Property
domain: Creative commons work
range: Resource

used by
description: The property 'usedBy' is a general property to record a dependency. One use is in stating how a schema or a vocabulary is used by another ontology graph.
type: ObjectProperty

user ID
type: DatatypeProperty
range: anySimpleType

width
description: Width is typically used to specify an image's width attribute.
type: DatatypeProperty

witness to
type: ObjectProperty
sub property of: governs
inverse of: wintnessed by

wintnessed by
type: ObjectProperty
sub property of: is governed by

description
range: string