Lecture
subclass of: http://lodlaundromat.org/.well-known/genid/240cd8d701a3c44280314a4f06cca6bb#9
subclass of: http://lodlaundromat.org/.well-known/genid/240cd8d701a3c44280314a4f06cca6bb#15
subclass of: Thing
subclass of: Event
disjoint with: Nothing
subclass of: http://lodlaundromat.org/.well-known/genid/240cd8d701a3c44280314a4f06cca6bb#4
subclass of: http://lodlaundromat.org/.well-known/genid/240cd8d701a3c44280314a4f06cca6bb#63
subclass of: http://lodlaundromat.org/.well-known/genid/240cd8d701a3c44280314a4f06cca6bb#50
subclass of: http://lodlaundromat.org/.well-known/genid/240cd8d701a3c44280314a4f06cca6bb#47
type: Class
description: This class represents lectures with an educational purpose, e.g within a university.
publisher: DERI International
Type: http://www.w3.org/2000/01/rdf-schema#Class
date: 2004-10-20
Rights: http://www.deri.org/privacy.html
creator: DERI International
Coverage: world
Format: application/rdf+xml

Surname
property disjoint with: Chapter
property disjoint with: Number
type: DatatypeProperty
property disjoint with: Pages
property disjoint with: Version
property disjoint with: Publication Date
type: FunctionalProperty
property disjoint with: bottomDataProperty
property disjoint with: Edition
sub property of: topDataProperty
property disjoint with: Volume
Format: application/rdf+xml
Contributor: http://www.w3.org/RDF/Interest/
Coverage: world
Type: http://www.w3.org/2002/07/owl#DatatypeProperty
creator: Libby Miller
Contributor: http://rdfweb.org/mailman/listinfo/rdfweb-dev
comment: "The surname of a person." NOTE: the naming substructure of foaf is currently quite unstable.
domain: Person
range: string
publisher: Libby Miller
publisher: Dan Brickley
creator: Dan Brickley

Topic
disjoint with: Nothing
subclass of: Thing
type: Class
date: 2004-10-20
Format: application/rdf+xml
publisher: DERI International
creator: DERI International
Rights: http://www.deri.org/privacy.html
comment: All research topics inherit from this concept. This should serve as a plugin point for the research topic ontology.
Coverage: world
Type: http://www.w3.org/2000/01/rdf-schema#Class

Chapter
property disjoint with: Goal
type: DatatypeProperty
property disjoint with: Items
property disjoint with: bottomDataProperty
property disjoint with: First Name
property disjoint with: Link
sub property of: topDataProperty
property disjoint with: How Published
property disjoint with: Title
property disjoint with: hasZipcode
type: FunctionalProperty
property disjoint with: POBox
property disjoint with: Street
property disjoint with: Version
property disjoint with: Publication Date
property disjoint with: Description
property disjoint with: Surname
property disjoint with: Complete Name
property disjoint with: Note
range: int
creator: DERI International
comment: The chapter (or section or whatever) number which this Inbook represents.
Format: application/rdf+xml
domain: Inbook
publisher: DERI International
Type: http://www.w3.org/2002/07/owl#DatatypeProperty
Coverage: world
date: 2004-10-20
Rights: http://www.deri.org/privacy.html

date
disjoint with: Nothing
subclass of: Thing
type: Class
publisher: Holger Lausen
creator: Jos de Bruin
publisher: Jos de Bruin
description: "Concept date and its representation according to the Gregorian Calendar." For the excat definition of this class, please refere to http://www.wsmo.org/2004/d3/d3.3/v0.1/ .
creator: Holger Lausen
Rights: http://www.deri.org/privacy.html
creator: DERI International
Type: http://www.w3.org/2000/01/rdf-schema#Class
Coverage: world
Format: application/rdf+xml
publisher: DERI International

Inproceedings
disjoint with: Nothing
subclass of: http://lodlaundromat.org/.well-known/genid/240cd8d701a3c44280314a4f06cca6bb#3
subclass of: Publication
subclass of: http://lodlaundromat.org/.well-known/genid/240cd8d701a3c44280314a4f06cca6bb#45
subclass of: Thing
subclass of: Document
type: Class
date: 2004-10-20
publisher: DERI International
Type: http://www.w3.org/2000/01/rdf-schema#Class
description: An article in a conference proceedings (i.e. Proceedings).
Rights: http://www.deri.org/privacy.html
Coverage: world
creator: DERI International
Format: application/rdf+xml

Items
property disjoint with: Chapter
property disjoint with: Number
property disjoint with: Publication Date
sub property of: topDataProperty
property disjoint with: Version
property disjoint with: Pages
property disjoint with: bottomDataProperty
type: DatatypeProperty
property disjoint with: Edition
type: FunctionalProperty
property disjoint with: Volume
description: "Points to a list of rss:item elements that are members of the subject channel." NOTE: the range is actually rdf:Seq
creator: RSS-DEV Working Group
Format: application/rdf+xml
Coverage: world
Type: http://www.w3.org/2002/07/owl#FunctionalProperty
domain: RSS1.0 News Channel
range: string
publisher: RSS-DEV Working Group

Tasks
sub property of: topObjectProperty
property disjoint with: bottomObjectProperty
type: ObjectProperty
Format: application/rdf+xml
date: 2004-10-20
Type: http://www.w3.org/2002/07/owl#ObjectProperty
comment: The tasks of a member of the administrative staff.
domain: Administrative Staff
Coverage: world
Rights: http://www.deri.org/privacy.html
creator: DERI International
publisher: DERI International
range: Topic

Publisher
description: Examples of a Publisher include a person, an organization, or a service. Typically, the name of a Publisher should be used to indicate the entity.
modified: 2008-01-14
note: A second property with the same name as this property has been declared in the dcterms: namespace (http://purl.org/dc/terms/). See the Introduction to the document "DCMI Metadata Terms" (http://dublincore.org/documents/dcmi-terms/) for an explanation.
issued: 1999-07-02
has version: publisher-006
type: Thing
type: AnnotationProperty
comment: An entity responsible for making the resource available.
type: Property

Presentation
subclass of: Thing
subclass of: http://lodlaundromat.org/.well-known/genid/240cd8d701a3c44280314a4f06cca6bb#50
subclass of: Event
subclass of: http://lodlaundromat.org/.well-known/genid/240cd8d701a3c44280314a4f06cca6bb#15
disjoint with: Nothing
type: Class
subclass of: http://lodlaundromat.org/.well-known/genid/240cd8d701a3c44280314a4f06cca6bb#4
subclass of: http://lodlaundromat.org/.well-known/genid/240cd8d701a3c44280314a4f06cca6bb#63
subclass of: http://lodlaundromat.org/.well-known/genid/240cd8d701a3c44280314a4f06cca6bb#47
publisher: DERI International
Format: application/rdf+xml
date: 2004-10-20
description: This class represents all kinds of presentations.
Coverage: world
creator: DERI International
Rights: http://www.deri.org/privacy.html
Type: http://www.w3.org/2000/01/rdf-schema#Class

How Published
sub property of: topDataProperty
property disjoint with: Version
property disjoint with: Volume
property disjoint with: bottomDataProperty
property disjoint with: Edition
property disjoint with: Number
property disjoint with: Chapter
type: FunctionalProperty
property disjoint with: Pages
property disjoint with: Publication Date
type: DatatypeProperty
comment: How something strange has been published.
publisher: DERI International
range: string
domain: http://lodlaundromat.org/.well-known/genid/240cd8d701a3c44280314a4f06cca6bb#1
Coverage: world
Type: http://www.w3.org/2002/07/owl#FunctionalProperty
date: 2004-10-20
Rights: http://www.deri.org/privacy.html
creator: DERI International
Format: application/rdf+xml

Contains Articles
sub property of: topObjectProperty
property disjoint with: bottomObjectProperty
inverse of: Contained in Journal
type: InverseFunctionalProperty
type: ObjectProperty
Type: http://www.w3.org/2002/07/owl#ObjectProperty
range: Article
domain: Volume
Format: application/rdf+xml
Rights: http://www.deri.org/privacy.html
description: The articles or papers which a journal containes.
Coverage: world
creator: DERI International
publisher: DERI International
date: 2004-10-20

University
disjoint with: Nothing
subclass of: Thing
subclass of: Group
type: Class
subclass of: Organization
subclass of: http://lodlaundromat.org/.well-known/genid/240cd8d701a3c44280314a4f06cca6bb#35
subclass of: http://lodlaundromat.org/.well-known/genid/240cd8d701a3c44280314a4f06cca6bb#63
subclass of: Agent
description: This class represents universities. We decided to introduce two different classes to distinguish between universities and independent research institutes. The main difference is actually the different kinds of independence. In contrast to a university, a research institute is independent from the rigorous bureaucracy of the mainly state-run universities. On the other hand, a university is independent from the economy and the financial support of companies. Thus, the kind of research an independent research institute practises is generally more application-oriented.
Coverage: world
date: 2004-10-20
Type: http://www.w3.org/2000/01/rdf-schema#Class
Rights: http://www.deri.org/privacy.html
publisher: DERI International
Format: application/rdf+xml
creator: DERI International

Deliverables
sub property of: topObjectProperty
property disjoint with: bottomObjectProperty
inverse of: For Project
type: ObjectProperty
creator: DERI International
description: The deliverables for this project. The inverse is forProject .
range: Deliverable
domain: http://lodlaundromat.org/.well-known/genid/240cd8d701a3c44280314a4f06cca6bb#7
Type: http://www.w3.org/2002/07/owl#ObjectProperty
date: 2004-10-20
Rights: http://www.deri.org/privacy.html
Coverage: world
publisher: DERI International
Format: application/rdf+xml

Coverage
description: Spatial topic and spatial applicability may be a named place or a location specified by its geographic coordinates. Temporal topic may be a named period, date, or date range. A jurisdiction may be a named administrative entity or a geographic place to which the resource applies. Recommended best practice is to use a controlled vocabulary such as the Thesaurus of Geographic Names [TGN]. Where appropriate, named places or time periods can be used in preference to numeric identifiers such as sets of coordinates or date ranges.
modified: 2008-01-14
note: A second property with the same name as this property has been declared in the dcterms: namespace (http://purl.org/dc/terms/). See the Introduction to the document "DCMI Metadata Terms" (http://dublincore.org/documents/dcmi-terms/) for an explanation.
issued: 1999-07-02
has version: coverage-006
type: Thing
type: AnnotationProperty
type: Property
comment: The spatial or temporal topic of the resource, the spatial applicability of the resource, or the jurisdiction under which the resource is relevant.

Second
sub property of: topObjectProperty
property disjoint with: bottomObjectProperty
type: ObjectProperty
range: Agent
Coverage: world
Rights: http://www.deri.org/privacy.html
description: The second foaf:Agent in an AgentSequence .
Format: application/rdf+xml
publisher: DERI International
domain: AgentSequence
creator: DERI International
Type: http://www.w3.org/2002/07/owl#ObjectProperty
date: 2004-10-20

interval
disjoint with: Nothing
subclass of: Thing
type: Class
Type: http://www.w3.org/2000/01/rdf-schema#Class
Format: application/rdf+xml
publisher: DERI International
comment: "An interval represents a duration between 2 points in time." For the excat definition of this class, please refere to http://www.wsmo.org/2004/d3/d3.3/v0.1/ .
Rights: http://www.deri.org/privacy.html
creator: Jos de Bruin
publisher: Holger Lausen
Coverage: world
creator: DERI International
creator: Holger Lausen
publisher: Jos de Bruin

Cluster
subclass of: http://lodlaundromat.org/.well-known/genid/240cd8d701a3c44280314a4f06cca6bb#63
subclass of: http://lodlaundromat.org/.well-known/genid/240cd8d701a3c44280314a4f06cca6bb#35
type: Class
disjoint with: Nothing
subclass of: http://lodlaundromat.org/.well-known/genid/240cd8d701a3c44280314a4f06cca6bb#7
subclass of: Thing
subclass of: Agent
subclass of: Group
Format: application/rdf+xml
Coverage: world
date: 2004-10-20
publisher: DERI International
comment: A Cluster is a kind of group which focuses on a research area and typically is part of a research institute or university.
creator: DERI International
Rights: http://www.deri.org/privacy.html
Type: http://www.w3.org/2002/07/owl#Class

At School
sub property of: topObjectProperty
property disjoint with: bottomObjectProperty
type: FunctionalProperty
type: ObjectProperty
Format: application/rdf+xml
Rights: http://www.deri.org/privacy.html
comment: The school where a thesis was written.
Type: http://www.w3.org/2002/07/owl#FunctionalProperty
Coverage: world
publisher: DERI International
date: 2004-10-20
domain: Thesis
creator: DERI International
range: University

City
subclass of: Sub-Continent
subclass of: Location
type: Class
subclass of: Sub-Region
subclass of: Sub-Country
subclass of: Thing
subclass of: http://lodlaundromat.org/.well-known/genid/240cd8d701a3c44280314a4f06cca6bb#63
disjoint with: Nothing
Type: http://www.w3.org/2000/01/rdf-schema#Class
Format: application/rdf+xml
publisher: DERI International
date: 2004-10-20
Coverage: world
comment: This class defines geopraphical bodies that are cities.
creator: DERI International
Rights: http://www.deri.org/privacy.html

Knows
sub property of: topObjectProperty
property disjoint with: bottomObjectProperty
type: ObjectProperty
publisher: Libby Miller
Contributor: http://www.w3.org/RDF/Interest/
Contributor: http://rdfweb.org/mailman/listinfo/rdfweb-dev
creator: Dan Brickley
publisher: Dan Brickley
creator: Libby Miller
description: "A person known by this person (indicating some level of reciprocated interaction between the parties)."
domain: Person
Format: application/rdf+xml
Coverage: world
range: Person
Type: http://www.w3.org/2002/07/owl#ObjectProperty

Starting Time
sub property of: topObjectProperty
property disjoint with: bottomObjectProperty
type: FunctionalProperty
type: ObjectProperty
range: time
Rights: http://www.deri.org/privacy.html
Format: application/rdf+xml
creator: DERI International
description: The time when some event starts.
domain: http://lodlaundromat.org/.well-known/genid/240cd8d701a3c44280314a4f06cca6bb#50
publisher: DERI International
Type: http://www.w3.org/2002/07/owl#FunctionalProperty
date: 2004-10-20
Coverage: world

Techreport
subclass of: http://lodlaundromat.org/.well-known/genid/240cd8d701a3c44280314a4f06cca6bb#11
subclass of: http://lodlaundromat.org/.well-known/genid/240cd8d701a3c44280314a4f06cca6bb#3
subclass of: http://lodlaundromat.org/.well-known/genid/240cd8d701a3c44280314a4f06cca6bb#23
subclass of: Publication
subclass of: Document
subclass of: Dated Publication
type: Class
subclass of: http://lodlaundromat.org/.well-known/genid/240cd8d701a3c44280314a4f06cca6bb#32
disjoint with: Nothing
subclass of: Thing
Format: application/rdf+xml
Type: http://www.w3.org/2002/07/owl#Class
Coverage: world
Rights: http://www.deri.org/privacy.html
comment: A report published by a school or other organization, usually numbered within a series ( Series ). This concept has been merged from BibTex's techreport and manual types, since both are described very similiar.
publisher: DERI International
date: 2004-10-20
creator: DERI International

Initiative
subclass of: http://lodlaundromat.org/.well-known/genid/240cd8d701a3c44280314a4f06cca6bb#47
type: Class
subclass of: http://lodlaundromat.org/.well-known/genid/240cd8d701a3c44280314a4f06cca6bb#7
subclass of: Agent
subclass of: Thing
subclass of: Temporary Group
subclass of: http://lodlaundromat.org/.well-known/genid/240cd8d701a3c44280314a4f06cca6bb#63
disjoint with: Nothing
subclass of: http://lodlaundromat.org/.well-known/genid/240cd8d701a3c44280314a4f06cca6bb#4
subclass of: Group
Rights: http://www.deri.org/privacy.html
description: An initiative is a group which has specific aims. It differs from foaf:Project in that it normally doesn’t have any funding. Often, its duration is longer.
creator: DERI International
publisher: DERI International
Coverage: world
Type: http://www.w3.org/2002/07/owl#Class
date: 2004-10-20
Format: application/rdf+xml

Number
property disjoint with: Title
property disjoint with: hasZipcode
property disjoint with: bottomDataProperty
property disjoint with: Note
property disjoint with: Link
property disjoint with: First Name
property disjoint with: Goal
property disjoint with: How Published
type: DatatypeProperty
type: FunctionalProperty
property disjoint with: POBox
property disjoint with: Publication Date
property disjoint with: Complete Name
property disjoint with: Description
property disjoint with: Items
property disjoint with: Surname
property disjoint with: Version
property disjoint with: Street
sub property of: topDataProperty
creator: DERI International
Format: application/rdf+xml
Rights: http://www.deri.org/privacy.html
range: nonNegativeInteger
domain: http://lodlaundromat.org/.well-known/genid/240cd8d701a3c44280314a4f06cca6bb#11
comment: The number of a journal, magazine, techreport, or of a work in a series. An issue of a journal or magazine is usually identified by its volume and number; the organization that issues a technical report usually gives it a number; and sometimes books are given numbers in a numbered series. Deliverables for a project may also be given numbers.
Type: http://www.w3.org/2002/07/owl#DatatypeProperty
publisher: DERI International
date: 2004-10-20
Coverage: world

Tutorial
disjoint with: Nothing
subclass of: http://lodlaundromat.org/.well-known/genid/240cd8d701a3c44280314a4f06cca6bb#15
subclass of: http://lodlaundromat.org/.well-known/genid/240cd8d701a3c44280314a4f06cca6bb#4
subclass of: http://lodlaundromat.org/.well-known/genid/240cd8d701a3c44280314a4f06cca6bb#63
type: Class
subclass of: http://lodlaundromat.org/.well-known/genid/240cd8d701a3c44280314a4f06cca6bb#50
subclass of: Thing
subclass of: http://lodlaundromat.org/.well-known/genid/240cd8d701a3c44280314a4f06cca6bb#47
subclass of: Event
description: This class represents all kinds of tutorials.
publisher: DERI International
Rights: http://www.deri.org/privacy.html
Type: http://www.w3.org/2000/01/rdf-schema#Class
Format: application/rdf+xml
Coverage: world
creator: DERI International
date: 2004-10-20

Goal
property disjoint with: Edition
property disjoint with: Pages
property disjoint with: Version
property disjoint with: Chapter
property disjoint with: Number
type: FunctionalProperty
property disjoint with: bottomDataProperty
type: DatatypeProperty
sub property of: topDataProperty
property disjoint with: Volume
property disjoint with: Publication Date
Format: application/rdf+xml
Rights: http://www.deri.org/privacy.html
Coverage: world
date: 2004-10-20
Type: http://www.w3.org/2002/07/owl#DatatypeProperty
range: string
description: The goal a group aims at. NOTE: foaf:theme provides a similar functionality.
creator: DERI International
publisher: DERI International
domain: Group

Identifier
property disjoint with: bottomObjectProperty
type: Thing
description: Recommended best practice is to identify the resource by means of a string conforming to a formal identification system.
note: A second property with the same name as this property has been declared in the dcterms: namespace (http://purl.org/dc/terms/). See the Introduction to the document "DCMI Metadata Terms" (http://dublincore.org/documents/dcmi-terms/) for an explanation.
modified: 2008-01-14
sub property of: topObjectProperty
issued: 1999-07-02
has version: identifier-006
type: ObjectProperty
type: Property
comment: An unambiguous reference to the resource within a given context.

Contains Chapters
sub property of: topObjectProperty
property disjoint with: bottomObjectProperty
inverse of: Contained in Book
type: InverseFunctionalProperty
type: ObjectProperty
domain: Book
comment: The chapters or similar which a book contains.
Format: application/rdf+xml
creator: DERI International
range: Inbook
Type: http://www.w3.org/2002/07/owl#InverseFunctionalProperty
Rights: http://www.deri.org/privacy.html
publisher: DERI International
Coverage: world
date: 2004-10-20

Region
disjoint with: Nothing
subclass of: Sub-Country
subclass of: Location
subclass of: Thing
subclass of: Sub-Continent
subclass of: http://lodlaundromat.org/.well-known/genid/240cd8d701a3c44280314a4f06cca6bb#63
type: Class
Format: application/rdf+xml
creator: DERI International
Rights: http://www.deri.org/privacy.html
Coverage: world
date: 2004-10-20
description: This class defines geopraphical bodies that are regions, with the intended meaning "sub-division of a country".
publisher: DERI International
Type: http://www.w3.org/2000/01/rdf-schema#Class

Language
issued: 1999-07-02
type: Thing
type: ObjectProperty
note: A second property with the same name as this property has been declared in the dcterms: namespace (http://purl.org/dc/terms/). See the Introduction to the document "DCMI Metadata Terms" (http://dublincore.org/documents/dcmi-terms/) for an explanation.
has version: language-007
description: Recommended best practice is to use a controlled vocabulary such as RFC 4646 [RFC4646].
sub property of: topObjectProperty
modified: 2008-01-14
property disjoint with: bottomObjectProperty
type: Property
comment: A language of the resource.

Book
disjoint with: Nothing
subclass of: Document
subclass of: http://lodlaundromat.org/.well-known/genid/240cd8d701a3c44280314a4f06cca6bb#38
subclass of: http://lodlaundromat.org/.well-known/genid/240cd8d701a3c44280314a4f06cca6bb#11
type: Class
subclass of: Thing
subclass of: Publication Container
subclass of: http://lodlaundromat.org/.well-known/genid/240cd8d701a3c44280314a4f06cca6bb#25
subclass of: Publication
subclass of: http://lodlaundromat.org/.well-known/genid/240cd8d701a3c44280314a4f06cca6bb#23
subclass of: http://lodlaundromat.org/.well-known/genid/240cd8d701a3c44280314a4f06cca6bb#3
subclass of: Dated Publication
subclass of: http://lodlaundromat.org/.well-known/genid/240cd8d701a3c44280314a4f06cca6bb#19
publisher: DERI International
description: A book with an explicit publisher. NOTES: - Either authors or editedBy must be given - Either volume or number may be given.
Type: http://www.w3.org/2000/01/rdf-schema#Class
Rights: http://www.deri.org/privacy.html
creator: DERI International
date: 2004-10-20
Format: application/rdf+xml
Coverage: world

Title
sub property of: topDataProperty
sub property of: Title
property disjoint with: Chapter
property disjoint with: Publication Date
equivalent property: Title
type: DatatypeProperty
property disjoint with: Edition
property disjoint with: Version
property disjoint with: bottomDataProperty
property disjoint with: Volume
property disjoint with: Pages
property disjoint with: Number
type: FunctionalProperty
Type: http://www.w3.org/2002/07/owl#FunctionalProperty
Format: application/rdf+xml
domain: Publication
description: The title of the publication (book, article, ...) or publication container (series, journal).
creator: DERI International
Rights: http://www.deri.org/privacy.html
Coverage: world
publisher: DERI International
date: 2004-10-20
range: string

Tutorials
sub property of: topObjectProperty
property disjoint with: bottomObjectProperty
type: ObjectProperty
domain: http://lodlaundromat.org/.well-known/genid/240cd8d701a3c44280314a4f06cca6bb#42
Format: application/rdf+xml
Type: http://www.w3.org/2002/07/owl#ObjectProperty
Rights: http://www.deri.org/privacy.html
date: 2004-10-20
creator: DERI International
comment: The tutorials that are offered during the course of an event.
publisher: DERI International
range: Tutorial
Coverage: world

Sub-City
subclass of: http://lodlaundromat.org/.well-known/genid/240cd8d701a3c44280314a4f06cca6bb#63
disjoint with: Nothing
subclass of: Thing
subclass of: Location
subclass of: Sub-Region
type: Class
subclass of: Sub-Country
subclass of: Sub-Continent
creator: DERI International
Rights: http://www.deri.org/privacy.html
Type: http://www.w3.org/2000/01/rdf-schema#Class
description: This class defines geopraphical bodies that can be contained in cities.
Coverage: world
Format: application/rdf+xml
date: 2004-10-20
publisher: DERI International

Fifth
sub property of: topObjectProperty
property disjoint with: bottomObjectProperty
type: ObjectProperty
description: The fifth foaf:Agent in an AgentSequence .
creator: DERI International
Format: application/rdf+xml
range: Agent
date: 2004-10-20
Coverage: world
Type: http://www.w3.org/2002/07/owl#ObjectProperty
publisher: DERI International
domain: AgentSequence
Rights: http://www.deri.org/privacy.html

RSS1.0 News Channel
disjoint with: Nothing
subclass of: Publication Container
subclass of: Publication
subclass of: Thing
type: Class
comment: "An RSS information channel."
creator: RSS-DEV Working Group
publisher: RSS-DEV Working Group
Format: application/rdf+xml
Coverage: world
Type: http://www.w3.org/2000/01/rdf-schema#Class

Contained in Journal
sub property of: topObjectProperty
property disjoint with: bottomObjectProperty
inverse of: Contains Articles
type: FunctionalProperty
type: ObjectProperty
domain: Article
publisher: DERI International
date: 2004-10-20
Format: application/rdf+xml
Type: http://www.w3.org/2002/07/owl#ObjectProperty
description: The journal or magazine which contains this article.
creator: DERI International
Coverage: world
Rights: http://www.deri.org/privacy.html
range: Journal

Address
sub property of: topObjectProperty
property disjoint with: bottomObjectProperty
type: ObjectProperty
Format: application/rdf+xml
range: Postal Address
domain: Agent
date: 2004-10-20
description: This property relates an agent to its address.
Rights: http://www.deri.org/privacy.html
Type: http://www.w3.org/2002/07/owl#ObjectProperty
creator: DERI International
publisher: DERI International
Coverage: world

Unpublished
type: Class
subclass of: http://lodlaundromat.org/.well-known/genid/240cd8d701a3c44280314a4f06cca6bb#61
subclass of: Publication
disjoint with: Nothing
subclass of: http://lodlaundromat.org/.well-known/genid/240cd8d701a3c44280314a4f06cca6bb#23
subclass of: Document
subclass of: http://lodlaundromat.org/.well-known/genid/240cd8d701a3c44280314a4f06cca6bb#3
subclass of: Dated Publication
subclass of: Thing
Format: application/rdf+xml
Type: http://www.w3.org/2002/07/owl#Class
creator: DERI International
Coverage: world
comment: A document which does have an author and title, but hasn't been formally published.
publisher: DERI International
date: 2004-10-20
Rights: http://www.deri.org/privacy.html

AgentSequence
disjoint with: Nothing
subclass of: Thing
type: Class
publisher: DERI International
description: This is an adhoc solution for creating and ordered group of Agents, e.g. an authorlist.
date: 2004-10-20
Type: http://www.w3.org/2000/01/rdf-schema#Class
Coverage: world
Format: application/rdf+xml
creator: DERI International
Rights: http://www.deri.org/privacy.html

Working Group
subclass of: Agent
subclass of: http://lodlaundromat.org/.well-known/genid/240cd8d701a3c44280314a4f06cca6bb#63
subclass of: http://lodlaundromat.org/.well-known/genid/240cd8d701a3c44280314a4f06cca6bb#7
subclass of: http://lodlaundromat.org/.well-known/genid/240cd8d701a3c44280314a4f06cca6bb#4
subclass of: Thing
subclass of: Temporary Group
subclass of: Group
disjoint with: Nothing
type: Class
subclass of: http://lodlaundromat.org/.well-known/genid/240cd8d701a3c44280314a4f06cca6bb#47
Coverage: world
creator: DERI International
Rights: http://www.deri.org/privacy.html
description: A working group is similar to Initiative . We might unify two classes into one in the future.
date: 2004-10-20
Format: application/rdf+xml
Type: http://www.w3.org/2002/07/owl#Class
publisher: DERI International

Software Company
type: Class
subclass of: Organization
subclass of: Agent
subclass of: Company
disjoint with: Nothing
subclass of: Thing
subclass of: http://lodlaundromat.org/.well-known/genid/240cd8d701a3c44280314a4f06cca6bb#63
subclass of: Group
description: This class models companies that develop software and sell it.
creator: DERI International
Rights: http://www.deri.org/privacy.html
date: 2004-10-20
Coverage: world
Format: application/rdf+xml
Type: http://www.w3.org/2002/07/owl#Class
publisher: DERI International

Subject
property disjoint with: bottomObjectProperty
modified: 2012-06-14
sub property of: topObjectProperty
type: ObjectProperty
note: A second property with the same name as this property has been declared in the dcterms: namespace (http://purl.org/dc/terms/). See the Introduction to the document "DCMI Metadata Terms" (http://dublincore.org/documents/dcmi-terms/) for an explanation.
type: Thing
description: Typically, the subject will be represented using keywords, key phrases, or classification codes. Recommended best practice is to use a controlled vocabulary.
has version: subject-007
issued: 1999-07-02
type: Property
comment: The topic of the resource.

Deliverable
subclass of: Publication
type: Class
subclass of: http://lodlaundromat.org/.well-known/genid/240cd8d701a3c44280314a4f06cca6bb#11
subclass of: Thing
subclass of: Document
disjoint with: Nothing
subclass of: Unpublished
subclass of: http://lodlaundromat.org/.well-known/genid/240cd8d701a3c44280314a4f06cca6bb#61
subclass of: http://lodlaundromat.org/.well-known/genid/240cd8d701a3c44280314a4f06cca6bb#3
subclass of: http://lodlaundromat.org/.well-known/genid/240cd8d701a3c44280314a4f06cca6bb#23
subclass of: Dated Publication
Format: application/rdf+xml
date: 2004-10-20
creator: DERI International
Rights: http://www.deri.org/privacy.html
description: A document which is produced as part of a project. Deliverables are not formally published. NOTE: This concept was not derived from any of the BibTex types, but considered useful anyway.
publisher: DERI International
Coverage: world
Type: http://www.w3.org/2000/01/rdf-schema#Class

Person
disjoint with: Nothing
subclass of: Thing
subclass of: http://lodlaundromat.org/.well-known/genid/240cd8d701a3c44280314a4f06cca6bb#63
subclass of: Agent
type: Class
Contributor: http://rdfweb.org/mailman/listinfo/rdfweb-dev
creator: Dan Brickley
publisher: Libby Miller
description: "A person. The foaf:Person class represents people. Something is a foaf:Person if it is a person. We don't nitpick about whether they're alive, dead, real or imaginary."
Coverage: world
Format: application/rdf+xml
Type: http://www.w3.org/2000/01/rdf-schema#Class
Contributor: http://www.w3.org/RDF/Interest/
publisher: Dan Brickley
creator: Libby Miller

Fax
sub property of: topObjectProperty
property disjoint with: bottomObjectProperty
type: ObjectProperty
description: The faxnumber of some foaf:Agent .
Rights: http://www.deri.org/privacy.html
date: 2004-10-20
range: Literal
Format: application/rdf+xml
domain: Agent
Coverage: world
publisher: DERI International
Type: http://www.w3.org/2002/07/owl#ObjectProperty
creator: DERI International

Leader
sub property of: topObjectProperty
property disjoint with: bottomObjectProperty
type: FunctionalProperty
type: ObjectProperty
creator: DERI International
domain: Group
description: This property defines the leader of an organization, i.e. its director, chairman, etc.
Format: application/rdf+xml
Type: http://www.w3.org/2002/07/owl#FunctionalProperty
range: Person
Rights: http://www.deri.org/privacy.html
Coverage: world
date: 2004-10-20
publisher: DERI International

Presentations
sub property of: topObjectProperty
property disjoint with: bottomObjectProperty
type: ObjectProperty
comment: The presentations that are offered during the course of an event.
creator: DERI International
publisher: DERI International
Format: application/rdf+xml
Type: http://www.w3.org/2002/07/owl#ObjectProperty
range: Presentation
date: 2004-10-20
Rights: http://www.deri.org/privacy.html
Coverage: world
domain: http://lodlaundromat.org/.well-known/genid/240cd8d701a3c44280314a4f06cca6bb#9

Topic
sub property of: topObjectProperty
property disjoint with: bottomObjectProperty
type: ObjectProperty
Coverage: world
creator: Libby Miller
range: Thing
Type: http://www.w3.org/2002/07/owl#ObjectProperty
publisher: Libby Miller
Format: application/rdf+xml
domain: Document
Contributor: http://www.w3.org/RDF/Interest/
publisher: Dan Brickley
comment: "A topic of some page or document. The foaf:topic property relates a document to a thing that the document is about. As such it is an inverse to the foaf:page property, which relates a thing to a document about that thing."
creator: Dan Brickley
Contributor: http://rdfweb.org/mailman/listinfo/rdfweb-dev

Authors
sub property of: topObjectProperty
property disjoint with: bottomObjectProperty
inverse of: Publications
type: ObjectProperty
domain: Document
description: The author or authors of a document. For multiple authors, use either an instance of foaf:Group , or multiple values.
Type: http://www.w3.org/2002/07/owl#ObjectProperty
Format: application/rdf+xml
Rights: http://www.deri.org/privacy.html
Coverage: world
creator: DERI International
range: AgentSequence
publisher: DERI International
date: 2004-10-20

Eigth
sub property of: topObjectProperty
property disjoint with: bottomObjectProperty
type: ObjectProperty
Coverage: world
date: 2004-10-20
domain: AgentSequence
creator: DERI International
Rights: http://www.deri.org/privacy.html
range: Agent
Format: application/rdf+xml
publisher: DERI International
Type: http://www.w3.org/2002/07/owl#ObjectProperty
comment: The eigth foaf:Agent in an AgentSequence .

Interests
sub property of: topObjectProperty
property disjoint with: bottomObjectProperty
type: SymmetricProperty
type: ObjectProperty
comment: The fields of interest of a person.

Article
disjoint with: Nothing
subclass of: http://lodlaundromat.org/.well-known/genid/240cd8d701a3c44280314a4f06cca6bb#3
subclass of: Publication
subclass of: http://lodlaundromat.org/.well-known/genid/240cd8d701a3c44280314a4f06cca6bb#45
subclass of: Thing
subclass of: Document
type: Class
date: 2004-10-20
description: An article from a journal or magazine.
Type: http://www.w3.org/2000/01/rdf-schema#Class
Rights: http://www.deri.org/privacy.html
creator: DERI International
Format: application/rdf+xml
publisher: DERI International
Coverage: world

hasVolumes
sub property of: topObjectProperty
property disjoint with: bottomObjectProperty
inverse of: ofJournal
type: ObjectProperty
date: 2004-10-20
Coverage: world
range: Volume
Format: application/rdf+xml
publisher: DERI International
comment: The Volume s of this journal.
Rights: http://www.deri.org/privacy.html
domain: Journal
Type: http://www.w3.org/2002/07/owl#ObjectProperty
creator: DERI International

Relation
property disjoint with: bottomObjectProperty
issued: 1999-07-02
type: Thing
type: ObjectProperty
modified: 2008-01-14
sub property of: topObjectProperty
has version: relation-006
note: A second property with the same name as this property has been declared in the dcterms: namespace (http://purl.org/dc/terms/). See the Introduction to the document "DCMI Metadata Terms" (http://dublincore.org/documents/dcmi-terms/) for an explanation.
description: Recommended best practice is to identify the related resource by means of a string conforming to a formal identification system.
type: Property
comment: A related resource.

RSS1.0 News Item
disjoint with: Nothing
subclass of: News Item
subclass of: http://lodlaundromat.org/.well-known/genid/240cd8d701a3c44280314a4f06cca6bb#3
subclass of: Publication
subclass of: Thing
subclass of: Document
type: Class
Coverage: world
creator: RSS-DEV Working Group
Format: application/rdf+xml
publisher: RSS-DEV Working Group
Type: http://www.w3.org/2000/01/rdf-schema#Class

Member
sub property of: topObjectProperty
property disjoint with: bottomObjectProperty
type: ObjectProperty
Format: application/rdf+xml
creator: Dan Brickley
comment: "Indicates a member of a Group." This property relates a set of agents to a group. These are the members of that group.
Type: http://www.w3.org/2002/07/owl#ObjectProperty
publisher: Libby Miller
Contributor: http://rdfweb.org/mailman/listinfo/rdfweb-dev
creator: Libby Miller
range: Agent
Contributor: http://www.w3.org/RDF/Interest/
publisher: Dan Brickley
domain: Group
Coverage: world

Complete Name
sub property of: topDataProperty
property disjoint with: Pages
property disjoint with: Version
property disjoint with: Chapter
property disjoint with: bottomDataProperty
property disjoint with: Number
type: FunctionalProperty
property disjoint with: Publication Date
property disjoint with: Edition
property disjoint with: Volume
type: DatatypeProperty
Type: http://www.w3.org/2002/07/owl#FunctionalProperty
range: string
creator: Libby Miller
comment: "The name of some thing."
domain: http://lodlaundromat.org/.well-known/genid/240cd8d701a3c44280314a4f06cca6bb#63
publisher: Libby Miller
publisher: Dan Brickley
creator: Dan Brickley
Contributor: http://rdfweb.org/mailman/listinfo/rdfweb-dev
Contributor: http://www.w3.org/RDF/Interest/
Coverage: world
Format: application/rdf+xml

Project
subclass of: Group
type: Class
subclass of: http://lodlaundromat.org/.well-known/genid/240cd8d701a3c44280314a4f06cca6bb#4
subclass of: Thing
subclass of: http://lodlaundromat.org/.well-known/genid/240cd8d701a3c44280314a4f06cca6bb#7
disjoint with: Nothing
subclass of: http://lodlaundromat.org/.well-known/genid/240cd8d701a3c44280314a4f06cca6bb#47
subclass of: Temporary Group
subclass of: http://lodlaundromat.org/.well-known/genid/240cd8d701a3c44280314a4f06cca6bb#63
subclass of: Agent
description: "A project (a collective endeavour of some kind)." Within the context of the SWPortal Ontology we specify foaf:Project as such: A project is an endeavour of a group which has a specific aim. As a project can also be individualized and can publish documents and the like, we model it as a subclass of foaf:Agent. It has members and inherits all properties of foaf:Agent and foaf:Group . Also, projects are usually funded.
Type: http://www.w3.org/2000/01/rdf-schema#Class
creator: Dan Brickley
publisher: Libby Miller
creator: Libby Miller
Format: application/rdf+xml
Contributor: http://www.w3.org/RDF/Interest/
Coverage: world
publisher: Dan Brickley
Contributor: http://rdfweb.org/mailman/listinfo/rdfweb-dev

Postal Address
disjoint with: Nothing
subclass of: Sub-Country
subclass of: Sub-Continent
subclass of: Location
type: Class
subclass of: Sub-City
subclass of: Thing
subclass of: http://lodlaundromat.org/.well-known/genid/240cd8d701a3c44280314a4f06cca6bb#63
subclass of: Sub-Region
Type: http://www.w3.org/2000/01/rdf-schema#Class
description: Instances of this class represent exact postal addresses. Note that either postbox of streetAddress should be given.
publisher: DERI International
creator: DERI International
Rights: http://www.deri.org/privacy.html
Format: application/rdf+xml
Coverage: world
date: 2004-10-20

Creator
description: Examples of a Creator include a person, an organization, or a service. Typically, the name of a Creator should be used to indicate the entity.
modified: 2008-01-14
note: A second property with the same name as this property has been declared in the dcterms: namespace (http://purl.org/dc/terms/). See the Introduction to the document "DCMI Metadata Terms" (http://dublincore.org/documents/dcmi-terms/) for an explanation.
issued: 1999-07-02
has version: creator-006
type: Thing
comment: An entity primarily responsible for making the resource.
type: Property
type: AnnotationProperty

Format
description: Examples of dimensions include size and duration. Recommended best practice is to use a controlled vocabulary such as the list of Internet Media Types [MIME].
modified: 2008-01-14
note: A second property with the same name as this property has been declared in the dcterms: namespace (http://purl.org/dc/terms/). See the Introduction to the document "DCMI Metadata Terms" (http://dublincore.org/documents/dcmi-terms/) for an explanation.
issued: 1999-07-02
has version: format-007
type: Thing
type: AnnotationProperty
type: Property
comment: The file format, physical medium, or dimensions of the resource.

Current Project
sub property of: topObjectProperty
property disjoint with: bottomObjectProperty
inverse of: Driven by
type: ObjectProperty
description: "A current project this person works on." NOTE: FOAF defines the range as foaf:Person - we decided to change this to the more general foaf:Agent , since other types of Agents (e.g. a company) can also have projects. We have also defined an inverse for this property (see drivenBy ).
Coverage: world
domain: Agent
creator: Dan Brickley
Contributor: http://rdfweb.org/mailman/listinfo/rdfweb-dev
publisher: Libby Miller
Format: application/rdf+xml
publisher: Dan Brickley
creator: Libby Miller
Contributor: http://www.w3.org/RDF/Interest/
Type: http://www.w3.org/2002/07/owl#ObjectProperty
range: Project

Sub-Country
disjoint with: Nothing
subclass of: Location
subclass of: Thing
subclass of: Sub-Continent
subclass of: http://lodlaundromat.org/.well-known/genid/240cd8d701a3c44280314a4f06cca6bb#63
type: Class
Type: http://www.w3.org/2000/01/rdf-schema#Class
description: This class defines geopraphical bodies that can be contained in countries.
date: 2004-10-20
publisher: DERI International
Format: application/rdf+xml
creator: DERI International
Rights: http://www.deri.org/privacy.html
Coverage: world

Research Areas
sub property of: topObjectProperty
property disjoint with: bottomObjectProperty
type: ObjectProperty
creator: DERI International
comment: The areas of research some research institute is involved in.
range: Topic
Format: application/rdf+xml
Type: http://www.w3.org/2002/07/owl#ObjectProperty
domain: http://lodlaundromat.org/.well-known/genid/240cd8d701a3c44280314a4f06cca6bb#35
date: 2004-10-20
publisher: DERI International
Coverage: world
Rights: http://www.deri.org/privacy.html

Gives Presentations
sub property of: topObjectProperty
property disjoint with: bottomObjectProperty
inverse of: Presenter
type: ObjectProperty
date: 2004-10-20
Coverage: world
Type: http://www.w3.org/2002/07/owl#ObjectProperty
publisher: DERI International
comment: This property relates an agent to the presentations it gives. The inverse property is presenter .
creator: DERI International
range: Presentation
Format: application/rdf+xml
Rights: http://www.deri.org/privacy.html
domain: Agent

Temporary Group
subclass of: http://lodlaundromat.org/.well-known/genid/240cd8d701a3c44280314a4f06cca6bb#7
type: Class
subclass of: Thing
subclass of: http://lodlaundromat.org/.well-known/genid/240cd8d701a3c44280314a4f06cca6bb#4
subclass of: http://lodlaundromat.org/.well-known/genid/240cd8d701a3c44280314a4f06cca6bb#63
subclass of: http://lodlaundromat.org/.well-known/genid/240cd8d701a3c44280314a4f06cca6bb#47
disjoint with: Nothing
subclass of: Agent
subclass of: Group
description: As foaf:Project , Initiative and WorkingGroup differ from Cluster in having a specific duration, we comprise these there temporal groups in this class which represents all kinds of temporary groups.
Coverage: world
creator: DERI International
Format: application/rdf+xml
Type: http://www.w3.org/2000/01/rdf-schema#Class
Rights: http://www.deri.org/privacy.html
date: 2004-10-20
publisher: DERI International

Note
equivalent property: Description
property disjoint with: Pages
property disjoint with: Chapter
sub property of: topDataProperty
type: DatatypeProperty
property disjoint with: Number
property disjoint with: Volume
property disjoint with: bottomDataProperty
property disjoint with: Edition
sub property of: Description
type: FunctionalProperty
property disjoint with: Version
property disjoint with: Publication Date
Type: http://www.w3.org/2002/07/owl#FunctionalProperty
date: 2004-10-20
Format: application/rdf+xml
creator: DERI International
publisher: DERI International
domain: Publication
Rights: http://www.deri.org/privacy.html
range: string
Coverage: world

Tutor
sub property of: topObjectProperty
property disjoint with: bottomObjectProperty
inverse of: Gives Tutorials
type: ObjectProperty
comment: The tutors of a tutorial.
Rights: http://www.deri.org/privacy.html
date: 2004-10-20
Type: http://www.w3.org/2002/07/owl#ObjectProperty
Coverage: world
publisher: DERI International
creator: DERI International
range: Agent
domain: Tutorial
Format: application/rdf+xml

In Series
sub property of: topObjectProperty
property disjoint with: bottomObjectProperty
type: FunctionalProperty
type: ObjectProperty
description: The instance of Series in which this document was published.
Type: http://www.w3.org/2002/07/owl#FunctionalProperty
Coverage: world
Format: application/rdf+xml
range: Series
creator: DERI International
domain: http://lodlaundromat.org/.well-known/genid/240cd8d701a3c44280314a4f06cca6bb#19
date: 2004-10-20
publisher: DERI International
Rights: http://www.deri.org/privacy.html

Driven by
sub property of: topObjectProperty
property disjoint with: bottomObjectProperty
inverse of: Current Project
type: ObjectProperty
creator: DERI International
description: The foaf:Agent this project is driven by. This is inverse to foaf:currentProject . NOTE: How do we deal with the relation between drivenBy and foaf:pastProject ?
date: 2004-10-20
domain: Project
publisher: DERI International
Format: application/rdf+xml
range: Agent
Coverage: world
Type: http://www.w3.org/2002/07/owl#ObjectProperty
Rights: http://www.deri.org/privacy.html

Telephone
sub property of: topObjectProperty
property disjoint with: bottomObjectProperty
type: ObjectProperty
Format: application/rdf+xml
range: Literal
creator: Libby Miller
Contributor: http://www.w3.org/RDF/Interest/
publisher: Libby Miller
publisher: Dan Brickley
comment: "The foaf:phone of something is a phone, typically identified using the tel: URI scheme." The tel: URI scheme is defined in http://www.ietf.org/rfc/rfc2806.txt.
Coverage: world
creator: Dan Brickley
Type: http://www.w3.org/2002/07/owl#ObjectProperty
Contributor: http://rdfweb.org/mailman/listinfo/rdfweb-dev
domain: Agent

Workshop
subclass of: http://lodlaundromat.org/.well-known/genid/240cd8d701a3c44280314a4f06cca6bb#47
type: Class
subclass of: http://lodlaundromat.org/.well-known/genid/240cd8d701a3c44280314a4f06cca6bb#4
subclass of: Thing
subclass of: http://lodlaundromat.org/.well-known/genid/240cd8d701a3c44280314a4f06cca6bb#9
subclass of: http://lodlaundromat.org/.well-known/genid/240cd8d701a3c44280314a4f06cca6bb#63
subclass of: Event
subclass of: http://lodlaundromat.org/.well-known/genid/240cd8d701a3c44280314a4f06cca6bb#42
disjoint with: Nothing
creator: DERI International
Coverage: world
description: This class represents all kinds of workshops
date: 2004-10-20
Type: http://www.w3.org/2002/07/owl#Class
publisher: DERI International
Rights: http://www.deri.org/privacy.html
Format: application/rdf+xml

Publication Date
property disjoint with: Title
property disjoint with: Link
property disjoint with: Number
property disjoint with: Chapter
property disjoint with: Volume
property disjoint with: Version
property disjoint with: Description
property disjoint with: Complete Name
property disjoint with: Note
property disjoint with: hasZipcode
property disjoint with: bottomDataProperty
property disjoint with: Surname
property disjoint with: Items
property disjoint with: Edition
property disjoint with: First Name
property disjoint with: POBox
property disjoint with: How Published
property disjoint with: Pages
type: FunctionalProperty
sub property of: topDataProperty
type: DatatypeProperty
property disjoint with: Street
property disjoint with: Goal
publisher: DERI International
comment: The date of publication of some publication or software. Bibtex defines year and month. These are here combined to publicationDate.
Type: http://www.w3.org/2002/07/owl#DatatypeProperty
Coverage: world
Format: application/rdf+xml
date: 2004-10-20
creator: DERI International
domain: http://lodlaundromat.org/.well-known/genid/240cd8d701a3c44280314a4f06cca6bb#23
Rights: http://www.deri.org/privacy.html
range: date

Misc
type: Class
subclass of: http://lodlaundromat.org/.well-known/genid/240cd8d701a3c44280314a4f06cca6bb#3
disjoint with: Nothing
subclass of: http://lodlaundromat.org/.well-known/genid/240cd8d701a3c44280314a4f06cca6bb#23
subclass of: Dated Publication
subclass of: Publication
subclass of: http://lodlaundromat.org/.well-known/genid/240cd8d701a3c44280314a4f06cca6bb#1
subclass of: Document
subclass of: Thing
date: 2004-10-20
description: Some sort of publication which doesn't fit into any of the other concepts.
publisher: DERI International
Rights: http://www.deri.org/privacy.html
Coverage: world
creator: DERI International
Format: application/rdf+xml
Type: http://www.w3.org/2002/07/owl#Class

Third
sub property of: topObjectProperty
property disjoint with: bottomObjectProperty
type: ObjectProperty
description: The third foaf:Agent in an AgentSequence .
Coverage: world
range: Agent
date: 2004-10-20
Format: application/rdf+xml
publisher: DERI International
Type: http://www.w3.org/2002/07/owl#ObjectProperty
Rights: http://www.deri.org/privacy.html
creator: DERI International
domain: AgentSequence

Administrative Staff
disjoint with: Nothing
subclass of: Thing
subclass of: http://lodlaundromat.org/.well-known/genid/240cd8d701a3c44280314a4f06cca6bb#63
subclass of: Agent
subclass of: Person
type: Class
Coverage: world
date: 2004-10-20
Rights: http://www.deri.org/privacy.html
Type: http://www.w3.org/2000/01/rdf-schema#Class
description: This class represents administrative staff.
creator: DERI International
Format: application/rdf+xml
publisher: DERI International

time
disjoint with: Nothing
subclass of: Thing
type: Class
Type: http://www.w3.org/2000/01/rdf-schema#Class
creator: DERI International
creator: Jos de Bruin
publisher: Jos de Bruin
creator: Holger Lausen
comment: A specific point in time during any arbitrary day. For the excat definition of this class, please refere to http://www.wsmo.org/2004/d3/d3.3/v0.1/ .
publisher: Holger Lausen
publisher: DERI International
Format: application/rdf+xml
Rights: http://www.deri.org/privacy.html
Coverage: world

Made
sub property of: topObjectProperty
property disjoint with: bottomObjectProperty
type: ObjectProperty
creator: Dan Brickley
comment: "Something that was made by this agent." In the context of the SWPortal ontology, this could e.g. be an Tool .
Contributor: http://rdfweb.org/mailman/listinfo/rdfweb-dev
Type: http://www.w3.org/2002/07/owl#ObjectProperty
range: http://lodlaundromat.org/.well-known/genid/240cd8d701a3c44280314a4f06cca6bb#3
Contributor: http://www.w3.org/RDF/Interest/
publisher: Libby Miller
creator: Libby Miller
publisher: Dan Brickley
Coverage: world
domain: Agent
Format: application/rdf+xml

Sub-Continent
disjoint with: Nothing
subclass of: Location
subclass of: Thing
subclass of: http://lodlaundromat.org/.well-known/genid/240cd8d701a3c44280314a4f06cca6bb#63
type: Class
Type: http://www.w3.org/2000/01/rdf-schema#Class
comment: This class defines geopraphical bodies that can be contained in continents.
Format: application/rdf+xml
creator: DERI International
Rights: http://www.deri.org/privacy.html
publisher: DERI International
date: 2004-10-20
Coverage: world

Source
property disjoint with: bottomObjectProperty
issued: 1999-07-02
type: Thing
description: The described resource may be derived from the related resource in whole or in part. Recommended best practice is to identify the related resource by means of a string conforming to a formal identification system.
sub property of: topObjectProperty
modified: 2008-01-14
note: A second property with the same name as this property has been declared in the dcterms: namespace (http://purl.org/dc/terms/). See the Introduction to the document "DCMI Metadata Terms" (http://dublincore.org/documents/dcmi-terms/) for an explanation.
has version: source-006
type: ObjectProperty
type: Property
comment: A related resource from which the described resource is derived.

Research Institute
subclass of: http://lodlaundromat.org/.well-known/genid/240cd8d701a3c44280314a4f06cca6bb#63
subclass of: http://lodlaundromat.org/.well-known/genid/240cd8d701a3c44280314a4f06cca6bb#35
subclass of: Organization
subclass of: Thing
subclass of: Agent
disjoint with: Nothing
type: Class
subclass of: Group
description: This class represents research institutes. These organizations have special research areas.
publisher: DERI International
creator: DERI International
date: 2004-10-20
Rights: http://www.deri.org/privacy.html
Coverage: world
Format: application/rdf+xml
Type: http://www.w3.org/2002/07/owl#Class

Dated Publication
disjoint with: Nothing
subclass of: http://lodlaundromat.org/.well-known/genid/240cd8d701a3c44280314a4f06cca6bb#3
subclass of: Publication
subclass of: http://lodlaundromat.org/.well-known/genid/240cd8d701a3c44280314a4f06cca6bb#23
subclass of: Thing
subclass of: Document
type: Class
Rights: http://www.deri.org/privacy.html
publisher: DERI International
date: 2004-10-20
comment: The instances of this class comprise all publications which have a specific publication date. If a publication P is contained within an PublicationContainer , and this container has a publication date, than P is not an IndividualPublication . Example: an Inbook publication is not an IndividualPublication , because its publication date can be inferred from the Book which contains it.
Format: application/rdf+xml
Coverage: world
creator: DERI International
Type: http://www.w3.org/2002/07/owl#Class

Duration
sub property of: topObjectProperty
property disjoint with: bottomObjectProperty
type: ObjectProperty
Format: application/rdf+xml
Rights: http://www.deri.org/privacy.html
creator: DERI International
publisher: DERI International
description: The duration of a temporary group.
date: 2004-10-20
Coverage: world
range: interval
Type: http://www.w3.org/2002/07/owl#ObjectProperty
domain: Temporary Group

For Project
sub property of: topObjectProperty
property disjoint with: bottomObjectProperty
inverse of: Deliverables
type: ObjectProperty
Type: http://www.w3.org/2002/07/owl#ObjectProperty
comment: The project for which this deliverable is produced. The inverse is deliverables .
domain: Deliverable
date: 2004-10-20
Format: application/rdf+xml
Rights: http://www.deri.org/privacy.html
creator: DERI International
Coverage: world
publisher: DERI International
range: Project

Description
description: Description may include but is not limited to: an abstract, a table of contents, a graphical representation, or a free-text account of the resource.
modified: 2008-01-14
note: A second property with the same name as this property has been declared in the dcterms: namespace (http://purl.org/dc/terms/). See the Introduction to the document "DCMI Metadata Terms" (http://dublincore.org/documents/dcmi-terms/) for an explanation.
issued: 1999-07-02
has version: description-006
type: Thing
type: AnnotationProperty
comment: An account of the resource.
type: Property

Version
property disjoint with: Chapter
property disjoint with: Description
property disjoint with: Link
property disjoint with: Publication Date
type: DatatypeProperty
property disjoint with: Items
sub property of: topDataProperty
property disjoint with: Title
property disjoint with: Note
property disjoint with: bottomDataProperty
property disjoint with: How Published
property disjoint with: Street
property disjoint with: First Name
property disjoint with: Edition
property disjoint with: hasZipcode
property disjoint with: Number
property disjoint with: Volume
type: FunctionalProperty
property disjoint with: Pages
property disjoint with: Goal
property disjoint with: Surname
property disjoint with: POBox
property disjoint with: Complete Name
Type: http://www.w3.org/2002/07/owl#FunctionalProperty
comment: The version number of a document or tool.
Coverage: world
publisher: DERI International
domain: http://lodlaundromat.org/.well-known/genid/240cd8d701a3c44280314a4f06cca6bb#61
Rights: http://www.deri.org/privacy.html
date: 2004-10-20
creator: DERI International
range: float
Format: application/rdf+xml

Document
disjoint with: Nothing
subclass of: http://lodlaundromat.org/.well-known/genid/240cd8d701a3c44280314a4f06cca6bb#3
subclass of: Publication
subclass of: Thing
type: Class
Contributor: http://www.w3.org/RDF/Interest/
comment: Similar to the Agent concept, we have again decided to include a concept from the popular FOAF ontology. The FOAF Vocabulary Specification currently defines Document in a very loose way: "The foaf:Document class represents those things which are, broadly conceived, 'documents'. ... We do not (currently) distinguish between physical and electronic documents, or between copies of a work and the abstraction those copies embody." The intended use of this concept within the SWPortal ontology is to subsume everything that contains some sort of information and has been produced by some foaf:Agent An instance of Document can either refer to an electronic or physical thing, as long as it is adressable by means of a URI. Examples are a book written, or a picture taken by a person, but also a log file generated by a machine.
creator: Dan Brickley
creator: Libby Miller
publisher: Libby Miller
Type: http://www.w3.org/2000/01/rdf-schema#Class
publisher: Dan Brickley
Coverage: world
Format: application/rdf+xml
Contributor: http://rdfweb.org/mailman/listinfo/rdfweb-dev

Organization
disjoint with: Nothing
subclass of: Organization
subclass of: Thing
subclass of: http://lodlaundromat.org/.well-known/genid/240cd8d701a3c44280314a4f06cca6bb#63
subclass of: Agent
subclass of: Group
type: Class
creator: DERI International
date: 2004-10-20
comment: This class represents an organization with a formal legal status. We introduce this class as a subclass of foaf:Organization and foaf:Group , because we consider an organization as a kind of group.
Coverage: world
Rights: http://www.deri.org/privacy.html
Format: application/rdf+xml
publisher: DERI International
Type: http://www.w3.org/2002/07/owl#Class

Journal
disjoint with: Nothing
subclass of: Publication Container
subclass of: Publication
subclass of: Thing
type: Class
comment: A scientific journal or magazine. The instances of this class are not individual issues or voulumes of a journal, but the journal as such.
date: 2004-10-20
Rights: http://www.deri.org/privacy.html
Coverage: world
Format: application/rdf+xml
Type: http://www.w3.org/2000/01/rdf-schema#Class
creator: DERI International
publisher: DERI International

Tenth
sub property of: topObjectProperty
property disjoint with: bottomObjectProperty
type: ObjectProperty
publisher: DERI International
Format: application/rdf+xml
description: The tenth foaf:Agent in an AgentSequence .
domain: AgentSequence
Coverage: world
range: Agent
creator: DERI International
Type: http://www.w3.org/2002/07/owl#ObjectProperty
Rights: http://www.deri.org/privacy.html
date: 2004-10-20

Country
disjoint with: Nothing
subclass of: Location
subclass of: Thing
subclass of: Sub-Continent
subclass of: http://lodlaundromat.org/.well-known/genid/240cd8d701a3c44280314a4f06cca6bb#63
type: Class
Coverage: world
Rights: http://www.deri.org/privacy.html
description: This class defines geopraphical bodies that are countries.
date: 2004-10-20
publisher: DERI International
creator: DERI International
Format: application/rdf+xml
Type: http://www.w3.org/2000/01/rdf-schema#Class

Theme
sub property of: topObjectProperty
property disjoint with: bottomObjectProperty
type: ObjectProperty
range: Thing
Coverage: world
Contributor: http://rdfweb.org/mailman/listinfo/rdfweb-dev
domain: Group
Format: application/rdf+xml
description: "A theme. The foaf:theme property is rarely used and under-specified. The intention was to use it to characterise interest / themes associated with projects and groups. Further work is need to meet these goals." NOTE: This property is only listed for comparison with goal.
creator: Dan Brickley
Type: http://www.w3.org/2002/07/owl#ObjectProperty
Contributor: http://www.w3.org/RDF/Interest/
creator: Libby Miller
publisher: Dan Brickley
publisher: Libby Miller

In Continent
sub property of: topObjectProperty
property disjoint with: bottomObjectProperty
type: FunctionalProperty
type: ObjectProperty
range: Continent
publisher: DERI International
date: 2004-10-20
Coverage: world
domain: Sub-Continent
Format: application/rdf+xml
creator: DERI International
description: The Continent in which some SubContinent is contained.
Type: http://www.w3.org/2002/07/owl#ObjectProperty
Rights: http://www.deri.org/privacy.html

ofJournal
sub property of: topObjectProperty
property disjoint with: bottomObjectProperty
inverse of: hasVolumes
type: ObjectProperty
date: 2004-10-20
Coverage: world
range: Journal
Format: application/rdf+xml
creator: DERI International
Rights: http://www.deri.org/privacy.html
domain: Volume
publisher: DERI International
description: The Journal this volume belongs to.
Type: http://www.w3.org/2002/07/owl#ObjectProperty

From Organization
sub property of: topObjectProperty
property disjoint with: bottomObjectProperty
type: FunctionalProperty
type: ObjectProperty
creator: DERI International
Rights: http://www.deri.org/privacy.html
Format: application/rdf+xml
description: The organization that sponsors a conference or that publishes a manual or techreport.
publisher: DERI International
Coverage: world
date: 2004-10-20
domain: http://lodlaundromat.org/.well-known/genid/240cd8d701a3c44280314a4f06cca6bb#32
range: Organization
Type: http://www.w3.org/2002/07/owl#ObjectProperty

Enddate
sub property of: topObjectProperty
property disjoint with: bottomObjectProperty
type: ObjectProperty
description: The ending date some event.
Format: application/rdf+xml
Rights: http://www.deri.org/privacy.html
domain: http://lodlaundromat.org/.well-known/genid/240cd8d701a3c44280314a4f06cca6bb#4
date: 2004-10-20
Type: http://www.w3.org/2002/07/owl#ObjectProperty
creator: DERI International
Coverage: world
publisher: DERI International
range: date

Research Staff
subclass of: Researcher
subclass of: http://lodlaundromat.org/.well-known/genid/240cd8d701a3c44280314a4f06cca6bb#63
subclass of: Thing
subclass of: http://lodlaundromat.org/.well-known/genid/240cd8d701a3c44280314a4f06cca6bb#35
subclass of: Person
subclass of: Agent
type: Class
disjoint with: Nothing
Rights: http://www.deri.org/privacy.html
Type: http://www.w3.org/2002/07/owl#Class
publisher: DERI International
comment: This class represents all kinds of researchers who are not students.
date: 2004-10-20
Coverage: world
creator: DERI International
Format: application/rdf+xml

Sub-Region
disjoint with: Nothing
subclass of: Sub-Country
subclass of: Location
subclass of: Thing
subclass of: Sub-Continent
subclass of: http://lodlaundromat.org/.well-known/genid/240cd8d701a3c44280314a4f06cca6bb#63
type: Class
publisher: DERI International
creator: DERI International
date: 2004-10-20
comment: This class defines geopraphical bodies that can be contained in regions.
Rights: http://www.deri.org/privacy.html
Format: application/rdf+xml
Type: http://www.w3.org/2000/01/rdf-schema#Class
Coverage: world

Contains Papers
sub property of: topObjectProperty
property disjoint with: bottomObjectProperty
inverse of: Contained in Proceedings
type: ObjectProperty
domain: Proceedings
description: The papers or similar which a proceedings contains.
date: 2004-10-20
range: Inproceedings
Format: application/rdf+xml
publisher: DERI International
Coverage: world
Rights: http://www.deri.org/privacy.html
creator: DERI International
Type: http://www.w3.org/2002/07/owl#ObjectProperty

TechnicalStaff
disjoint with: Nothing
subclass of: Administrative Staff
subclass of: Thing
subclass of: http://lodlaundromat.org/.well-known/genid/240cd8d701a3c44280314a4f06cca6bb#63
subclass of: Agent
subclass of: Person
type: Class
date: 2004-10-20
Format: application/rdf+xml
creator: DERI International
Coverage: world
Rights: http://www.deri.org/privacy.html
comment: This class represents all kinds of administrative staff that is employed for technical issues. Examples are system administrators, hardware specialists, etc.
publisher: DERI International
Type: http://www.w3.org/2002/07/owl#Class

Organizes
sub property of: topObjectProperty
property disjoint with: bottomObjectProperty
inverse of: Organized by
type: ObjectProperty
publisher: DERI International
Format: application/rdf+xml
date: 2004-10-20
Rights: http://www.deri.org/privacy.html
Type: http://www.w3.org/2002/07/owl#ObjectProperty
creator: DERI International
Coverage: world
range: Event
comment: This property relates an agent to the events it organizes. The inverse property is organizedBy .
domain: Agent

Email
sub property of: topObjectProperty
property disjoint with: bottomObjectProperty
type: InverseFunctionalProperty
type: ObjectProperty
domain: Agent
Contributor: http://rdfweb.org/mailman/listinfo/rdfweb-dev
creator: Libby Miller
range: Literal
Coverage: world
creator: Dan Brickley
comment: "A personal mailbox, i.e. an internet mailbox associated with exactly one owner, the first owner of this mailbox. This is a 'static inverse functional property', in that there is (across time and change) at most one individual that ever has any particular value for foaf:mbox ." Because we switched over to OWL Lite– ,we don’t have functional properties anymore. However, we recommend to the users of this ontology to apply this property like it is described in the FOAF specification.
Type: http://www.w3.org/2002/07/owl#ObjectProperty
Format: application/rdf+xml
publisher: Dan Brickley
Contributor: http://www.w3.org/RDF/Interest/
publisher: Libby Miller

Continent
disjoint with: Nothing
subclass of: Location
subclass of: Thing
subclass of: http://lodlaundromat.org/.well-known/genid/240cd8d701a3c44280314a4f06cca6bb#63
type: Class
comment: This class defines geopraphical bodies that are continents.
Rights: http://www.deri.org/privacy.html
Type: http://www.w3.org/2000/01/rdf-schema#Class
publisher: DERI International
creator: DERI International
Format: application/rdf+xml
date: 2004-10-20
Coverage: world

Sixth
sub property of: topObjectProperty
property disjoint with: bottomObjectProperty
type: ObjectProperty
date: 2004-10-20
Coverage: world
description: The sixth foaf:Agent in an AgentSequence .
domain: AgentSequence
range: Agent
Format: application/rdf+xml
creator: DERI International
Rights: http://www.deri.org/privacy.html
Type: http://www.w3.org/2002/07/owl#ObjectProperty
publisher: DERI International

Link
property disjoint with: bottomDataProperty
property disjoint with: Volume
type: FunctionalProperty
property disjoint with: Publication Date
type: DatatypeProperty
property disjoint with: Number
property disjoint with: Pages
property disjoint with: Edition
sub property of: topDataProperty
property disjoint with: Chapter
property disjoint with: Version
publisher: RSS-DEV Working Group
Type: http://www.w3.org/2002/07/owl#FunctionalProperty
Coverage: world
comment: If this publication can be accessed in electronic form, the corresponding URL can be using the rss:link property. NOTE: this definition is a slightly extended version of the definition in the RSS 1.0 specification.
creator: RSS-DEV Working Group
domain: Publication
range: string
Format: application/rdf+xml

Master Thesis
subclass of: http://lodlaundromat.org/.well-known/genid/240cd8d701a3c44280314a4f06cca6bb#3
disjoint with: Nothing
subclass of: Thing
subclass of: Dated Publication
subclass of: http://lodlaundromat.org/.well-known/genid/240cd8d701a3c44280314a4f06cca6bb#23
subclass of: Publication
subclass of: Document
subclass of: Thesis
type: Class
comment: A thesis written to receive a Master degree.
date: 2004-10-20
Format: application/rdf+xml
publisher: DERI International
Rights: http://www.deri.org/privacy.html
creator: DERI International
Type: http://www.w3.org/2002/07/owl#Class
Coverage: world

hasZipcode
property disjoint with: bottomDataProperty
property disjoint with: Chapter
property disjoint with: Volume
property disjoint with: Edition
sub property of: topDataProperty
property disjoint with: Number
property disjoint with: Pages
type: DatatypeProperty
property disjoint with: Version
property disjoint with: Publication Date
date: 2004-10-20
domain: Postal Address
Type: http://www.w3.org/2002/07/owl#DatatypeProperty
publisher: DERI International
range: string
creator: DERI International
Coverage: world
description: The zipcode of some PostalAddress (if applicable). This is simply a string with no prescribed syntax.
Rights: http://www.deri.org/privacy.html
Format: application/rdf+xml

In Country
sub property of: topObjectProperty
property disjoint with: bottomObjectProperty
type: FunctionalProperty
type: ObjectProperty
Type: http://www.w3.org/2002/07/owl#FunctionalProperty
Format: application/rdf+xml
creator: DERI International
domain: Sub-Country
Rights: http://www.deri.org/privacy.html
comment: The Country in which some SubCountry is contained.
publisher: DERI International
range: Country
Coverage: world
date: 2004-10-20

Contributor
description: Examples of a Contributor include a person, an organization, or a service. Typically, the name of a Contributor should be used to indicate the entity.
modified: 2008-01-14
note: A second property with the same name as this property has been declared in the dcterms: namespace (http://purl.org/dc/terms/). See the Introduction to the document "DCMI Metadata Terms" (http://dublincore.org/documents/dcmi-terms/) for an explanation.
issued: 1999-07-02
has version: contributor-006
type: Thing
comment: An entity responsible for making contributions to the resource.
type: Property
type: AnnotationProperty

Group
disjoint with: Nothing
subclass of: Thing
subclass of: http://lodlaundromat.org/.well-known/genid/240cd8d701a3c44280314a4f06cca6bb#63
subclass of: Agent
type: Class
Format: application/rdf+xml
Contributor: http://rdfweb.org/mailman/listinfo/rdfweb-dev
Coverage: world
creator: Libby Miller
Contributor: http://www.w3.org/RDF/Interest/
comment: "A class of Agents. The foaf:Group classs represents a collection of individual agents (and may itself play the role of a foaf:Agent , i.e. something that can perform actions)."
publisher: Libby Miller
creator: Dan Brickley
publisher: Dan Brickley
Type: http://www.w3.org/2000/01/rdf-schema#Class

In City
sub property of: topObjectProperty
property disjoint with: bottomObjectProperty
type: FunctionalProperty
type: ObjectProperty
Type: http://www.w3.org/2002/07/owl#FunctionalProperty
range: City
Rights: http://www.deri.org/privacy.html
publisher: DERI International
domain: Sub-City
description: The City in which some SubCity is contained.
date: 2004-10-20
Format: application/rdf+xml
Coverage: world
creator: DERI International

Publisher
sub property of: topObjectProperty
property disjoint with: bottomObjectProperty
type: FunctionalProperty
type: ObjectProperty
Format: application/rdf+xml
publisher: DERI International
description: The instance of Publisher which published this document.
domain: http://lodlaundromat.org/.well-known/genid/240cd8d701a3c44280314a4f06cca6bb#38
date: 2004-10-20
Type: http://www.w3.org/2002/07/owl#FunctionalProperty
creator: DERI International
Coverage: world
Rights: http://www.deri.org/privacy.html
range: Publishing Company

Thesis
subclass of: Publication
type: Class
subclass of: http://lodlaundromat.org/.well-known/genid/240cd8d701a3c44280314a4f06cca6bb#23
subclass of: http://lodlaundromat.org/.well-known/genid/240cd8d701a3c44280314a4f06cca6bb#3
subclass of: Dated Publication
subclass of: Document
disjoint with: Nothing
subclass of: Thing
publisher: DERI International
date: 2004-10-20
Coverage: world
comment: Any kind of thesis produced to receive some sort of university degree.
Format: application/rdf+xml
creator: DERI International
Rights: http://www.deri.org/privacy.html
Type: http://www.w3.org/2000/01/rdf-schema#Class

Edition
property disjoint with: First Name
property disjoint with: Surname
property disjoint with: Street
property disjoint with: Publication Date
property disjoint with: How Published
type: DatatypeProperty
property disjoint with: Items
property disjoint with: bottomDataProperty
property disjoint with: POBox
property disjoint with: Goal
property disjoint with: Link
property disjoint with: hasZipcode
property disjoint with: Version
property disjoint with: Note
type: FunctionalProperty
property disjoint with: Complete Name
sub property of: topDataProperty
property disjoint with: Description
property disjoint with: Title
Coverage: world
range: nonNegativeInteger
Format: application/rdf+xml
comment: The edition of a book---for example, ``Second''. This should be an ordinal, and should have the first letter capitalized, as shown here; the standard styles convert to lower case when necessary.
domain: Book
Rights: http://www.deri.org/privacy.html
creator: DERI International
Type: http://www.w3.org/2002/07/owl#DatatypeProperty
publisher: DERI International
date: 2004-10-20

Volume
property disjoint with: Items
property disjoint with: bottomDataProperty
property disjoint with: Street
type: DatatypeProperty
property disjoint with: First Name
property disjoint with: hasZipcode
property disjoint with: Link
property disjoint with: Version
property disjoint with: Note
property disjoint with: Complete Name
property disjoint with: Title
property disjoint with: POBox
sub property of: topDataProperty
property disjoint with: How Published
property disjoint with: Surname
property disjoint with: Goal
property disjoint with: Publication Date
type: FunctionalProperty
property disjoint with: Description
publisher: DERI International
description: The volume of a journal or a multi-volume book.
range: nonNegativeInteger
Coverage: world
domain: http://lodlaundromat.org/.well-known/genid/240cd8d701a3c44280314a4f06cca6bb#25
Format: application/rdf+xml
Type: http://www.w3.org/2002/07/owl#DatatypeProperty
date: 2004-10-20
Rights: http://www.deri.org/privacy.html
creator: DERI International

Date
description: Date may be used to express temporal information at any level of granularity. Recommended best practice is to use an encoding scheme, such as the W3CDTF profile of ISO 8601 [W3CDTF].
modified: 2008-01-14
note: A second property with the same name as this property has been declared in the dcterms: namespace (http://purl.org/dc/terms/). See the Introduction to the document "DCMI Metadata Terms" (http://dublincore.org/documents/dcmi-terms/) for an explanation.
issued: 1999-07-02
has version: date-006
type: Thing
type: AnnotationProperty
comment: A point or period of time associated with an event in the lifecycle of the resource.
type: Property

Publishing Company
subclass of: Organization
type: Class
subclass of: Company
subclass of: http://lodlaundromat.org/.well-known/genid/240cd8d701a3c44280314a4f06cca6bb#63
subclass of: Group
disjoint with: Nothing
subclass of: Thing
subclass of: Agent
date: 2004-10-20
comment: This class models companies that publish documents.
Rights: http://www.deri.org/privacy.html
creator: DERI International
publisher: DERI International
Format: application/rdf+xml
Type: http://www.w3.org/2000/01/rdf-schema#Class
Coverage: world

First
sub property of: topObjectProperty
property disjoint with: bottomObjectProperty
type: ObjectProperty
comment: The first foaf:Agent in an AgentSequence .
Coverage: world
Type: http://www.w3.org/2002/07/owl#ObjectProperty
range: Agent
Format: application/rdf+xml
creator: DERI International
date: 2004-10-20
Rights: http://www.deri.org/privacy.html
publisher: DERI International
domain: AgentSequence

Presenter
sub property of: topObjectProperty
property disjoint with: bottomObjectProperty
inverse of: Gives Presentations
type: ObjectProperty
comment: The presenter of a presentation.
Rights: http://www.deri.org/privacy.html
creator: DERI International
domain: Presentation
Coverage: world
Format: application/rdf+xml
range: Agent
publisher: DERI International
date: 2004-10-20
Type: http://www.w3.org/2002/07/owl#ObjectProperty

POBox
property disjoint with: Number
property disjoint with: Version
property disjoint with: Chapter
property disjoint with: Pages
type: DatatypeProperty
type: FunctionalProperty
property disjoint with: Volume
property disjoint with: bottomDataProperty
property disjoint with: Edition
sub property of: topDataProperty
property disjoint with: Publication Date
range: string
Format: application/rdf+xml
comment: The PO-Box of some PostalAddress .
domain: Postal Address
date: 2004-10-20
publisher: DERI International
creator: DERI International
Rights: http://www.deri.org/privacy.html
Type: http://www.w3.org/2002/07/owl#DatatypeProperty
Coverage: world

Series
disjoint with: Nothing
subclass of: Publication Container
subclass of: Publication
subclass of: Thing
type: Class
description: A series or set of books.
Type: http://www.w3.org/2000/01/rdf-schema#Class
date: 2004-10-20
Coverage: world
publisher: DERI International
Rights: http://www.deri.org/privacy.html
creator: DERI International
Format: application/rdf+xml

Agent
disjoint with: Nothing
subclass of: Thing
subclass of: http://lodlaundromat.org/.well-known/genid/240cd8d701a3c44280314a4f06cca6bb#63
type: Class
description: "An agent (e.g. person, group, software or physical artifact)." NOTE: We adopted this concept partially from the FOAF ontology. However, in our ontology the agent concept does not comprise the subclasses software and physical artifact. We decided to introduce this main concept in order to make the range of e.g. the attribute authors of a publication more general.
Format: application/rdf+xml
Contributor: http://rdfweb.org/mailman/listinfo/rdfweb-dev
Type: http://www.w3.org/2000/01/rdf-schema#Class
Coverage: world
publisher: Dan Brickley
creator: Dan Brickley
publisher: Libby Miller
Contributor: http://www.w3.org/RDF/Interest/
creator: Libby Miller

Researcher
disjoint with: Nothing
subclass of: http://lodlaundromat.org/.well-known/genid/240cd8d701a3c44280314a4f06cca6bb#35
subclass of: Thing
subclass of: http://lodlaundromat.org/.well-known/genid/240cd8d701a3c44280314a4f06cca6bb#63
subclass of: Agent
subclass of: Person
type: Class
Coverage: world
Format: application/rdf+xml
Rights: http://www.deri.org/privacy.html
date: 2004-10-20
description: This class represents all kinds of persons who are researchers. Each has a research area.
creator: DERI International
publisher: DERI International
Type: http://www.w3.org/2002/07/owl#Class

Rights
description: Typically, rights information includes a statement about various property rights associated with the resource, including intellectual property rights.
modified: 2008-01-14
note: A second property with the same name as this property has been declared in the dcterms: namespace (http://purl.org/dc/terms/). See the Introduction to the document "DCMI Metadata Terms" (http://dublincore.org/documents/dcmi-terms/) for an explanation.
issued: 1999-07-02
has version: rights-006
type: Thing
comment: Information about rights held in and over the resource.
type: AnnotationProperty
type: Property

Street
property disjoint with: Number
sub property of: topDataProperty
property disjoint with: bottomDataProperty
property disjoint with: Chapter
property disjoint with: Edition
property disjoint with: Volume
property disjoint with: Publication Date
property disjoint with: Version
property disjoint with: Pages
type: DatatypeProperty
type: FunctionalProperty
date: 2004-10-20
description: The street address part of an PostalAddress . Can have multiple lines.
Rights: http://www.deri.org/privacy.html
Type: http://www.w3.org/2002/07/owl#DatatypeProperty
publisher: DERI International
creator: DERI International
range: string
Format: application/rdf+xml
domain: Postal Address
Coverage: world

Ninth
sub property of: topObjectProperty
property disjoint with: bottomObjectProperty
type: ObjectProperty
comment: The ninth foaf:Agent in an AgentSequence .
date: 2004-10-20
creator: DERI International
Format: application/rdf+xml
Coverage: world
range: Agent
Rights: http://www.deri.org/privacy.html
Type: http://www.w3.org/2002/07/owl#ObjectProperty
publisher: DERI International
domain: AgentSequence

Starting Date
sub property of: topObjectProperty
property disjoint with: bottomObjectProperty
type: ObjectProperty
publisher: DERI International
date: 2004-10-20
Rights: http://www.deri.org/privacy.html
creator: DERI International
Format: application/rdf+xml
domain: http://lodlaundromat.org/.well-known/genid/240cd8d701a3c44280314a4f06cca6bb#47
description: The starting date some event.
Type: http://www.w3.org/2002/07/owl#ObjectProperty
range: date
Coverage: world

Publication Container
disjoint with: Nothing
subclass of: Publication
subclass of: Thing
type: Class
description: This class comprises all kinds of publications which contain other publications, such as journal, proceedings, series, etc. An instance of PublicationContainer has an editor.
publisher: DERI International
date: 2004-10-20
Format: application/rdf+xml
creator: DERI International
Rights: http://www.deri.org/privacy.html
Coverage: world
Type: http://www.w3.org/2000/01/rdf-schema#Class

Organization
disjoint with: Nothing
subclass of: Thing
subclass of: http://lodlaundromat.org/.well-known/genid/240cd8d701a3c44280314a4f06cca6bb#63
subclass of: Agent
type: Class
Format: application/rdf+xml
description: "The foaf:Organization class represents a kind of foaf:Agent corresponding to social institutions such as companies, societies, etc." As we consider an organization to be a group as well, we introduced a subclass Organization as a subclass of both foaf:Organization and foaf:Group . We added foaf:Organization to facilitate FOAF based agents to query our ontology.
Type: http://www.w3.org/2000/01/rdf-schema#Class
Coverage: world
creator: Dan Brickley
publisher: Dan Brickley
creator: Libby Miller
publisher: Libby Miller
Contributor: http://www.w3.org/RDF/Interest/
Contributor: http://rdfweb.org/mailman/listinfo/rdfweb-dev

Publications
sub property of: topObjectProperty
property disjoint with: bottomObjectProperty
inverse of: Authors
type: ObjectProperty
range: Document
Type: http://www.w3.org/2002/07/owl#ObjectProperty
Format: application/rdf+xml
domain: Agent
Contributor: http://rdfweb.org/mailman/listinfo/rdfweb-dev
publisher: Libby Miller
creator: Dan Brickley
Contributor: http://www.w3.org/RDF/Interest/
description: "A link to the publications of this person." This property relates an agent to its publications. NOTE: foaf defines the range as foaf:Person - we decided to change this to the more general foaf:Agent , since other types of Agents (e.g. a company) can also have publications (with no specific human authors).
publisher: Dan Brickley
creator: Libby Miller
Coverage: world

Proceedings
subclass of: Document
subclass of: http://lodlaundromat.org/.well-known/genid/240cd8d701a3c44280314a4f06cca6bb#32
subclass of: Publication
subclass of: http://lodlaundromat.org/.well-known/genid/240cd8d701a3c44280314a4f06cca6bb#11
subclass of: http://lodlaundromat.org/.well-known/genid/240cd8d701a3c44280314a4f06cca6bb#3
subclass of: http://lodlaundromat.org/.well-known/genid/240cd8d701a3c44280314a4f06cca6bb#23
subclass of: Thing
subclass of: http://lodlaundromat.org/.well-known/genid/240cd8d701a3c44280314a4f06cca6bb#38
disjoint with: Nothing
subclass of: Publication Container
subclass of: http://lodlaundromat.org/.well-known/genid/240cd8d701a3c44280314a4f06cca6bb#25
subclass of: http://lodlaundromat.org/.well-known/genid/240cd8d701a3c44280314a4f06cca6bb#19
subclass of: Dated Publication
type: Class
creator: DERI International
Format: application/rdf+xml
Coverage: world
Type: http://www.w3.org/2000/01/rdf-schema#Class
date: 2004-10-20
publisher: DERI International
description: The proceedings of a conference.
Rights: http://www.deri.org/privacy.html

Organized by
sub property of: topObjectProperty
property disjoint with: bottomObjectProperty
inverse of: Organizes
type: ObjectProperty
Format: application/rdf+xml
domain: Event
description: The organizers of an event. At least one agent has to organize an event. The inverse property is organizes .
publisher: DERI International
Type: http://www.w3.org/2002/07/owl#ObjectProperty
creator: DERI International
range: Agent
date: 2004-10-20
Coverage: world
Rights: http://www.deri.org/privacy.html

Inbook
disjoint with: Nothing
subclass of: http://lodlaundromat.org/.well-known/genid/240cd8d701a3c44280314a4f06cca6bb#3
subclass of: Publication
subclass of: http://lodlaundromat.org/.well-known/genid/240cd8d701a3c44280314a4f06cca6bb#45
subclass of: Thing
subclass of: Document
type: Class
Coverage: world
Format: application/rdf+xml
Rights: http://www.deri.org/privacy.html
date: 2004-10-20
publisher: DERI International
comment: A part of a Book, which may be a chapter (or section or whatever) and/or a range of pages. Because the BibTex types inCollection and inBook are very similiar, we decided to keep the ontology as simple as possible and merge them both into Inbook .
Type: http://www.w3.org/2000/01/rdf-schema#Class
creator: DERI International

Tool
disjoint with: Nothing
subclass of: http://lodlaundromat.org/.well-known/genid/240cd8d701a3c44280314a4f06cca6bb#61
subclass of: http://lodlaundromat.org/.well-known/genid/240cd8d701a3c44280314a4f06cca6bb#3
subclass of: http://lodlaundromat.org/.well-known/genid/240cd8d701a3c44280314a4f06cca6bb#23
subclass of: Thing
subclass of: http://lodlaundromat.org/.well-known/genid/240cd8d701a3c44280314a4f06cca6bb#63
type: Class
Coverage: world
Format: application/rdf+xml
publisher: DERI International
comment: This class represents any kind of software tool. At the moment, this class is clearly underspecified.
Type: http://www.w3.org/2002/07/owl#Class
Rights: http://www.deri.org/privacy.html
date: 2004-10-20
creator: DERI International

Gives Tutorials
sub property of: topObjectProperty
property disjoint with: bottomObjectProperty
inverse of: Tutor
type: ObjectProperty
creator: DERI International
domain: Agent
Format: application/rdf+xml
description: This property relates an agent to the tutorials it gives. The inverse property is tutoredBy .
date: 2004-10-20
Type: http://www.w3.org/2002/07/owl#ObjectProperty
Coverage: world
Rights: http://www.deri.org/privacy.html
publisher: DERI International
range: Tutorial

Contained in Proceedings
sub property of: topObjectProperty
property disjoint with: bottomObjectProperty
inverse of: Contains Papers
type: ObjectProperty
Format: application/rdf+xml
creator: DERI International
domain: Inproceedings
Rights: http://www.deri.org/privacy.html
description: The proceedings some paper or similar is contained in.
Type: http://www.w3.org/2002/07/owl#ObjectProperty
range: Proceedings
date: 2004-10-20
Coverage: world
publisher: DERI International

Location
disjoint with: Nothing
subclass of: Thing
subclass of: http://lodlaundromat.org/.well-known/genid/240cd8d701a3c44280314a4f06cca6bb#63
type: Class
Format: application/rdf+xml
publisher: DERI International
date: 2004-10-20
creator: DERI International
comment: This class is the superclass for all classes defining geographical locations. The approach for this subontology is to have a hierarchy of location classes, such that instances of the classes further down in the hierarchy can be contained in instances of the classes higher up in the hierarchy. On each level, there exist two sister classes: class L defines a certain type of location, while class SubL defines locations which can be contained in instances of L. SubL then defines a property inL, to express which instance of L an instance of SubL is contained in. E.g. for a class Continent, there exists a class SubContinent. All children of SubContinent (either direct or transitive) define locations that can be contained in a continent, such as countries, regions, cities, etc. By virtue of inheritance, all these location classes then have a property inContinent, to express that they are contained in some continent. In a simpler, flat structure, inContinent would have to be defined explicitly for all kinds of locations that can be contained in a continent. The intepretation of the inL predicates should be as follows: if, for a particular instance K, inL has a value, this value is valid. If inL has no value, the value of inL in the next location K is contained in valid, and so forth. E.g. an instance "Hawaii" has the value "Oceania" defined for inContinent and "USA" for inCountry . "Delaware" has no value for inContinent. "USA" has the value "North America" for inContinent . The interpretation would be that "Hawaii" is located in "Oceania", while "Delaware" is located in "North America". We are aware of the fact that this approach is idealized and can therefore conflict with reality in some situations. E.g., the exact borders of continents are not always defined (there are contradicting opinions on where exactly Europe begins or ends). Countries could be contained in more than one continent (Turkey belongs to both Europe and Asia). However, we think that these situations ar…
Coverage: world
Type: http://www.w3.org/2000/01/rdf-schema#Class
Rights: http://www.deri.org/privacy.html

Volume
subclass of: http://lodlaundromat.org/.well-known/genid/240cd8d701a3c44280314a4f06cca6bb#11
subclass of: http://lodlaundromat.org/.well-known/genid/240cd8d701a3c44280314a4f06cca6bb#3
type: Class
subclass of: Publication
subclass of: Dated Publication
subclass of: Document
subclass of: Thing
disjoint with: Nothing
subclass of: http://lodlaundromat.org/.well-known/genid/240cd8d701a3c44280314a4f06cca6bb#25
subclass of: http://lodlaundromat.org/.well-known/genid/240cd8d701a3c44280314a4f06cca6bb#23
creator: DERI International
publisher: DERI International
Type: http://www.w3.org/2000/01/rdf-schema#Class
date: 2004-10-20
description: An individual volume of some Journal .
Coverage: world
Format: application/rdf+xml
Rights: http://www.deri.org/privacy.html

Conference
subclass of: http://lodlaundromat.org/.well-known/genid/240cd8d701a3c44280314a4f06cca6bb#4
subclass of: Thing
subclass of: http://lodlaundromat.org/.well-known/genid/240cd8d701a3c44280314a4f06cca6bb#47
type: Class
subclass of: http://lodlaundromat.org/.well-known/genid/240cd8d701a3c44280314a4f06cca6bb#42
disjoint with: Nothing
subclass of: Event
subclass of: http://lodlaundromat.org/.well-known/genid/240cd8d701a3c44280314a4f06cca6bb#63
subclass of: http://lodlaundromat.org/.well-known/genid/240cd8d701a3c44280314a4f06cca6bb#9
Coverage: world
description: This class represents all kinds of conferences in the academic domain.
publisher: DERI International
creator: DERI International
Type: http://www.w3.org/2002/07/owl#Class
date: 2004-10-20
Format: application/rdf+xml
Rights: http://www.deri.org/privacy.html

Dublin Core Metadata Element Set, Version 1.1
modified: 2012-06-14
publisher: DCMI
type: Thing

Title
modified: 2008-01-14
note: A second property with the same name as this property has been declared in the dcterms: namespace (http://purl.org/dc/terms/). See the Introduction to the document "DCMI Metadata Terms" (http://dublincore.org/documents/dcmi-terms/) for an explanation.
issued: 1999-07-02
has version: title-006
type: Thing
type: Property
comment: A name given to the resource.
type: AnnotationProperty

Work Package
disjoint with: Nothing
subclass of: http://lodlaundromat.org/.well-known/genid/240cd8d701a3c44280314a4f06cca6bb#63
subclass of: http://lodlaundromat.org/.well-known/genid/240cd8d701a3c44280314a4f06cca6bb#47
subclass of: Temporary Group
subclass of: Thing
subclass of: Group
subclass of: http://lodlaundromat.org/.well-known/genid/240cd8d701a3c44280314a4f06cca6bb#4
type: Class
subclass of: http://lodlaundromat.org/.well-known/genid/240cd8d701a3c44280314a4f06cca6bb#7
subclass of: Agent
Type: http://www.w3.org/2000/01/rdf-schema#Class
description: A work package is a subdivision of a project. It stands in a part-of relationship to foaf:Project .
creator: DERI International
Format: application/rdf+xml
Rights: http://www.deri.org/privacy.html
date: 2004-10-20
publisher: DERI International
Coverage: world

ClericalStaff
disjoint with: Nothing
subclass of: Administrative Staff
subclass of: Thing
subclass of: http://lodlaundromat.org/.well-known/genid/240cd8d701a3c44280314a4f06cca6bb#63
subclass of: Agent
subclass of: Person
type: Class
Type: http://www.w3.org/2002/07/owl#Class
Coverage: world
description: This class represents all kinds of administrative staff that is related to clerical support. Examples are secretaries, accountants, etc.
Rights: http://www.deri.org/privacy.html
creator: DERI International
date: 2004-10-20
Format: application/rdf+xml
publisher: DERI International

Title
sub property of: topDataProperty
property disjoint with: Version
property disjoint with: bottomDataProperty
property disjoint with: Edition
equivalent property: Title
property disjoint with: Pages
property disjoint with: Chapter
type: FunctionalProperty
property disjoint with: Number
property disjoint with: Volume
property disjoint with: Publication Date
sub property of: Title
type: DatatypeProperty
domain: RSS1.0 News Item
publisher: RSS-DEV Working Group
range: string
Type: http://www.w3.org/2002/07/owl#DatatypeProperty
Coverage: world
Format: application/rdf+xml
creator: RSS-DEV Working Group

Fourth
sub property of: topObjectProperty
property disjoint with: bottomObjectProperty
type: ObjectProperty
domain: AgentSequence
creator: DERI International
Coverage: world
range: Agent
date: 2004-10-20
publisher: DERI International
Type: http://www.w3.org/2002/07/owl#ObjectProperty
Rights: http://www.deri.org/privacy.html
Format: application/rdf+xml
description: The fourth foaf:Agent in an AgentSequence .

Booklet
subclass of: http://lodlaundromat.org/.well-known/genid/240cd8d701a3c44280314a4f06cca6bb#3
subclass of: http://lodlaundromat.org/.well-known/genid/240cd8d701a3c44280314a4f06cca6bb#23
disjoint with: Nothing
subclass of: http://lodlaundromat.org/.well-known/genid/240cd8d701a3c44280314a4f06cca6bb#1
subclass of: Publication
subclass of: Document
subclass of: Thing
subclass of: Dated Publication
type: Class
description: A work that is printed and bound, but without a named publisher or sponsoring institution.
Rights: http://www.deri.org/privacy.html
publisher: DERI International
Type: http://www.w3.org/2002/07/owl#Class
Format: application/rdf+xml
Coverage: world
date: 2004-10-20
creator: DERI International

Description
property disjoint with: Number
property disjoint with: Publication Date
property disjoint with: Version
property disjoint with: Pages
property disjoint with: bottomDataProperty
type: DatatypeProperty
equivalent property: Note
property disjoint with: Edition
type: FunctionalProperty
property disjoint with: Chapter
sub property of: Note
sub property of: topDataProperty
property disjoint with: Volume
domain: RSS1.0 News Item
Type: http://www.w3.org/2002/07/owl#DatatypeProperty
Coverage: world
Format: application/rdf+xml
range: string
publisher: RSS-DEV Working Group
creator: RSS-DEV Working Group

Lecturer
sub property of: topObjectProperty
property disjoint with: bottomObjectProperty
type: ObjectProperty
domain: Lecture
range: Agent
creator: DERI International
publisher: DERI International
Coverage: world
Type: http://www.w3.org/2002/07/owl#ObjectProperty
Format: application/rdf+xml
description: The agent who is giving the lecture.
date: 2004-10-20
Rights: http://www.deri.org/privacy.html

PhD Thesis
subclass of: http://lodlaundromat.org/.well-known/genid/240cd8d701a3c44280314a4f06cca6bb#23
subclass of: Thing
type: Class
subclass of: Dated Publication
subclass of: Publication
subclass of: Document
subclass of: http://lodlaundromat.org/.well-known/genid/240cd8d701a3c44280314a4f06cca6bb#3
disjoint with: Nothing
subclass of: Thesis
Rights: http://www.deri.org/privacy.html
creator: DERI International
date: 2004-10-20
Format: application/rdf+xml
Coverage: world
Type: http://www.w3.org/2002/07/owl#Class
publisher: DERI International
description: A thesis written to receive a PhD degree.

Type
description: Recommended best practice is to use a controlled vocabulary such as the DCMI Type Vocabulary [DCMITYPE]. To describe the file format, physical medium, or dimensions of the resource, use the Format element.
modified: 2008-01-14
note: A second property with the same name as this property has been declared in the dcterms: namespace (http://purl.org/dc/terms/). See the Introduction to the document "DCMI Metadata Terms" (http://dublincore.org/documents/dcmi-terms/) for an explanation.
issued: 1999-07-02
has version: type-006
type: Thing
comment: The nature or genre of the resource.
type: Property
type: AnnotationProperty

Location
sub property of: topObjectProperty
property disjoint with: bottomObjectProperty
type: FunctionalProperty
type: ObjectProperty
Rights: http://www.deri.org/privacy.html
Coverage: world
domain: Event
publisher: DERI International
creator: DERI International
description: The Location of an Event .
Format: application/rdf+xml
date: 2004-10-20
range: Location
Type: http://www.w3.org/2002/07/owl#FunctionalProperty

Student
type: Class
subclass of: Researcher
disjoint with: Nothing
subclass of: http://lodlaundromat.org/.well-known/genid/240cd8d701a3c44280314a4f06cca6bb#35
subclass of: Person
subclass of: Thing
subclass of: http://lodlaundromat.org/.well-known/genid/240cd8d701a3c44280314a4f06cca6bb#63
subclass of: Agent
Coverage: world
Rights: http://www.deri.org/privacy.html
publisher: DERI International
date: 2004-10-20
Format: application/rdf+xml
comment: This class represents all kinds of researchers who are students.
Type: http://www.w3.org/2002/07/owl#Class
creator: DERI International

News Item
disjoint with: Nothing
subclass of: http://lodlaundromat.org/.well-known/genid/240cd8d701a3c44280314a4f06cca6bb#3
subclass of: Publication
subclass of: Thing
subclass of: Document
type: Class
Coverage: world
comment: This class is the super-class for any kind of news item.
publisher: DERI International
date: 2004-10-20
creator: DERI International
Format: application/rdf+xml
Rights: http://www.deri.org/privacy.html
Type: http://www.w3.org/2002/07/owl#Class

Pages
type: DatatypeProperty
property disjoint with: Note
property disjoint with: First Name
property disjoint with: Street
property disjoint with: bottomDataProperty
property disjoint with: How Published
type: FunctionalProperty
property disjoint with: Title
property disjoint with: Items
property disjoint with: Version
property disjoint with: Surname
property disjoint with: Description
property disjoint with: Complete Name
sub property of: topDataProperty
property disjoint with: hasZipcode
property disjoint with: Goal
property disjoint with: Publication Date
property disjoint with: Link
property disjoint with: POBox
creator: DERI International
domain: http://lodlaundromat.org/.well-known/genid/240cd8d701a3c44280314a4f06cca6bb#45
description: One or more page numbers or range of numbers, such as 42--111 or 7,41,73--97 or 43+ (the `+' in this last example indicates pages following that don't form a simple range). To make it easier to maintain Scribe-compatible databases, the standard styles convert a single dash (as in 7-33) to the double dash used in TeX to denote number ranges (as in 7--33).
Type: http://www.w3.org/2002/07/owl#DatatypeProperty
publisher: DERI International
Format: application/rdf+xml
range: nonNegativeInteger
date: 2004-10-20
Coverage: world
Rights: http://www.deri.org/privacy.html

First Name
type: FunctionalProperty
property disjoint with: bottomDataProperty
property disjoint with: Version
property disjoint with: Chapter
property disjoint with: Publication Date
property disjoint with: Edition
property disjoint with: Number
property disjoint with: Volume
type: DatatypeProperty
sub property of: topDataProperty
property disjoint with: Pages
Format: application/rdf+xml
creator: Libby Miller
publisher: Dan Brickley
Type: http://www.w3.org/2002/07/owl#DatatypeProperty
comment: "The first name of a person." NOTE: the naming substructure of foaf is currently quite unstable.
domain: Person
Contributor: http://www.w3.org/RDF/Interest/
creator: Dan Brickley
publisher: Libby Miller
range: string
Contributor: http://rdfweb.org/mailman/listinfo/rdfweb-dev
Coverage: world

Event
disjoint with: Nothing
subclass of: http://lodlaundromat.org/.well-known/genid/240cd8d701a3c44280314a4f06cca6bb#47
subclass of: http://lodlaundromat.org/.well-known/genid/240cd8d701a3c44280314a4f06cca6bb#4
subclass of: Thing
subclass of: http://lodlaundromat.org/.well-known/genid/240cd8d701a3c44280314a4f06cca6bb#63
type: Class
Rights: http://www.deri.org/privacy.html
creator: DERI International
Format: application/rdf+xml
Type: http://www.w3.org/2000/01/rdf-schema#Class
Coverage: world
date: 2004-10-20
comment: This class represents events relevant for the area of teaching, research, business, i.e. conferences, presentations, tutorials, workshops and lectures.
publisher: DERI International

Contained in Book
sub property of: topObjectProperty
property disjoint with: bottomObjectProperty
inverse of: Contains Chapters
type: FunctionalProperty
type: ObjectProperty
date: 2004-10-20
Format: application/rdf+xml
publisher: DERI International
creator: DERI International
Type: http://www.w3.org/2002/07/owl#FunctionalProperty
Coverage: world
Rights: http://www.deri.org/privacy.html
description: The Book in which an Inbook is contained.
range: Book
domain: Inbook

In Region
sub property of: topObjectProperty
property disjoint with: bottomObjectProperty
type: FunctionalProperty
type: ObjectProperty
creator: DERI International
publisher: DERI International
range: Region
Format: application/rdf+xml
domain: Sub-Region
description: The Region in which some SubRegion is contained.
Type: http://www.w3.org/2002/07/owl#FunctionalProperty
Coverage: world
Rights: http://www.deri.org/privacy.html
date: 2004-10-20

Edited by
sub property of: topObjectProperty
property disjoint with: bottomObjectProperty
type: FunctionalProperty
type: ObjectProperty
range: AgentSequence
publisher: DERI International
creator: DERI International
Type: http://www.w3.org/2002/07/owl#ObjectProperty
date: 2004-10-20
domain: Publication Container
Format: application/rdf+xml
Rights: http://www.deri.org/privacy.html
Coverage: world

Company
subclass of: Thing
subclass of: Agent
disjoint with: Nothing
type: Class
subclass of: Group
subclass of: http://lodlaundromat.org/.well-known/genid/240cd8d701a3c44280314a4f06cca6bb#63
subclass of: Organization
Coverage: world
description: This class represents all kinds of companies. Currently only publishers and software developers are modelled.
Rights: http://www.deri.org/privacy.html
Type: http://www.w3.org/2000/01/rdf-schema#Class
creator: DERI International
date: 2004-10-20
Format: application/rdf+xml
publisher: DERI International

Workpackages
sub property of: topObjectProperty
property disjoint with: bottomObjectProperty
inverse of: Belongs to Project
type: ObjectProperty
Coverage: world
Rights: http://www.deri.org/privacy.html
Format: application/rdf+xml
range: Work Package
Type: http://www.w3.org/2002/07/owl#ObjectProperty
comment: The work packages of a project.
creator: DERI International
date: 2004-10-20
publisher: DERI International
domain: Project

Publication
disjoint with: Nothing
subclass of: Thing
type: Class
Format: application/rdf+xml
publisher: DERI International
creator: DERI International
comment: Publications are both individual documents and collections of documents such as series, journals, etc.
Type: http://www.w3.org/2000/01/rdf-schema#Class
date: 2004-10-20
Coverage: world
Rights: http://www.deri.org/privacy.html

Management Staff
disjoint with: Nothing
subclass of: Thing
subclass of: http://lodlaundromat.org/.well-known/genid/240cd8d701a3c44280314a4f06cca6bb#63
subclass of: Agent
subclass of: Person
type: Class
Rights: http://www.deri.org/privacy.html
Type: http://www.w3.org/2002/07/owl#Class
date: 2004-10-20
Format: application/rdf+xml
comment: This class represents the management staff.
Coverage: world
publisher: DERI International
creator: DERI International

Products
sub property of: topObjectProperty
property disjoint with: bottomObjectProperty
type: ObjectProperty
description: This property defines the products of a company.
range: Thing
publisher: DERI International
Rights: http://www.deri.org/privacy.html
Format: application/rdf+xml
creator: DERI International
domain: Company
Type: http://www.w3.org/2002/07/owl#ObjectProperty
date: 2004-10-20
Coverage: world

Seventh
sub property of: topObjectProperty
property disjoint with: bottomObjectProperty
type: ObjectProperty
domain: AgentSequence
creator: DERI International
Coverage: world
description: The seventh foaf:Agent in an AgentSequence .
date: 2004-10-20
Format: application/rdf+xml
range: Agent
publisher: DERI International
Type: http://www.w3.org/2002/07/owl#ObjectProperty
Rights: http://www.deri.org/privacy.html

Endtime
sub property of: topObjectProperty
property disjoint with: bottomObjectProperty
type: FunctionalProperty
type: ObjectProperty
Coverage: world
date: 2004-10-20
range: time
description: The time when some event ends.
Format: application/rdf+xml
creator: DERI International
Rights: http://www.deri.org/privacy.html
domain: http://lodlaundromat.org/.well-known/genid/240cd8d701a3c44280314a4f06cca6bb#15
Type: http://www.w3.org/2002/07/owl#FunctionalProperty
publisher: DERI International

Belongs to Project
sub property of: topObjectProperty
property disjoint with: bottomObjectProperty
inverse of: Workpackages
type: ObjectProperty
domain: Work Package
Rights: http://www.deri.org/privacy.html
range: Project
creator: DERI International
comment: Defines what project a workpackage belongs to.
Coverage: world
date: 2004-10-20
Format: application/rdf+xml
Type: http://www.w3.org/2002/07/owl#ObjectProperty
publisher: DERI International

Past Project
sub property of: topObjectProperty
property disjoint with: bottomObjectProperty
type: SymmetricProperty
type: ObjectProperty
domain: Agent
description: "A project this person has previously worked on." NOTE: foaf defines the range as foaf:Person - we decided to change this to the more general foaf:Agent , since other types of Agents (e.g. a company) can also have projects.
Contributor: http://www.w3.org/RDF/Interest/
Format: application/rdf+xml
Type: http://www.w3.org/2002/07/owl#ObjectProperty
creator: Libby Miller
Coverage: world
creator: Dan Brickley
Contributor: http://rdfweb.org/mailman/listinfo/rdfweb-dev
publisher: Libby Miller
publisher: Dan Brickley
range: Project

SWPortal Ontology - Semantic Web Portal Ontology
description: The aim of the Semantic Web Portal Ontology is to serve as the conceptual backbone for community portals driven by Semantic Web technologies.
Format: application/rdf+xml
Type: http://www.w3.org/2002/07/owl#Ontology
creator: DERI International
date: 2004-10-20
Rights: http://www.deri.org/privacy.html
type: Ontology
imports: Dublin Core Metadata Element Set, Version 1.1
Coverage: world
publisher: DERI International