Administrative Staff
subclass of: Resource
subclass of: Thing
type: Class
Coverage: world
date: 2004-10-20
Rights: http://www.deri.org/privacy.html
subclass of: Person
Type: http://www.w3.org/2000/01/rdf-schema#Class
description: This class represents administrative staff.
creator: DERI International
Format: application/rdf+xml
publisher: DERI International
subclass of: Agent
subclass of: http://lodlaundromat.org/.well-known/genid/240cd8d701a3c44280314a4f06cca6bb#63

Tutor
range: Thing
domain: Thing
comment: The tutors of a tutorial.
inverse of: Gives Tutorials
Rights: http://www.deri.org/privacy.html
date: 2004-10-20
Type: http://www.w3.org/2002/07/owl#ObjectProperty
Coverage: world
publisher: DERI International
creator: DERI International
range: Agent
domain: Tutorial
Format: application/rdf+xml
type: ObjectProperty
type: Property
domain: http://lodlaundromat.org/.well-known/genid/240cd8d701a3c44280314a4f06cca6bb#63
domain: http://lodlaundromat.org/.well-known/genid/240cd8d701a3c44280314a4f06cca6bb#47
domain: http://lodlaundromat.org/.well-known/genid/240cd8d701a3c44280314a4f06cca6bb#15
domain: Resource
domain: http://lodlaundromat.org/.well-known/genid/240cd8d701a3c44280314a4f06cca6bb#50
domain: http://lodlaundromat.org/.well-known/genid/240cd8d701a3c44280314a4f06cca6bb#4
domain: Event
range: Resource
range: http://lodlaundromat.org/.well-known/genid/240cd8d701a3c44280314a4f06cca6bb#63

Conference
subclass of: http://lodlaundromat.org/.well-known/genid/240cd8d701a3c44280314a4f06cca6bb#9
subclass of: http://lodlaundromat.org/.well-known/genid/240cd8d701a3c44280314a4f06cca6bb#42
subclass of: Resource
subclass of: Thing
type: Class
Coverage: world
description: This class represents all kinds of conferences in the academic domain.
publisher: DERI International
creator: DERI International
subclass of: Event
Type: http://www.w3.org/2002/07/owl#Class
date: 2004-10-20
Format: application/rdf+xml
Rights: http://www.deri.org/privacy.html
subclass of: http://lodlaundromat.org/.well-known/genid/240cd8d701a3c44280314a4f06cca6bb#4
subclass of: http://lodlaundromat.org/.well-known/genid/240cd8d701a3c44280314a4f06cca6bb#47
subclass of: http://lodlaundromat.org/.well-known/genid/240cd8d701a3c44280314a4f06cca6bb#63

Description
sub property of: Note
type: DatatypeProperty
domain: RSS1.0 News Item
Type: http://www.w3.org/2002/07/owl#DatatypeProperty
equivalent property: Note
Coverage: world
Format: application/rdf+xml
type: FunctionalProperty
range: string
publisher: RSS-DEV Working Group
creator: RSS-DEV Working Group
type: Property
range: Resource
domain: Publication
domain: Thing
domain: Resource
domain: News Item
domain: Document
domain: http://lodlaundromat.org/.well-known/genid/240cd8d701a3c44280314a4f06cca6bb#3

Title
sub property of: Title
domain: RSS1.0 News Item
equivalent property: Title
type: FunctionalProperty
publisher: RSS-DEV Working Group
range: string
Type: http://www.w3.org/2002/07/owl#DatatypeProperty
Coverage: world
Format: application/rdf+xml
type: DatatypeProperty
creator: RSS-DEV Working Group
type: Property
range: Resource
domain: Publication
domain: Resource
domain: Thing
domain: News Item
domain: Document
domain: http://lodlaundromat.org/.well-known/genid/240cd8d701a3c44280314a4f06cca6bb#3

Workpackages
range: Thing
domain: Thing
Coverage: world
Rights: http://www.deri.org/privacy.html
type: ObjectProperty
Format: application/rdf+xml
range: Work Package
inverse of: Belongs to Project
Type: http://www.w3.org/2002/07/owl#ObjectProperty
comment: The work packages of a project.
creator: DERI International
date: 2004-10-20
publisher: DERI International
domain: Project
type: Property
domain: http://lodlaundromat.org/.well-known/genid/240cd8d701a3c44280314a4f06cca6bb#63
domain: Agent
domain: Resource
domain: http://lodlaundromat.org/.well-known/genid/240cd8d701a3c44280314a4f06cca6bb#47
domain: Temporary Group
domain: http://lodlaundromat.org/.well-known/genid/240cd8d701a3c44280314a4f06cca6bb#7
domain: http://lodlaundromat.org/.well-known/genid/240cd8d701a3c44280314a4f06cca6bb#4
domain: Group
range: http://lodlaundromat.org/.well-known/genid/240cd8d701a3c44280314a4f06cca6bb#63
range: Agent
range: http://lodlaundromat.org/.well-known/genid/240cd8d701a3c44280314a4f06cca6bb#4
range: Group
range: http://lodlaundromat.org/.well-known/genid/240cd8d701a3c44280314a4f06cca6bb#47
range: http://lodlaundromat.org/.well-known/genid/240cd8d701a3c44280314a4f06cca6bb#7
range: Resource
range: Temporary Group

Tool
subclass of: http://lodlaundromat.org/.well-known/genid/240cd8d701a3c44280314a4f06cca6bb#23
subclass of: http://lodlaundromat.org/.well-known/genid/240cd8d701a3c44280314a4f06cca6bb#63
subclass of: http://lodlaundromat.org/.well-known/genid/240cd8d701a3c44280314a4f06cca6bb#61
subclass of: Resource
subclass of: Thing
type: Class
subclass of: http://lodlaundromat.org/.well-known/genid/240cd8d701a3c44280314a4f06cca6bb#3
Coverage: world
Format: application/rdf+xml
publisher: DERI International
comment: This class represents any kind of software tool. At the moment, this class is clearly underspecified.
Type: http://www.w3.org/2002/07/owl#Class
Rights: http://www.deri.org/privacy.html
date: 2004-10-20
creator: DERI International

Eigth
range: Thing
domain: Thing
Coverage: world
date: 2004-10-20
domain: AgentSequence
type: ObjectProperty
creator: DERI International
Rights: http://www.deri.org/privacy.html
range: Agent
Format: application/rdf+xml
publisher: DERI International
Type: http://www.w3.org/2002/07/owl#ObjectProperty
comment: The eigth foaf:Agent in an AgentSequence .
type: Property
domain: Resource
range: Resource
range: http://lodlaundromat.org/.well-known/genid/240cd8d701a3c44280314a4f06cca6bb#63

For Project
range: http://lodlaundromat.org/.well-known/genid/240cd8d701a3c44280314a4f06cca6bb#7
range: Thing
domain: Thing
Type: http://www.w3.org/2002/07/owl#ObjectProperty
type: ObjectProperty
comment: The project for which this deliverable is produced. The inverse is deliverables .
domain: Deliverable
date: 2004-10-20
Format: application/rdf+xml
Rights: http://www.deri.org/privacy.html
inverse of: Deliverables
creator: DERI International
Coverage: world
publisher: DERI International
range: Project
type: Property
domain: Resource
domain: Publication
domain: http://lodlaundromat.org/.well-known/genid/240cd8d701a3c44280314a4f06cca6bb#11
domain: http://lodlaundromat.org/.well-known/genid/240cd8d701a3c44280314a4f06cca6bb#61
domain: http://lodlaundromat.org/.well-known/genid/240cd8d701a3c44280314a4f06cca6bb#23
domain: Document
domain: Unpublished
domain: http://lodlaundromat.org/.well-known/genid/240cd8d701a3c44280314a4f06cca6bb#3
domain: Dated Publication
range: http://lodlaundromat.org/.well-known/genid/240cd8d701a3c44280314a4f06cca6bb#4
range: Resource
range: Agent
range: http://lodlaundromat.org/.well-known/genid/240cd8d701a3c44280314a4f06cca6bb#63
range: http://lodlaundromat.org/.well-known/genid/240cd8d701a3c44280314a4f06cca6bb#47
range: Group
range: Temporary Group

Lecturer
range: Thing
domain: Thing
domain: Lecture
range: Agent
creator: DERI International
publisher: DERI International
Coverage: world
Type: http://www.w3.org/2002/07/owl#ObjectProperty
Format: application/rdf+xml
description: The agent who is giving the lecture.
date: 2004-10-20
type: ObjectProperty
Rights: http://www.deri.org/privacy.html
type: Property
domain: http://lodlaundromat.org/.well-known/genid/240cd8d701a3c44280314a4f06cca6bb#63
domain: http://lodlaundromat.org/.well-known/genid/240cd8d701a3c44280314a4f06cca6bb#47
domain: http://lodlaundromat.org/.well-known/genid/240cd8d701a3c44280314a4f06cca6bb#15
domain: Resource
domain: http://lodlaundromat.org/.well-known/genid/240cd8d701a3c44280314a4f06cca6bb#50
domain: http://lodlaundromat.org/.well-known/genid/240cd8d701a3c44280314a4f06cca6bb#9
domain: http://lodlaundromat.org/.well-known/genid/240cd8d701a3c44280314a4f06cca6bb#4
domain: Event
range: Resource
range: http://lodlaundromat.org/.well-known/genid/240cd8d701a3c44280314a4f06cca6bb#63

At School
range: Thing
domain: Thing
Format: application/rdf+xml
Rights: http://www.deri.org/privacy.html
comment: The school where a thesis was written.
Type: http://www.w3.org/2002/07/owl#FunctionalProperty
Coverage: world
publisher: DERI International
type: ObjectProperty
date: 2004-10-20
domain: Thesis
creator: DERI International
type: FunctionalProperty
range: University
type: Property
domain: Resource
domain: Publication
domain: http://lodlaundromat.org/.well-known/genid/240cd8d701a3c44280314a4f06cca6bb#23
domain: Document
domain: http://lodlaundromat.org/.well-known/genid/240cd8d701a3c44280314a4f06cca6bb#3
domain: Dated Publication
range: http://lodlaundromat.org/.well-known/genid/240cd8d701a3c44280314a4f06cca6bb#63
range: Resource
range: Agent
range: Organization
range: Group
range: http://lodlaundromat.org/.well-known/genid/240cd8d701a3c44280314a4f06cca6bb#35

Master Thesis
subclass of: Resource
subclass of: Thing
type: Class
comment: A thesis written to receive a Master degree.
date: 2004-10-20
Format: application/rdf+xml
publisher: DERI International
Rights: http://www.deri.org/privacy.html
creator: DERI International
Type: http://www.w3.org/2002/07/owl#Class
subclass of: Thesis
Coverage: world
subclass of: Dated Publication
subclass of: http://lodlaundromat.org/.well-known/genid/240cd8d701a3c44280314a4f06cca6bb#23
subclass of: Document
subclass of: Publication
subclass of: http://lodlaundromat.org/.well-known/genid/240cd8d701a3c44280314a4f06cca6bb#3

In City
range: Thing
domain: Thing
Type: http://www.w3.org/2002/07/owl#FunctionalProperty
range: City
Rights: http://www.deri.org/privacy.html
publisher: DERI International
type: FunctionalProperty
domain: Sub-City
description: The City in which some SubCity is contained.
date: 2004-10-20
Format: application/rdf+xml
Coverage: world
type: ObjectProperty
creator: DERI International
type: Property
domain: http://lodlaundromat.org/.well-known/genid/240cd8d701a3c44280314a4f06cca6bb#63
domain: Sub-Continent
domain: Resource
domain: Sub-Region
domain: Sub-Country
domain: Location
range: Resource
range: Location
range: http://lodlaundromat.org/.well-known/genid/240cd8d701a3c44280314a4f06cca6bb#63
range: Sub-Country
range: Sub-Region
range: Sub-Continent

Postal Address
subclass of: Thing
subclass of: Resource
type: Class
Type: http://www.w3.org/2000/01/rdf-schema#Class
description: Instances of this class represent exact postal addresses. Note that either postbox of streetAddress should be given.
publisher: DERI International
creator: DERI International
Rights: http://www.deri.org/privacy.html
Format: application/rdf+xml
Coverage: world
subclass of: Sub-City
date: 2004-10-20
subclass of: Sub-Region
subclass of: http://lodlaundromat.org/.well-known/genid/240cd8d701a3c44280314a4f06cca6bb#63
subclass of: Location
subclass of: Sub-Continent
subclass of: Sub-Country

Member
range: Thing
domain: Thing
type: ObjectProperty
Format: application/rdf+xml
creator: Dan Brickley
comment: "Indicates a member of a Group." This property relates a set of agents to a group. These are the members of that group.
Type: http://www.w3.org/2002/07/owl#ObjectProperty
publisher: Libby Miller
Contributor: http://rdfweb.org/mailman/listinfo/rdfweb-dev
creator: Libby Miller
range: Agent
Contributor: http://www.w3.org/RDF/Interest/
publisher: Dan Brickley
domain: Group
Coverage: world
type: Property
domain: http://lodlaundromat.org/.well-known/genid/240cd8d701a3c44280314a4f06cca6bb#63
domain: Agent
domain: Resource
range: Resource
range: http://lodlaundromat.org/.well-known/genid/240cd8d701a3c44280314a4f06cca6bb#63

Email
range: Thing
domain: Thing
type: InverseFunctionalProperty
domain: Agent
Contributor: http://rdfweb.org/mailman/listinfo/rdfweb-dev
creator: Libby Miller
range: Literal
Coverage: world
creator: Dan Brickley
type: ObjectProperty
comment: "A personal mailbox, i.e. an internet mailbox associated with exactly one owner, the first owner of this mailbox. This is a 'static inverse functional property', in that there is (across time and change) at most one individual that ever has any particular value for foaf:mbox ." Because we switched over to OWL Lite– ,we don’t have functional properties anymore. However, we recommend to the users of this ontology to apply this property like it is described in the FOAF specification.
Type: http://www.w3.org/2002/07/owl#ObjectProperty
Format: application/rdf+xml
publisher: Dan Brickley
Contributor: http://www.w3.org/RDF/Interest/
publisher: Libby Miller
type: Property
domain: http://lodlaundromat.org/.well-known/genid/240cd8d701a3c44280314a4f06cca6bb#63
domain: Resource
range: Resource

Series
subclass of: Resource
subclass of: Thing
type: Class
description: A series or set of books.
subclass of: Publication Container
Type: http://www.w3.org/2000/01/rdf-schema#Class
date: 2004-10-20
Coverage: world
publisher: DERI International
Rights: http://www.deri.org/privacy.html
creator: DERI International
Format: application/rdf+xml
subclass of: Publication

Volume
subclass of: http://lodlaundromat.org/.well-known/genid/240cd8d701a3c44280314a4f06cca6bb#11
subclass of: Resource
subclass of: Thing
type: Class
subclass of: http://lodlaundromat.org/.well-known/genid/240cd8d701a3c44280314a4f06cca6bb#25
creator: DERI International
publisher: DERI International
Type: http://www.w3.org/2000/01/rdf-schema#Class
date: 2004-10-20
description: An individual volume of some Journal .
subclass of: Dated Publication
Coverage: world
Format: application/rdf+xml
Rights: http://www.deri.org/privacy.html
subclass of: Document
subclass of: http://lodlaundromat.org/.well-known/genid/240cd8d701a3c44280314a4f06cca6bb#23
subclass of: Publication
subclass of: http://lodlaundromat.org/.well-known/genid/240cd8d701a3c44280314a4f06cca6bb#3

Event
subclass of: http://lodlaundromat.org/.well-known/genid/240cd8d701a3c44280314a4f06cca6bb#47
subclass of: http://lodlaundromat.org/.well-known/genid/240cd8d701a3c44280314a4f06cca6bb#4
subclass of: http://lodlaundromat.org/.well-known/genid/240cd8d701a3c44280314a4f06cca6bb#63
subclass of: Resource
subclass of: Thing
type: Class
Rights: http://www.deri.org/privacy.html
creator: DERI International
Format: application/rdf+xml
Type: http://www.w3.org/2000/01/rdf-schema#Class
Coverage: world
date: 2004-10-20
comment: This class represents events relevant for the area of teaching, research, business, i.e. conferences, presentations, tutorials, workshops and lectures.
publisher: DERI International

Enddate
range: Thing
domain: Thing
type: ObjectProperty
description: The ending date some event.
Format: application/rdf+xml
Rights: http://www.deri.org/privacy.html
domain: http://lodlaundromat.org/.well-known/genid/240cd8d701a3c44280314a4f06cca6bb#4
date: 2004-10-20
Type: http://www.w3.org/2002/07/owl#ObjectProperty
creator: DERI International
Coverage: world
publisher: DERI International
range: date
type: Property
domain: Resource
range: Resource

City
subclass of: Thing
subclass of: Resource
type: Class
Type: http://www.w3.org/2000/01/rdf-schema#Class
subclass of: Sub-Region
Format: application/rdf+xml
publisher: DERI International
date: 2004-10-20
Coverage: world
comment: This class defines geopraphical bodies that are cities.
creator: DERI International
Rights: http://www.deri.org/privacy.html
subclass of: Location
subclass of: http://lodlaundromat.org/.well-known/genid/240cd8d701a3c44280314a4f06cca6bb#63
subclass of: Sub-Continent
subclass of: Sub-Country

Third
range: Thing
domain: Thing
type: ObjectProperty
description: The third foaf:Agent in an AgentSequence .
Coverage: world
range: Agent
date: 2004-10-20
Format: application/rdf+xml
publisher: DERI International
Type: http://www.w3.org/2002/07/owl#ObjectProperty
Rights: http://www.deri.org/privacy.html
creator: DERI International
domain: AgentSequence
type: Property
domain: Resource
range: Resource
range: http://lodlaundromat.org/.well-known/genid/240cd8d701a3c44280314a4f06cca6bb#63

Journal
subclass of: Thing
subclass of: Resource
type: Class
comment: A scientific journal or magazine. The instances of this class are not individual issues or voulumes of a journal, but the journal as such.
date: 2004-10-20
Rights: http://www.deri.org/privacy.html
Coverage: world
Format: application/rdf+xml
subclass of: Publication Container
Type: http://www.w3.org/2000/01/rdf-schema#Class
creator: DERI International
publisher: DERI International
subclass of: Publication

Address
range: Thing
domain: Thing
Format: application/rdf+xml
range: Postal Address
domain: Agent
date: 2004-10-20
type: ObjectProperty
description: This property relates an agent to its address.
Rights: http://www.deri.org/privacy.html
Type: http://www.w3.org/2002/07/owl#ObjectProperty
creator: DERI International
publisher: DERI International
Coverage: world
type: Property
domain: http://lodlaundromat.org/.well-known/genid/240cd8d701a3c44280314a4f06cca6bb#63
domain: Resource
range: Sub-Continent
range: Location
range: Sub-Country
range: http://lodlaundromat.org/.well-known/genid/240cd8d701a3c44280314a4f06cca6bb#63
range: Resource
range: Sub-Region
range: Sub-City

AgentSequence
subclass of: Thing
subclass of: Resource
type: Class
publisher: DERI International
description: This is an adhoc solution for creating and ordered group of Agents, e.g. an authorlist.
date: 2004-10-20
Type: http://www.w3.org/2000/01/rdf-schema#Class
Coverage: world
Format: application/rdf+xml
creator: DERI International
Rights: http://www.deri.org/privacy.html

Duration
range: Thing
domain: Thing
Format: application/rdf+xml
Rights: http://www.deri.org/privacy.html
creator: DERI International
publisher: DERI International
description: The duration of a temporary group.
date: 2004-10-20
Coverage: world
range: interval
Type: http://www.w3.org/2002/07/owl#ObjectProperty
domain: Temporary Group
type: ObjectProperty
type: Property
domain: http://lodlaundromat.org/.well-known/genid/240cd8d701a3c44280314a4f06cca6bb#63
domain: Agent
domain: Resource
domain: http://lodlaundromat.org/.well-known/genid/240cd8d701a3c44280314a4f06cca6bb#47
domain: http://lodlaundromat.org/.well-known/genid/240cd8d701a3c44280314a4f06cca6bb#7
domain: http://lodlaundromat.org/.well-known/genid/240cd8d701a3c44280314a4f06cca6bb#4
domain: Group
range: Resource

Knows
range: Thing
domain: Thing
publisher: Libby Miller
Contributor: http://www.w3.org/RDF/Interest/
Contributor: http://rdfweb.org/mailman/listinfo/rdfweb-dev
creator: Dan Brickley
publisher: Dan Brickley
type: ObjectProperty
creator: Libby Miller
description: "A person known by this person (indicating some level of reciprocated interaction between the parties)."
domain: Person
Format: application/rdf+xml
Coverage: world
range: Person
Type: http://www.w3.org/2002/07/owl#ObjectProperty
type: Property
domain: http://lodlaundromat.org/.well-known/genid/240cd8d701a3c44280314a4f06cca6bb#63
domain: Agent
domain: Resource
range: Resource
range: http://lodlaundromat.org/.well-known/genid/240cd8d701a3c44280314a4f06cca6bb#63
range: Agent

Presentations
range: Thing
domain: Thing
comment: The presentations that are offered during the course of an event.
creator: DERI International
publisher: DERI International
Format: application/rdf+xml
Type: http://www.w3.org/2002/07/owl#ObjectProperty
range: Presentation
type: ObjectProperty
date: 2004-10-20
Rights: http://www.deri.org/privacy.html
Coverage: world
domain: http://lodlaundromat.org/.well-known/genid/240cd8d701a3c44280314a4f06cca6bb#9
type: Property
domain: Resource
range: http://lodlaundromat.org/.well-known/genid/240cd8d701a3c44280314a4f06cca6bb#4
range: Resource
range: Event
range: http://lodlaundromat.org/.well-known/genid/240cd8d701a3c44280314a4f06cca6bb#50
range: http://lodlaundromat.org/.well-known/genid/240cd8d701a3c44280314a4f06cca6bb#15
range: http://lodlaundromat.org/.well-known/genid/240cd8d701a3c44280314a4f06cca6bb#47
range: http://lodlaundromat.org/.well-known/genid/240cd8d701a3c44280314a4f06cca6bb#63

Research Areas
range: Thing
domain: Thing
creator: DERI International
comment: The areas of research some research institute is involved in.
range: Topic
Format: application/rdf+xml
Type: http://www.w3.org/2002/07/owl#ObjectProperty
domain: http://lodlaundromat.org/.well-known/genid/240cd8d701a3c44280314a4f06cca6bb#35
type: ObjectProperty
date: 2004-10-20
publisher: DERI International
Coverage: world
Rights: http://www.deri.org/privacy.html
type: Property
domain: Resource
range: Resource

Publication
subclass of: Resource
subclass of: Thing
type: Class
Format: application/rdf+xml
publisher: DERI International
creator: DERI International
comment: Publications are both individual documents and collections of documents such as series, journals, etc.
Type: http://www.w3.org/2000/01/rdf-schema#Class
date: 2004-10-20
Coverage: world
Rights: http://www.deri.org/privacy.html

In Country
range: Thing
domain: Thing
Type: http://www.w3.org/2002/07/owl#FunctionalProperty
Format: application/rdf+xml
creator: DERI International
domain: Sub-Country
Rights: http://www.deri.org/privacy.html
comment: The Country in which some SubCountry is contained.
type: FunctionalProperty
publisher: DERI International
range: Country
Coverage: world
date: 2004-10-20
type: ObjectProperty
type: Property
domain: http://lodlaundromat.org/.well-known/genid/240cd8d701a3c44280314a4f06cca6bb#63
domain: Sub-Continent
domain: Resource
domain: Location
range: Resource
range: Location
range: http://lodlaundromat.org/.well-known/genid/240cd8d701a3c44280314a4f06cca6bb#63
range: Sub-Continent

Ninth
range: Thing
domain: Thing
comment: The ninth foaf:Agent in an AgentSequence .
type: ObjectProperty
date: 2004-10-20
creator: DERI International
Format: application/rdf+xml
Coverage: world
range: Agent
Rights: http://www.deri.org/privacy.html
Type: http://www.w3.org/2002/07/owl#ObjectProperty
publisher: DERI International
domain: AgentSequence
type: Property
domain: Resource
range: Resource
range: http://lodlaundromat.org/.well-known/genid/240cd8d701a3c44280314a4f06cca6bb#63

RSS1.0 News Channel
subclass of: Resource
subclass of: Thing
type: Class
comment: "An RSS information channel."
creator: RSS-DEV Working Group
publisher: RSS-DEV Working Group
Format: application/rdf+xml
Coverage: world
Type: http://www.w3.org/2000/01/rdf-schema#Class
subclass of: Publication Container
subclass of: Publication

TechnicalStaff
subclass of: Resource
subclass of: Thing
type: Class
date: 2004-10-20
Format: application/rdf+xml
creator: DERI International
Coverage: world
Rights: http://www.deri.org/privacy.html
comment: This class represents all kinds of administrative staff that is employed for technical issues. Examples are system administrators, hardware specialists, etc.
publisher: DERI International
subclass of: Administrative Staff
Type: http://www.w3.org/2002/07/owl#Class
subclass of: Person
subclass of: Agent
subclass of: http://lodlaundromat.org/.well-known/genid/240cd8d701a3c44280314a4f06cca6bb#63

Organized by
range: Thing
domain: Thing
Format: application/rdf+xml
domain: Event
description: The organizers of an event. At least one agent has to organize an event. The inverse property is organizes .
publisher: DERI International
Type: http://www.w3.org/2002/07/owl#ObjectProperty
creator: DERI International
inverse of: Organizes
range: Agent
type: ObjectProperty
date: 2004-10-20
Coverage: world
Rights: http://www.deri.org/privacy.html
type: Property
domain: http://lodlaundromat.org/.well-known/genid/240cd8d701a3c44280314a4f06cca6bb#63
domain: http://lodlaundromat.org/.well-known/genid/240cd8d701a3c44280314a4f06cca6bb#47
domain: Resource
domain: http://lodlaundromat.org/.well-known/genid/240cd8d701a3c44280314a4f06cca6bb#4
range: Resource
range: http://lodlaundromat.org/.well-known/genid/240cd8d701a3c44280314a4f06cca6bb#63

Working Group
subclass of: Resource
subclass of: Thing
type: Class
Coverage: world
creator: DERI International
Rights: http://www.deri.org/privacy.html
subclass of: Temporary Group
description: A working group is similar to Initiative . We might unify two classes into one in the future.
date: 2004-10-20
Format: application/rdf+xml
Type: http://www.w3.org/2002/07/owl#Class
publisher: DERI International
subclass of: http://lodlaundromat.org/.well-known/genid/240cd8d701a3c44280314a4f06cca6bb#7
subclass of: http://lodlaundromat.org/.well-known/genid/240cd8d701a3c44280314a4f06cca6bb#47
subclass of: Group
subclass of: http://lodlaundromat.org/.well-known/genid/240cd8d701a3c44280314a4f06cca6bb#4
subclass of: Agent
subclass of: http://lodlaundromat.org/.well-known/genid/240cd8d701a3c44280314a4f06cca6bb#63

Thesis
subclass of: Resource
subclass of: Thing
type: Class
publisher: DERI International
date: 2004-10-20
Coverage: world
comment: Any kind of thesis produced to receive some sort of university degree.
Format: application/rdf+xml
subclass of: Dated Publication
creator: DERI International
Rights: http://www.deri.org/privacy.html
Type: http://www.w3.org/2000/01/rdf-schema#Class
subclass of: http://lodlaundromat.org/.well-known/genid/240cd8d701a3c44280314a4f06cca6bb#23
subclass of: Document
subclass of: http://lodlaundromat.org/.well-known/genid/240cd8d701a3c44280314a4f06cca6bb#3
subclass of: Publication

Continent
subclass of: Resource
subclass of: Thing
type: Class
comment: This class defines geopraphical bodies that are continents.
Rights: http://www.deri.org/privacy.html
Type: http://www.w3.org/2000/01/rdf-schema#Class
publisher: DERI International
creator: DERI International
Format: application/rdf+xml
subclass of: Location
date: 2004-10-20
Coverage: world
subclass of: http://lodlaundromat.org/.well-known/genid/240cd8d701a3c44280314a4f06cca6bb#63

hasVolumes
range: Thing
domain: Thing
date: 2004-10-20
Coverage: world
range: Volume
Format: application/rdf+xml
publisher: DERI International
comment: The Volume s of this journal.
Rights: http://www.deri.org/privacy.html
domain: Journal
Type: http://www.w3.org/2002/07/owl#ObjectProperty
inverse of: ofJournal
type: ObjectProperty
creator: DERI International
type: Property
domain: Resource
domain: Publication Container
domain: Publication
range: Dated Publication
range: http://lodlaundromat.org/.well-known/genid/240cd8d701a3c44280314a4f06cca6bb#25
range: Resource
range: http://lodlaundromat.org/.well-known/genid/240cd8d701a3c44280314a4f06cca6bb#11
range: Publication
range: Document
range: http://lodlaundromat.org/.well-known/genid/240cd8d701a3c44280314a4f06cca6bb#23
range: http://lodlaundromat.org/.well-known/genid/240cd8d701a3c44280314a4f06cca6bb#3

Theme
domain: Thing
range: Thing
type: ObjectProperty
Coverage: world
Contributor: http://rdfweb.org/mailman/listinfo/rdfweb-dev
domain: Group
Format: application/rdf+xml
description: "A theme. The foaf:theme property is rarely used and under-specified. The intention was to use it to characterise interest / themes associated with projects and groups. Further work is need to meet these goals." NOTE: This property is only listed for comparison with goal.
creator: Dan Brickley
Type: http://www.w3.org/2002/07/owl#ObjectProperty
Contributor: http://www.w3.org/RDF/Interest/
creator: Libby Miller
publisher: Dan Brickley
publisher: Libby Miller
type: Property
domain: http://lodlaundromat.org/.well-known/genid/240cd8d701a3c44280314a4f06cca6bb#63
domain: Agent
domain: Resource
range: Resource

Tasks
range: Thing
domain: Thing
Format: application/rdf+xml
date: 2004-10-20
Type: http://www.w3.org/2002/07/owl#ObjectProperty
comment: The tasks of a member of the administrative staff.
type: ObjectProperty
domain: Administrative Staff
Coverage: world
Rights: http://www.deri.org/privacy.html
creator: DERI International
publisher: DERI International
range: Topic
type: Property
domain: http://lodlaundromat.org/.well-known/genid/240cd8d701a3c44280314a4f06cca6bb#63
domain: Agent
domain: Resource
domain: Person
range: Resource

Topic
domain: Thing
Coverage: world
creator: Libby Miller
range: Thing
Type: http://www.w3.org/2002/07/owl#ObjectProperty
publisher: Libby Miller
Format: application/rdf+xml
domain: Document
Contributor: http://www.w3.org/RDF/Interest/
type: ObjectProperty
publisher: Dan Brickley
comment: "A topic of some page or document. The foaf:topic property relates a document to a thing that the document is about. As such it is an inverse to the foaf:page property, which relates a thing to a document about that thing."
creator: Dan Brickley
Contributor: http://rdfweb.org/mailman/listinfo/rdfweb-dev
type: Property
domain: Resource
domain: Publication
domain: http://lodlaundromat.org/.well-known/genid/240cd8d701a3c44280314a4f06cca6bb#3
range: Resource

Fourth
range: Thing
domain: Thing
domain: AgentSequence
type: ObjectProperty
creator: DERI International
Coverage: world
range: Agent
date: 2004-10-20
publisher: DERI International
Type: http://www.w3.org/2002/07/owl#ObjectProperty
Rights: http://www.deri.org/privacy.html
Format: application/rdf+xml
description: The fourth foaf:Agent in an AgentSequence .
type: Property
domain: Resource
range: Resource
range: http://lodlaundromat.org/.well-known/genid/240cd8d701a3c44280314a4f06cca6bb#63

In Series
range: Thing
domain: Thing
description: The instance of Series in which this document was published.
Type: http://www.w3.org/2002/07/owl#FunctionalProperty
Coverage: world
Format: application/rdf+xml
range: Series
creator: DERI International
domain: http://lodlaundromat.org/.well-known/genid/240cd8d701a3c44280314a4f06cca6bb#19
date: 2004-10-20
type: FunctionalProperty
publisher: DERI International
Rights: http://www.deri.org/privacy.html
type: ObjectProperty
type: Property
domain: Resource
range: Resource
range: Publication
range: Publication Container

Sub-City
subclass of: Thing
subclass of: Resource
type: Class
creator: DERI International
Rights: http://www.deri.org/privacy.html
Type: http://www.w3.org/2000/01/rdf-schema#Class
description: This class defines geopraphical bodies that can be contained in cities.
Coverage: world
subclass of: Sub-Region
Format: application/rdf+xml
date: 2004-10-20
publisher: DERI International
subclass of: Sub-Country
subclass of: http://lodlaundromat.org/.well-known/genid/240cd8d701a3c44280314a4f06cca6bb#63
subclass of: Location
subclass of: Sub-Continent

Student
subclass of: Resource
subclass of: Thing
type: Class
Coverage: world
Rights: http://www.deri.org/privacy.html
publisher: DERI International
subclass of: Researcher
date: 2004-10-20
Format: application/rdf+xml
comment: This class represents all kinds of researchers who are students.
Type: http://www.w3.org/2002/07/owl#Class
creator: DERI International
subclass of: http://lodlaundromat.org/.well-known/genid/240cd8d701a3c44280314a4f06cca6bb#35
subclass of: Person
subclass of: Agent
subclass of: http://lodlaundromat.org/.well-known/genid/240cd8d701a3c44280314a4f06cca6bb#63

Tutorials
range: Thing
domain: Thing
type: ObjectProperty
domain: http://lodlaundromat.org/.well-known/genid/240cd8d701a3c44280314a4f06cca6bb#42
Format: application/rdf+xml
Type: http://www.w3.org/2002/07/owl#ObjectProperty
Rights: http://www.deri.org/privacy.html
date: 2004-10-20
creator: DERI International
comment: The tutorials that are offered during the course of an event.
publisher: DERI International
range: Tutorial
Coverage: world
type: Property
domain: Resource
range: Resource
range: http://lodlaundromat.org/.well-known/genid/240cd8d701a3c44280314a4f06cca6bb#63
range: http://lodlaundromat.org/.well-known/genid/240cd8d701a3c44280314a4f06cca6bb#15
range: http://lodlaundromat.org/.well-known/genid/240cd8d701a3c44280314a4f06cca6bb#47
range: Event
range: http://lodlaundromat.org/.well-known/genid/240cd8d701a3c44280314a4f06cca6bb#4
range: http://lodlaundromat.org/.well-known/genid/240cd8d701a3c44280314a4f06cca6bb#50

Driven by
range: Thing
domain: Thing
inverse of: Current Project
creator: DERI International
description: The foaf:Agent this project is driven by. This is inverse to foaf:currentProject . NOTE: How do we deal with the relation between drivenBy and foaf:pastProject ?
date: 2004-10-20
domain: Project
publisher: DERI International
Format: application/rdf+xml
type: ObjectProperty
range: Agent
Coverage: world
Type: http://www.w3.org/2002/07/owl#ObjectProperty
Rights: http://www.deri.org/privacy.html
type: Property
domain: http://lodlaundromat.org/.well-known/genid/240cd8d701a3c44280314a4f06cca6bb#63
domain: Agent
domain: Resource
domain: http://lodlaundromat.org/.well-known/genid/240cd8d701a3c44280314a4f06cca6bb#47
domain: Temporary Group
domain: http://lodlaundromat.org/.well-known/genid/240cd8d701a3c44280314a4f06cca6bb#7
domain: http://lodlaundromat.org/.well-known/genid/240cd8d701a3c44280314a4f06cca6bb#4
domain: Group
range: Resource
range: http://lodlaundromat.org/.well-known/genid/240cd8d701a3c44280314a4f06cca6bb#63

Sub-Continent
subclass of: Thing
subclass of: Resource
type: Class
Type: http://www.w3.org/2000/01/rdf-schema#Class
comment: This class defines geopraphical bodies that can be contained in continents.
Format: application/rdf+xml
creator: DERI International
Rights: http://www.deri.org/privacy.html
subclass of: Location
publisher: DERI International
date: 2004-10-20
Coverage: world
subclass of: http://lodlaundromat.org/.well-known/genid/240cd8d701a3c44280314a4f06cca6bb#63

Presenter
range: Thing
domain: Thing
comment: The presenter of a presentation.
Rights: http://www.deri.org/privacy.html
creator: DERI International
domain: Presentation
Coverage: world
Format: application/rdf+xml
inverse of: Gives Presentations
range: Agent
publisher: DERI International
type: ObjectProperty
date: 2004-10-20
Type: http://www.w3.org/2002/07/owl#ObjectProperty
type: Property
domain: http://lodlaundromat.org/.well-known/genid/240cd8d701a3c44280314a4f06cca6bb#63
domain: http://lodlaundromat.org/.well-known/genid/240cd8d701a3c44280314a4f06cca6bb#47
domain: http://lodlaundromat.org/.well-known/genid/240cd8d701a3c44280314a4f06cca6bb#15
domain: Resource
domain: http://lodlaundromat.org/.well-known/genid/240cd8d701a3c44280314a4f06cca6bb#50
domain: http://lodlaundromat.org/.well-known/genid/240cd8d701a3c44280314a4f06cca6bb#4
domain: Event
range: Resource
range: http://lodlaundromat.org/.well-known/genid/240cd8d701a3c44280314a4f06cca6bb#63

Work Package
subclass of: Thing
subclass of: Resource
type: Class
Type: http://www.w3.org/2000/01/rdf-schema#Class
description: A work package is a subdivision of a project. It stands in a part-of relationship to foaf:Project .
creator: DERI International
Format: application/rdf+xml
subclass of: Temporary Group
Rights: http://www.deri.org/privacy.html
date: 2004-10-20
publisher: DERI International
Coverage: world
subclass of: Group
subclass of: http://lodlaundromat.org/.well-known/genid/240cd8d701a3c44280314a4f06cca6bb#47
subclass of: http://lodlaundromat.org/.well-known/genid/240cd8d701a3c44280314a4f06cca6bb#4
subclass of: Agent
subclass of: http://lodlaundromat.org/.well-known/genid/240cd8d701a3c44280314a4f06cca6bb#7
subclass of: http://lodlaundromat.org/.well-known/genid/240cd8d701a3c44280314a4f06cca6bb#63

Proceedings
subclass of: Resource
type: Class
subclass of: http://lodlaundromat.org/.well-known/genid/240cd8d701a3c44280314a4f06cca6bb#32
subclass of: http://lodlaundromat.org/.well-known/genid/240cd8d701a3c44280314a4f06cca6bb#11
subclass of: Thing
subclass of: http://lodlaundromat.org/.well-known/genid/240cd8d701a3c44280314a4f06cca6bb#38
subclass of: http://lodlaundromat.org/.well-known/genid/240cd8d701a3c44280314a4f06cca6bb#25
subclass of: http://lodlaundromat.org/.well-known/genid/240cd8d701a3c44280314a4f06cca6bb#19
creator: DERI International
Format: application/rdf+xml
Coverage: world
Type: http://www.w3.org/2000/01/rdf-schema#Class
date: 2004-10-20
subclass of: Publication Container
publisher: DERI International
subclass of: Dated Publication
description: The proceedings of a conference.
Rights: http://www.deri.org/privacy.html
subclass of: http://lodlaundromat.org/.well-known/genid/240cd8d701a3c44280314a4f06cca6bb#23
subclass of: Document
subclass of: Publication
subclass of: http://lodlaundromat.org/.well-known/genid/240cd8d701a3c44280314a4f06cca6bb#3

Endtime
range: Thing
domain: Thing
Coverage: world
date: 2004-10-20
range: time
description: The time when some event ends.
Format: application/rdf+xml
creator: DERI International
Rights: http://www.deri.org/privacy.html
type: ObjectProperty
domain: http://lodlaundromat.org/.well-known/genid/240cd8d701a3c44280314a4f06cca6bb#15
Type: http://www.w3.org/2002/07/owl#FunctionalProperty
publisher: DERI International
type: FunctionalProperty
type: Property
domain: Resource
range: Resource

From Organization
range: Thing
domain: Thing
creator: DERI International
Rights: http://www.deri.org/privacy.html
Format: application/rdf+xml
description: The organization that sponsors a conference or that publishes a manual or techreport.
type: ObjectProperty
publisher: DERI International
Coverage: world
date: 2004-10-20
domain: http://lodlaundromat.org/.well-known/genid/240cd8d701a3c44280314a4f06cca6bb#32
range: Organization
type: FunctionalProperty
Type: http://www.w3.org/2002/07/owl#ObjectProperty
type: Property
domain: Resource
range: http://lodlaundromat.org/.well-known/genid/240cd8d701a3c44280314a4f06cca6bb#63
range: Resource
range: Agent

Sub-Country
subclass of: Thing
subclass of: Resource
type: Class
Type: http://www.w3.org/2000/01/rdf-schema#Class
description: This class defines geopraphical bodies that can be contained in countries.
subclass of: Sub-Continent
date: 2004-10-20
publisher: DERI International
Format: application/rdf+xml
creator: DERI International
Rights: http://www.deri.org/privacy.html
Coverage: world
subclass of: Location
subclass of: http://lodlaundromat.org/.well-known/genid/240cd8d701a3c44280314a4f06cca6bb#63

Article
subclass of: Resource
subclass of: Thing
type: Class
subclass of: http://lodlaundromat.org/.well-known/genid/240cd8d701a3c44280314a4f06cca6bb#45
date: 2004-10-20
description: An article from a journal or magazine.
Type: http://www.w3.org/2000/01/rdf-schema#Class
Rights: http://www.deri.org/privacy.html
creator: DERI International
Format: application/rdf+xml
subclass of: Document
publisher: DERI International
Coverage: world
subclass of: http://lodlaundromat.org/.well-known/genid/240cd8d701a3c44280314a4f06cca6bb#3
subclass of: Publication

RSS1.0 News Item
subclass of: Thing
subclass of: Resource
type: Class
Coverage: world
creator: RSS-DEV Working Group
Format: application/rdf+xml
publisher: RSS-DEV Working Group
Type: http://www.w3.org/2000/01/rdf-schema#Class
subclass of: News Item
subclass of: Document
subclass of: http://lodlaundromat.org/.well-known/genid/240cd8d701a3c44280314a4f06cca6bb#3
subclass of: Publication

Research Staff
subclass of: Resource
subclass of: Thing
type: Class
Rights: http://www.deri.org/privacy.html
Type: http://www.w3.org/2002/07/owl#Class
publisher: DERI International
subclass of: Researcher
comment: This class represents all kinds of researchers who are not students.
date: 2004-10-20
Coverage: world
creator: DERI International
Format: application/rdf+xml
subclass of: http://lodlaundromat.org/.well-known/genid/240cd8d701a3c44280314a4f06cca6bb#35
subclass of: Person
subclass of: Agent
subclass of: http://lodlaundromat.org/.well-known/genid/240cd8d701a3c44280314a4f06cca6bb#63

Organization
subclass of: Resource
subclass of: Thing
type: Class
creator: DERI International
date: 2004-10-20
comment: This class represents an organization with a formal legal status. We introduce this class as a subclass of foaf:Organization and foaf:Group , because we consider an organization as a kind of group.
Coverage: world
Rights: http://www.deri.org/privacy.html
subclass of: Group
Format: application/rdf+xml
subclass of: Organization
publisher: DERI International
Type: http://www.w3.org/2002/07/owl#Class
subclass of: Agent
subclass of: http://lodlaundromat.org/.well-known/genid/240cd8d701a3c44280314a4f06cca6bb#63

Workshop
subclass of: http://lodlaundromat.org/.well-known/genid/240cd8d701a3c44280314a4f06cca6bb#9
subclass of: http://lodlaundromat.org/.well-known/genid/240cd8d701a3c44280314a4f06cca6bb#42
subclass of: Resource
subclass of: Thing
type: Class
creator: DERI International
Coverage: world
description: This class represents all kinds of workshops
date: 2004-10-20
Type: http://www.w3.org/2002/07/owl#Class
publisher: DERI International
Rights: http://www.deri.org/privacy.html
subclass of: Event
Format: application/rdf+xml
subclass of: http://lodlaundromat.org/.well-known/genid/240cd8d701a3c44280314a4f06cca6bb#47
subclass of: http://lodlaundromat.org/.well-known/genid/240cd8d701a3c44280314a4f06cca6bb#63
subclass of: http://lodlaundromat.org/.well-known/genid/240cd8d701a3c44280314a4f06cca6bb#4

interval
subclass of: Thing
subclass of: Resource
type: Class
Type: http://www.w3.org/2000/01/rdf-schema#Class
Format: application/rdf+xml
publisher: DERI International
comment: "An interval represents a duration between 2 points in time." For the excat definition of this class, please refere to http://www.wsmo.org/2004/d3/d3.3/v0.1/ .
Rights: http://www.deri.org/privacy.html
creator: Jos de Bruin
publisher: Holger Lausen
Coverage: world
creator: DERI International
creator: Holger Lausen
publisher: Jos de Bruin

Research Institute
subclass of: Resource
subclass of: Thing
type: Class
subclass of: http://lodlaundromat.org/.well-known/genid/240cd8d701a3c44280314a4f06cca6bb#35
description: This class represents research institutes. These organizations have special research areas.
publisher: DERI International
creator: DERI International
date: 2004-10-20
Rights: http://www.deri.org/privacy.html
Coverage: world
Format: application/rdf+xml
Type: http://www.w3.org/2002/07/owl#Class
subclass of: Organization
subclass of: Group
subclass of: Agent
subclass of: http://lodlaundromat.org/.well-known/genid/240cd8d701a3c44280314a4f06cca6bb#63

Starting Date
range: Thing
domain: Thing
publisher: DERI International
date: 2004-10-20
Rights: http://www.deri.org/privacy.html
creator: DERI International
Format: application/rdf+xml
domain: http://lodlaundromat.org/.well-known/genid/240cd8d701a3c44280314a4f06cca6bb#47
type: ObjectProperty
description: The starting date some event.
Type: http://www.w3.org/2002/07/owl#ObjectProperty
range: date
Coverage: world
type: Property
domain: Resource
range: Resource

Presentation
subclass of: Thing
subclass of: http://lodlaundromat.org/.well-known/genid/240cd8d701a3c44280314a4f06cca6bb#15
subclass of: http://lodlaundromat.org/.well-known/genid/240cd8d701a3c44280314a4f06cca6bb#50
subclass of: Resource
type: Class
publisher: DERI International
Format: application/rdf+xml
date: 2004-10-20
description: This class represents all kinds of presentations.
Coverage: world
creator: DERI International
subclass of: Event
Rights: http://www.deri.org/privacy.html
Type: http://www.w3.org/2000/01/rdf-schema#Class
subclass of: http://lodlaundromat.org/.well-known/genid/240cd8d701a3c44280314a4f06cca6bb#4
subclass of: http://lodlaundromat.org/.well-known/genid/240cd8d701a3c44280314a4f06cca6bb#47
subclass of: http://lodlaundromat.org/.well-known/genid/240cd8d701a3c44280314a4f06cca6bb#63

Group
subclass of: Resource
subclass of: Thing
type: Class
Format: application/rdf+xml
Contributor: http://rdfweb.org/mailman/listinfo/rdfweb-dev
Coverage: world
creator: Libby Miller
Contributor: http://www.w3.org/RDF/Interest/
comment: "A class of Agents. The foaf:Group classs represents a collection of individual agents (and may itself play the role of a foaf:Agent , i.e. something that can perform actions)."
publisher: Libby Miller
creator: Dan Brickley
subclass of: Agent
publisher: Dan Brickley
Type: http://www.w3.org/2000/01/rdf-schema#Class
subclass of: http://lodlaundromat.org/.well-known/genid/240cd8d701a3c44280314a4f06cca6bb#63

Location
subclass of: http://lodlaundromat.org/.well-known/genid/240cd8d701a3c44280314a4f06cca6bb#63
subclass of: Thing
subclass of: Resource
type: Class
Format: application/rdf+xml
publisher: DERI International
date: 2004-10-20
creator: DERI International
comment: This class is the superclass for all classes defining geographical locations. The approach for this subontology is to have a hierarchy of location classes, such that instances of the classes further down in the hierarchy can be contained in instances of the classes higher up in the hierarchy. On each level, there exist two sister classes: class L defines a certain type of location, while class SubL defines locations which can be contained in instances of L. SubL then defines a property inL, to express which instance of L an instance of SubL is contained in. E.g. for a class Continent, there exists a class SubContinent. All children of SubContinent (either direct or transitive) define locations that can be contained in a continent, such as countries, regions, cities, etc. By virtue of inheritance, all these location classes then have a property inContinent, to express that they are contained in some continent. In a simpler, flat structure, inContinent would have to be defined explicitly for all kinds of locations that can be contained in a continent. The intepretation of the inL predicates should be as follows: if, for a particular instance K, inL has a value, this value is valid. If inL has no value, the value of inL in the next location K is contained in valid, and so forth. E.g. an instance "Hawaii" has the value "Oceania" defined for inContinent and "USA" for inCountry . "Delaware" has no value for inContinent. "USA" has the value "North America" for inContinent . The interpretation would be that "Hawaii" is located in "Oceania", while "Delaware" is located in "North America". We are aware of the fact that this approach is idealized and can therefore conflict with reality in some situations. E.g., the exact borders of continents are not always defined (there are contradicting opinions on where exactly Europe begins or ends). Countries could be contained in more than one continent (Turkey belongs to both Europe and Asia). However, we think that these situations ar…
Coverage: world
Type: http://www.w3.org/2000/01/rdf-schema#Class
Rights: http://www.deri.org/privacy.html

Lecture
subclass of: Thing
subclass of: http://lodlaundromat.org/.well-known/genid/240cd8d701a3c44280314a4f06cca6bb#15
subclass of: http://lodlaundromat.org/.well-known/genid/240cd8d701a3c44280314a4f06cca6bb#9
subclass of: http://lodlaundromat.org/.well-known/genid/240cd8d701a3c44280314a4f06cca6bb#50
subclass of: Resource
type: Class
description: This class represents lectures with an educational purpose, e.g within a university.
publisher: DERI International
Type: http://www.w3.org/2000/01/rdf-schema#Class
date: 2004-10-20
subclass of: Event
Rights: http://www.deri.org/privacy.html
creator: DERI International
Coverage: world
Format: application/rdf+xml
subclass of: http://lodlaundromat.org/.well-known/genid/240cd8d701a3c44280314a4f06cca6bb#47
subclass of: http://lodlaundromat.org/.well-known/genid/240cd8d701a3c44280314a4f06cca6bb#63
subclass of: http://lodlaundromat.org/.well-known/genid/240cd8d701a3c44280314a4f06cca6bb#4

Management Staff
subclass of: Resource
subclass of: Thing
type: Class
Rights: http://www.deri.org/privacy.html
Type: http://www.w3.org/2002/07/owl#Class
date: 2004-10-20
Format: application/rdf+xml
comment: This class represents the management staff.
Coverage: world
subclass of: Person
publisher: DERI International
creator: DERI International
subclass of: Agent
subclass of: http://lodlaundromat.org/.well-known/genid/240cd8d701a3c44280314a4f06cca6bb#63

Fifth
range: Thing
domain: Thing
description: The fifth foaf:Agent in an AgentSequence .
type: ObjectProperty
creator: DERI International
Format: application/rdf+xml
range: Agent
date: 2004-10-20
Coverage: world
Type: http://www.w3.org/2002/07/owl#ObjectProperty
publisher: DERI International
domain: AgentSequence
Rights: http://www.deri.org/privacy.html
type: Property
domain: Resource
range: Resource
range: http://lodlaundromat.org/.well-known/genid/240cd8d701a3c44280314a4f06cca6bb#63

Person
subclass of: Thing
subclass of: Resource
type: Class
Contributor: http://rdfweb.org/mailman/listinfo/rdfweb-dev
creator: Dan Brickley
publisher: Libby Miller
description: "A person. The foaf:Person class represents people. Something is a foaf:Person if it is a person. We don't nitpick about whether they're alive, dead, real or imaginary."
Coverage: world
Format: application/rdf+xml
Type: http://www.w3.org/2000/01/rdf-schema#Class
Contributor: http://www.w3.org/RDF/Interest/
publisher: Dan Brickley
creator: Libby Miller
subclass of: Agent
subclass of: http://lodlaundromat.org/.well-known/genid/240cd8d701a3c44280314a4f06cca6bb#63

Company
subclass of: Thing
subclass of: Resource
type: Class
Coverage: world
description: This class represents all kinds of companies. Currently only publishers and software developers are modelled.
Rights: http://www.deri.org/privacy.html
Type: http://www.w3.org/2000/01/rdf-schema#Class
creator: DERI International
date: 2004-10-20
Format: application/rdf+xml
publisher: DERI International
subclass of: Organization
subclass of: Agent
subclass of: Group
subclass of: http://lodlaundromat.org/.well-known/genid/240cd8d701a3c44280314a4f06cca6bb#63

ClericalStaff
subclass of: Resource
subclass of: Thing
type: Class
Type: http://www.w3.org/2002/07/owl#Class
Coverage: world
description: This class represents all kinds of administrative staff that is related to clerical support. Examples are secretaries, accountants, etc.
Rights: http://www.deri.org/privacy.html
creator: DERI International
date: 2004-10-20
subclass of: Administrative Staff
Format: application/rdf+xml
publisher: DERI International
subclass of: Person
subclass of: Agent
subclass of: http://lodlaundromat.org/.well-known/genid/240cd8d701a3c44280314a4f06cca6bb#63

News Item
subclass of: Resource
subclass of: Thing
type: Class
subclass of: Document
Coverage: world
comment: This class is the super-class for any kind of news item.
publisher: DERI International
date: 2004-10-20
creator: DERI International
Format: application/rdf+xml
Rights: http://www.deri.org/privacy.html
Type: http://www.w3.org/2002/07/owl#Class
subclass of: http://lodlaundromat.org/.well-known/genid/240cd8d701a3c44280314a4f06cca6bb#3
subclass of: Publication

Region
subclass of: Thing
subclass of: Resource
type: Class
Format: application/rdf+xml
creator: DERI International
Rights: http://www.deri.org/privacy.html
Coverage: world
date: 2004-10-20
subclass of: Sub-Country
description: This class defines geopraphical bodies that are regions, with the intended meaning "sub-division of a country".
publisher: DERI International
Type: http://www.w3.org/2000/01/rdf-schema#Class
subclass of: Sub-Continent
subclass of: http://lodlaundromat.org/.well-known/genid/240cd8d701a3c44280314a4f06cca6bb#63
subclass of: Location

Leader
range: Thing
domain: Thing
creator: DERI International
domain: Group
type: ObjectProperty
description: This property defines the leader of an organization, i.e. its director, chairman, etc.
Format: application/rdf+xml
Type: http://www.w3.org/2002/07/owl#FunctionalProperty
type: FunctionalProperty
range: Person
Rights: http://www.deri.org/privacy.html
Coverage: world
date: 2004-10-20
publisher: DERI International
type: Property
domain: http://lodlaundromat.org/.well-known/genid/240cd8d701a3c44280314a4f06cca6bb#63
domain: Agent
domain: Resource
range: Resource
range: http://lodlaundromat.org/.well-known/genid/240cd8d701a3c44280314a4f06cca6bb#63
range: Agent

Telephone
range: Thing
domain: Thing
Format: application/rdf+xml
range: Literal
creator: Libby Miller
Contributor: http://www.w3.org/RDF/Interest/
publisher: Libby Miller
type: ObjectProperty
publisher: Dan Brickley
comment: "The foaf:phone of something is a phone, typically identified using the tel: URI scheme." The tel: URI scheme is defined in http://www.ietf.org/rfc/rfc2806.txt.
Coverage: world
creator: Dan Brickley
Type: http://www.w3.org/2002/07/owl#ObjectProperty
Contributor: http://rdfweb.org/mailman/listinfo/rdfweb-dev
domain: Agent
type: Property
domain: http://lodlaundromat.org/.well-known/genid/240cd8d701a3c44280314a4f06cca6bb#63
domain: Resource
range: Resource

Cluster
subclass of: Resource
subclass of: Thing
type: Class
subclass of: http://lodlaundromat.org/.well-known/genid/240cd8d701a3c44280314a4f06cca6bb#7
subclass of: http://lodlaundromat.org/.well-known/genid/240cd8d701a3c44280314a4f06cca6bb#35
Format: application/rdf+xml
Coverage: world
date: 2004-10-20
publisher: DERI International
comment: A Cluster is a kind of group which focuses on a research area and typically is part of a research institute or university.
creator: DERI International
Rights: http://www.deri.org/privacy.html
Type: http://www.w3.org/2002/07/owl#Class
subclass of: Group
subclass of: Agent
subclass of: http://lodlaundromat.org/.well-known/genid/240cd8d701a3c44280314a4f06cca6bb#63

Sub-Region
subclass of: Thing
subclass of: Resource
type: Class
publisher: DERI International
creator: DERI International
date: 2004-10-20
comment: This class defines geopraphical bodies that can be contained in regions.
Rights: http://www.deri.org/privacy.html
Format: application/rdf+xml
Type: http://www.w3.org/2000/01/rdf-schema#Class
subclass of: Sub-Country
Coverage: world
subclass of: http://lodlaundromat.org/.well-known/genid/240cd8d701a3c44280314a4f06cca6bb#63
subclass of: Location
subclass of: Sub-Continent

Dated Publication
subclass of: http://lodlaundromat.org/.well-known/genid/240cd8d701a3c44280314a4f06cca6bb#23
subclass of: Resource
subclass of: Thing
type: Class
Rights: http://www.deri.org/privacy.html
publisher: DERI International
date: 2004-10-20
comment: The instances of this class comprise all publications which have a specific publication date. If a publication P is contained within an PublicationContainer , and this container has a publication date, than P is not an IndividualPublication . Example: an Inbook publication is not an IndividualPublication , because its publication date can be inferred from the Book which contains it.
Format: application/rdf+xml
Coverage: world
subclass of: Document
creator: DERI International
Type: http://www.w3.org/2002/07/owl#Class
subclass of: http://lodlaundromat.org/.well-known/genid/240cd8d701a3c44280314a4f06cca6bb#3
subclass of: Publication

Tutorial
subclass of: http://lodlaundromat.org/.well-known/genid/240cd8d701a3c44280314a4f06cca6bb#15
subclass of: Thing
subclass of: http://lodlaundromat.org/.well-known/genid/240cd8d701a3c44280314a4f06cca6bb#50
subclass of: Resource
type: Class
description: This class represents all kinds of tutorials.
publisher: DERI International
Rights: http://www.deri.org/privacy.html
Type: http://www.w3.org/2000/01/rdf-schema#Class
Format: application/rdf+xml
Coverage: world
creator: DERI International
date: 2004-10-20
subclass of: Event
subclass of: http://lodlaundromat.org/.well-known/genid/240cd8d701a3c44280314a4f06cca6bb#4
subclass of: http://lodlaundromat.org/.well-known/genid/240cd8d701a3c44280314a4f06cca6bb#63
subclass of: http://lodlaundromat.org/.well-known/genid/240cd8d701a3c44280314a4f06cca6bb#47

Booklet
subclass of: http://lodlaundromat.org/.well-known/genid/240cd8d701a3c44280314a4f06cca6bb#1
subclass of: Resource
subclass of: Thing
type: Class
description: A work that is printed and bound, but without a named publisher or sponsoring institution.
Rights: http://www.deri.org/privacy.html
publisher: DERI International
Type: http://www.w3.org/2002/07/owl#Class
Format: application/rdf+xml
Coverage: world
subclass of: Dated Publication
date: 2004-10-20
creator: DERI International
subclass of: Document
subclass of: http://lodlaundromat.org/.well-known/genid/240cd8d701a3c44280314a4f06cca6bb#23
subclass of: http://lodlaundromat.org/.well-known/genid/240cd8d701a3c44280314a4f06cca6bb#3
subclass of: Publication

Techreport
subclass of: Resource
subclass of: Thing
type: Class
subclass of: http://lodlaundromat.org/.well-known/genid/240cd8d701a3c44280314a4f06cca6bb#32
subclass of: http://lodlaundromat.org/.well-known/genid/240cd8d701a3c44280314a4f06cca6bb#11
Format: application/rdf+xml
Type: http://www.w3.org/2002/07/owl#Class
subclass of: Dated Publication
Coverage: world
Rights: http://www.deri.org/privacy.html
comment: A report published by a school or other organization, usually numbered within a series ( Series ). This concept has been merged from BibTex's techreport and manual types, since both are described very similiar.
publisher: DERI International
date: 2004-10-20
creator: DERI International
subclass of: http://lodlaundromat.org/.well-known/genid/240cd8d701a3c44280314a4f06cca6bb#23
subclass of: Document
subclass of: Publication
subclass of: http://lodlaundromat.org/.well-known/genid/240cd8d701a3c44280314a4f06cca6bb#3

Unpublished
subclass of: Resource
subclass of: Thing
type: Class
subclass of: http://lodlaundromat.org/.well-known/genid/240cd8d701a3c44280314a4f06cca6bb#61
Format: application/rdf+xml
Type: http://www.w3.org/2002/07/owl#Class
creator: DERI International
Coverage: world
comment: A document which does have an author and title, but hasn't been formally published.
publisher: DERI International
date: 2004-10-20
subclass of: Dated Publication
Rights: http://www.deri.org/privacy.html
subclass of: http://lodlaundromat.org/.well-known/genid/240cd8d701a3c44280314a4f06cca6bb#23
subclass of: Document
subclass of: Publication
subclass of: http://lodlaundromat.org/.well-known/genid/240cd8d701a3c44280314a4f06cca6bb#3

In Continent
range: Thing
domain: Thing
range: Continent
publisher: DERI International
date: 2004-10-20
Coverage: world
domain: Sub-Continent
Format: application/rdf+xml
creator: DERI International
description: The Continent in which some SubContinent is contained.
type: FunctionalProperty
type: ObjectProperty
Type: http://www.w3.org/2002/07/owl#ObjectProperty
Rights: http://www.deri.org/privacy.html
type: Property
domain: http://lodlaundromat.org/.well-known/genid/240cd8d701a3c44280314a4f06cca6bb#63
domain: Resource
domain: Location
range: Resource
range: Location
range: http://lodlaundromat.org/.well-known/genid/240cd8d701a3c44280314a4f06cca6bb#63

Location
range: Thing
domain: Thing
Rights: http://www.deri.org/privacy.html
Coverage: world
domain: Event
type: FunctionalProperty
publisher: DERI International
type: ObjectProperty
creator: DERI International
description: The Location of an Event .
Format: application/rdf+xml
date: 2004-10-20
range: Location
Type: http://www.w3.org/2002/07/owl#FunctionalProperty
type: Property
domain: http://lodlaundromat.org/.well-known/genid/240cd8d701a3c44280314a4f06cca6bb#63
domain: http://lodlaundromat.org/.well-known/genid/240cd8d701a3c44280314a4f06cca6bb#47
domain: Resource
domain: http://lodlaundromat.org/.well-known/genid/240cd8d701a3c44280314a4f06cca6bb#4
range: Resource
range: http://lodlaundromat.org/.well-known/genid/240cd8d701a3c44280314a4f06cca6bb#63

Authors
range: Agent
range: Thing
domain: Thing
domain: Document
description: The author or authors of a document. For multiple authors, use either an instance of foaf:Group , or multiple values.
Type: http://www.w3.org/2002/07/owl#ObjectProperty
Format: application/rdf+xml
Rights: http://www.deri.org/privacy.html
Coverage: world
creator: DERI International
range: AgentSequence
type: ObjectProperty
inverse of: Publications
publisher: DERI International
date: 2004-10-20
type: Property
domain: Resource
domain: Publication
domain: http://lodlaundromat.org/.well-known/genid/240cd8d701a3c44280314a4f06cca6bb#3
range: Resource
range: http://lodlaundromat.org/.well-known/genid/240cd8d701a3c44280314a4f06cca6bb#63

Organizes
range: Thing
domain: Thing
publisher: DERI International
Format: application/rdf+xml
date: 2004-10-20
Rights: http://www.deri.org/privacy.html
Type: http://www.w3.org/2002/07/owl#ObjectProperty
creator: DERI International
type: ObjectProperty
Coverage: world
range: Event
comment: This property relates an agent to the events it organizes. The inverse property is organizedBy .
domain: Agent
inverse of: Organized by
type: Property
domain: http://lodlaundromat.org/.well-known/genid/240cd8d701a3c44280314a4f06cca6bb#63
domain: Resource
range: Resource
range: http://lodlaundromat.org/.well-known/genid/240cd8d701a3c44280314a4f06cca6bb#47
range: http://lodlaundromat.org/.well-known/genid/240cd8d701a3c44280314a4f06cca6bb#4
range: http://lodlaundromat.org/.well-known/genid/240cd8d701a3c44280314a4f06cca6bb#63

Contains Papers
range: Thing
domain: Thing
domain: Proceedings
description: The papers or similar which a proceedings contains.
date: 2004-10-20
range: Inproceedings
Format: application/rdf+xml
publisher: DERI International
Coverage: world
inverse of: Contained in Proceedings
Rights: http://www.deri.org/privacy.html
type: ObjectProperty
creator: DERI International
Type: http://www.w3.org/2002/07/owl#ObjectProperty
type: Property
domain: http://lodlaundromat.org/.well-known/genid/240cd8d701a3c44280314a4f06cca6bb#25
domain: Resource
domain: Publication Container
domain: Publication
domain: http://lodlaundromat.org/.well-known/genid/240cd8d701a3c44280314a4f06cca6bb#32
domain: http://lodlaundromat.org/.well-known/genid/240cd8d701a3c44280314a4f06cca6bb#19
domain: http://lodlaundromat.org/.well-known/genid/240cd8d701a3c44280314a4f06cca6bb#23
domain: Document
domain: http://lodlaundromat.org/.well-known/genid/240cd8d701a3c44280314a4f06cca6bb#11
domain: http://lodlaundromat.org/.well-known/genid/240cd8d701a3c44280314a4f06cca6bb#3
domain: http://lodlaundromat.org/.well-known/genid/240cd8d701a3c44280314a4f06cca6bb#38
domain: Dated Publication
range: Resource
range: Document
range: http://lodlaundromat.org/.well-known/genid/240cd8d701a3c44280314a4f06cca6bb#3
range: http://lodlaundromat.org/.well-known/genid/240cd8d701a3c44280314a4f06cca6bb#45
range: Publication

date
subclass of: Thing
subclass of: Resource
type: Class
publisher: Holger Lausen
creator: Jos de Bruin
publisher: Jos de Bruin
description: "Concept date and its representation according to the Gregorian Calendar." For the excat definition of this class, please refere to http://www.wsmo.org/2004/d3/d3.3/v0.1/ .
creator: Holger Lausen
Rights: http://www.deri.org/privacy.html
creator: DERI International
Type: http://www.w3.org/2000/01/rdf-schema#Class
Coverage: world
Format: application/rdf+xml
publisher: DERI International

Current Project
range: Thing
domain: Thing
description: "A current project this person works on." NOTE: FOAF defines the range as foaf:Person - we decided to change this to the more general foaf:Agent , since other types of Agents (e.g. a company) can also have projects. We have also defined an inverse for this property (see drivenBy ).
Coverage: world
inverse of: Driven by
domain: Agent
creator: Dan Brickley
Contributor: http://rdfweb.org/mailman/listinfo/rdfweb-dev
publisher: Libby Miller
Format: application/rdf+xml
publisher: Dan Brickley
creator: Libby Miller
Contributor: http://www.w3.org/RDF/Interest/
Type: http://www.w3.org/2002/07/owl#ObjectProperty
range: Project
type: ObjectProperty
type: Property
domain: http://lodlaundromat.org/.well-known/genid/240cd8d701a3c44280314a4f06cca6bb#63
domain: Resource
range: http://lodlaundromat.org/.well-known/genid/240cd8d701a3c44280314a4f06cca6bb#4
range: Resource
range: http://lodlaundromat.org/.well-known/genid/240cd8d701a3c44280314a4f06cca6bb#7
range: Agent
range: http://lodlaundromat.org/.well-known/genid/240cd8d701a3c44280314a4f06cca6bb#63
range: http://lodlaundromat.org/.well-known/genid/240cd8d701a3c44280314a4f06cca6bb#47
range: Group
range: Temporary Group

Misc
subclass of: http://lodlaundromat.org/.well-known/genid/240cd8d701a3c44280314a4f06cca6bb#1
subclass of: Resource
subclass of: Thing
type: Class
date: 2004-10-20
description: Some sort of publication which doesn't fit into any of the other concepts.
publisher: DERI International
Rights: http://www.deri.org/privacy.html
Coverage: world
subclass of: Dated Publication
creator: DERI International
Format: application/rdf+xml
Type: http://www.w3.org/2002/07/owl#Class
subclass of: Document
subclass of: http://lodlaundromat.org/.well-known/genid/240cd8d701a3c44280314a4f06cca6bb#23
subclass of: Publication
subclass of: http://lodlaundromat.org/.well-known/genid/240cd8d701a3c44280314a4f06cca6bb#3

Deliverable
subclass of: Thing
subclass of: Resource
type: Class
subclass of: http://lodlaundromat.org/.well-known/genid/240cd8d701a3c44280314a4f06cca6bb#11
Format: application/rdf+xml
date: 2004-10-20
creator: DERI International
Rights: http://www.deri.org/privacy.html
description: A document which is produced as part of a project. Deliverables are not formally published. NOTE: This concept was not derived from any of the BibTex types, but considered useful anyway.
publisher: DERI International
subclass of: Unpublished
Coverage: world
Type: http://www.w3.org/2000/01/rdf-schema#Class
subclass of: http://lodlaundromat.org/.well-known/genid/240cd8d701a3c44280314a4f06cca6bb#23
subclass of: Document
subclass of: http://lodlaundromat.org/.well-known/genid/240cd8d701a3c44280314a4f06cca6bb#61
subclass of: Dated Publication
subclass of: Publication
subclass of: http://lodlaundromat.org/.well-known/genid/240cd8d701a3c44280314a4f06cca6bb#3

Publisher
range: Thing
domain: Thing
Format: application/rdf+xml
publisher: DERI International
description: The instance of Publisher which published this document.
domain: http://lodlaundromat.org/.well-known/genid/240cd8d701a3c44280314a4f06cca6bb#38
date: 2004-10-20
type: ObjectProperty
Type: http://www.w3.org/2002/07/owl#FunctionalProperty
creator: DERI International
Coverage: world
Rights: http://www.deri.org/privacy.html
type: FunctionalProperty
range: Publishing Company
type: Property
domain: Resource
range: Resource
range: Agent
range: http://lodlaundromat.org/.well-known/genid/240cd8d701a3c44280314a4f06cca6bb#63
range: Group
range: Organization
range: Company

ofJournal
range: Thing
domain: Thing
date: 2004-10-20
Coverage: world
range: Journal
Format: application/rdf+xml
creator: DERI International
Rights: http://www.deri.org/privacy.html
domain: Volume
publisher: DERI International
description: The Journal this volume belongs to.
inverse of: hasVolumes
type: ObjectProperty
Type: http://www.w3.org/2002/07/owl#ObjectProperty
type: Property
domain: http://lodlaundromat.org/.well-known/genid/240cd8d701a3c44280314a4f06cca6bb#25
domain: Resource
domain: Publication
domain: http://lodlaundromat.org/.well-known/genid/240cd8d701a3c44280314a4f06cca6bb#23
domain: http://lodlaundromat.org/.well-known/genid/240cd8d701a3c44280314a4f06cca6bb#11
domain: Document
domain: http://lodlaundromat.org/.well-known/genid/240cd8d701a3c44280314a4f06cca6bb#3
domain: Dated Publication
range: Publication Container
range: Publication
range: Resource

Inproceedings
subclass of: Thing
subclass of: http://lodlaundromat.org/.well-known/genid/240cd8d701a3c44280314a4f06cca6bb#45
subclass of: Resource
type: Class
date: 2004-10-20
publisher: DERI International
Type: http://www.w3.org/2000/01/rdf-schema#Class
description: An article in a conference proceedings (i.e. Proceedings).
Rights: http://www.deri.org/privacy.html
Coverage: world
creator: DERI International
subclass of: Document
Format: application/rdf+xml
subclass of: Publication
subclass of: http://lodlaundromat.org/.well-known/genid/240cd8d701a3c44280314a4f06cca6bb#3

Sixth
range: Thing
domain: Thing
date: 2004-10-20
Coverage: world
description: The sixth foaf:Agent in an AgentSequence .
domain: AgentSequence
range: Agent
Format: application/rdf+xml
creator: DERI International
Rights: http://www.deri.org/privacy.html
Type: http://www.w3.org/2002/07/owl#ObjectProperty
type: ObjectProperty
publisher: DERI International
type: Property
domain: Resource
range: Resource
range: http://lodlaundromat.org/.well-known/genid/240cd8d701a3c44280314a4f06cca6bb#63

Publishing Company
subclass of: Resource
subclass of: Thing
type: Class
date: 2004-10-20
subclass of: Company
comment: This class models companies that publish documents.
Rights: http://www.deri.org/privacy.html
creator: DERI International
publisher: DERI International
Format: application/rdf+xml
Type: http://www.w3.org/2000/01/rdf-schema#Class
Coverage: world
subclass of: Agent
subclass of: Organization
subclass of: Group
subclass of: http://lodlaundromat.org/.well-known/genid/240cd8d701a3c44280314a4f06cca6bb#63

Note
sub property of: Description
equivalent property: Description
Type: http://www.w3.org/2002/07/owl#FunctionalProperty
date: 2004-10-20
Format: application/rdf+xml
creator: DERI International
type: DatatypeProperty
publisher: DERI International
domain: Publication
Rights: http://www.deri.org/privacy.html
range: string
type: FunctionalProperty
Coverage: world
type: Property
range: Resource
domain: RSS1.0 News Item
domain: Thing
domain: Resource
domain: News Item
domain: Document
domain: http://lodlaundromat.org/.well-known/genid/240cd8d701a3c44280314a4f06cca6bb#3

Inbook
subclass of: http://lodlaundromat.org/.well-known/genid/240cd8d701a3c44280314a4f06cca6bb#45
subclass of: Thing
subclass of: Resource
type: Class
Coverage: world
Format: application/rdf+xml
Rights: http://www.deri.org/privacy.html
date: 2004-10-20
publisher: DERI International
comment: A part of a Book, which may be a chapter (or section or whatever) and/or a range of pages. Because the BibTex types inCollection and inBook are very similiar, we decided to keep the ontology as simple as possible and merge them both into Inbook .
Type: http://www.w3.org/2000/01/rdf-schema#Class
creator: DERI International
subclass of: Document
subclass of: Publication
subclass of: http://lodlaundromat.org/.well-known/genid/240cd8d701a3c44280314a4f06cca6bb#3

Temporary Group
subclass of: http://lodlaundromat.org/.well-known/genid/240cd8d701a3c44280314a4f06cca6bb#47
subclass of: http://lodlaundromat.org/.well-known/genid/240cd8d701a3c44280314a4f06cca6bb#4
subclass of: Thing
subclass of: http://lodlaundromat.org/.well-known/genid/240cd8d701a3c44280314a4f06cca6bb#7
subclass of: Resource
type: Class
description: As foaf:Project , Initiative and WorkingGroup differ from Cluster in having a specific duration, we comprise these there temporal groups in this class which represents all kinds of temporary groups.
Coverage: world
creator: DERI International
Format: application/rdf+xml
Type: http://www.w3.org/2000/01/rdf-schema#Class
Rights: http://www.deri.org/privacy.html
subclass of: Group
date: 2004-10-20
publisher: DERI International
subclass of: Agent
subclass of: http://lodlaundromat.org/.well-known/genid/240cd8d701a3c44280314a4f06cca6bb#63

Organization
subclass of: Resource
subclass of: Thing
type: Class
Format: application/rdf+xml
description: "The foaf:Organization class represents a kind of foaf:Agent corresponding to social institutions such as companies, societies, etc." As we consider an organization to be a group as well, we introduced a subclass Organization as a subclass of both foaf:Organization and foaf:Group . We added foaf:Organization to facilitate FOAF based agents to query our ontology.
Type: http://www.w3.org/2000/01/rdf-schema#Class
Coverage: world
creator: Dan Brickley
publisher: Dan Brickley
creator: Libby Miller
publisher: Libby Miller
subclass of: Agent
Contributor: http://www.w3.org/RDF/Interest/
Contributor: http://rdfweb.org/mailman/listinfo/rdfweb-dev
subclass of: http://lodlaundromat.org/.well-known/genid/240cd8d701a3c44280314a4f06cca6bb#63

Gives Tutorials
range: Thing
domain: Thing
creator: DERI International
domain: Agent
inverse of: Tutor
Format: application/rdf+xml
type: ObjectProperty
description: This property relates an agent to the tutorials it gives. The inverse property is tutoredBy .
date: 2004-10-20
Type: http://www.w3.org/2002/07/owl#ObjectProperty
Coverage: world
Rights: http://www.deri.org/privacy.html
publisher: DERI International
range: Tutorial
type: Property
domain: http://lodlaundromat.org/.well-known/genid/240cd8d701a3c44280314a4f06cca6bb#63
domain: Resource
range: Resource
range: http://lodlaundromat.org/.well-known/genid/240cd8d701a3c44280314a4f06cca6bb#63
range: http://lodlaundromat.org/.well-known/genid/240cd8d701a3c44280314a4f06cca6bb#15
range: http://lodlaundromat.org/.well-known/genid/240cd8d701a3c44280314a4f06cca6bb#47
range: Event
range: http://lodlaundromat.org/.well-known/genid/240cd8d701a3c44280314a4f06cca6bb#4
range: http://lodlaundromat.org/.well-known/genid/240cd8d701a3c44280314a4f06cca6bb#50

Fax
range: Thing
domain: Thing
description: The faxnumber of some foaf:Agent .
Rights: http://www.deri.org/privacy.html
date: 2004-10-20
range: Literal
Format: application/rdf+xml
domain: Agent
Coverage: world
type: ObjectProperty
publisher: DERI International
Type: http://www.w3.org/2002/07/owl#ObjectProperty
creator: DERI International
type: Property
domain: http://lodlaundromat.org/.well-known/genid/240cd8d701a3c44280314a4f06cca6bb#63
domain: Resource
range: Resource

In Region
range: Thing
domain: Thing
creator: DERI International
type: FunctionalProperty
publisher: DERI International
range: Region
Format: application/rdf+xml
type: ObjectProperty
domain: Sub-Region
description: The Region in which some SubRegion is contained.
Type: http://www.w3.org/2002/07/owl#FunctionalProperty
Coverage: world
Rights: http://www.deri.org/privacy.html
date: 2004-10-20
type: Property
domain: http://lodlaundromat.org/.well-known/genid/240cd8d701a3c44280314a4f06cca6bb#63
domain: Sub-Continent
domain: Resource
domain: Sub-Country
domain: Location
range: Sub-Continent
range: Resource
range: Location
range: Sub-Country
range: http://lodlaundromat.org/.well-known/genid/240cd8d701a3c44280314a4f06cca6bb#63

Starting Time
range: Thing
domain: Thing
type: FunctionalProperty
range: time
Rights: http://www.deri.org/privacy.html
type: ObjectProperty
Format: application/rdf+xml
creator: DERI International
description: The time when some event starts.
domain: http://lodlaundromat.org/.well-known/genid/240cd8d701a3c44280314a4f06cca6bb#50
publisher: DERI International
Type: http://www.w3.org/2002/07/owl#FunctionalProperty
date: 2004-10-20
Coverage: world
type: Property
domain: Resource
range: Resource

Interests
range: Thing
domain: Thing
type: ObjectProperty
type: SymmetricProperty
comment: The fields of interest of a person.
type: Property
domain: Resource
range: Resource

Contains Articles
range: Thing
domain: Thing
domain: Journal
Type: http://www.w3.org/2002/07/owl#ObjectProperty
type: ObjectProperty
range: Article
domain: Volume
Format: application/rdf+xml
inverse of: Contained in Journal
Rights: http://www.deri.org/privacy.html
description: The articles or papers which a journal containes.
Coverage: world
creator: DERI International
type: InverseFunctionalProperty
publisher: DERI International
date: 2004-10-20
type: Property
domain: http://lodlaundromat.org/.well-known/genid/240cd8d701a3c44280314a4f06cca6bb#25
domain: Resource
domain: Publication Container
domain: Publication
domain: http://lodlaundromat.org/.well-known/genid/240cd8d701a3c44280314a4f06cca6bb#23
domain: http://lodlaundromat.org/.well-known/genid/240cd8d701a3c44280314a4f06cca6bb#11
domain: Document
domain: http://lodlaundromat.org/.well-known/genid/240cd8d701a3c44280314a4f06cca6bb#3
domain: Dated Publication
range: Document
range: Resource
range: Publication
range: http://lodlaundromat.org/.well-known/genid/240cd8d701a3c44280314a4f06cca6bb#45
range: http://lodlaundromat.org/.well-known/genid/240cd8d701a3c44280314a4f06cca6bb#3

Edited by
range: Thing
domain: Thing
range: AgentSequence
publisher: DERI International
creator: DERI International
type: FunctionalProperty
Type: http://www.w3.org/2002/07/owl#ObjectProperty
date: 2004-10-20
domain: Publication Container
type: ObjectProperty
Format: application/rdf+xml
Rights: http://www.deri.org/privacy.html
Coverage: world
type: Property
domain: Resource
domain: Publication
range: Resource

Made
range: Thing
domain: Thing
creator: Dan Brickley
comment: "Something that was made by this agent." In the context of the SWPortal ontology, this could e.g. be an Tool .
Contributor: http://rdfweb.org/mailman/listinfo/rdfweb-dev
type: ObjectProperty
Type: http://www.w3.org/2002/07/owl#ObjectProperty
range: http://lodlaundromat.org/.well-known/genid/240cd8d701a3c44280314a4f06cca6bb#3
Contributor: http://www.w3.org/RDF/Interest/
publisher: Libby Miller
creator: Libby Miller
publisher: Dan Brickley
Coverage: world
domain: Agent
Format: application/rdf+xml
type: Property
domain: http://lodlaundromat.org/.well-known/genid/240cd8d701a3c44280314a4f06cca6bb#63
domain: Resource
range: Resource

Past Project
range: Thing
domain: Thing
domain: Agent
description: "A project this person has previously worked on." NOTE: foaf defines the range as foaf:Person - we decided to change this to the more general foaf:Agent , since other types of Agents (e.g. a company) can also have projects.
Contributor: http://www.w3.org/RDF/Interest/
Format: application/rdf+xml
Type: http://www.w3.org/2002/07/owl#ObjectProperty
creator: Libby Miller
Coverage: world
creator: Dan Brickley
type: ObjectProperty
Contributor: http://rdfweb.org/mailman/listinfo/rdfweb-dev
publisher: Libby Miller
publisher: Dan Brickley
range: Project
type: SymmetricProperty
type: Property
domain: http://lodlaundromat.org/.well-known/genid/240cd8d701a3c44280314a4f06cca6bb#63
domain: Resource
range: http://lodlaundromat.org/.well-known/genid/240cd8d701a3c44280314a4f06cca6bb#4
range: Resource
range: http://lodlaundromat.org/.well-known/genid/240cd8d701a3c44280314a4f06cca6bb#7
range: Agent
range: http://lodlaundromat.org/.well-known/genid/240cd8d701a3c44280314a4f06cca6bb#63
range: http://lodlaundromat.org/.well-known/genid/240cd8d701a3c44280314a4f06cca6bb#47
range: Group
range: Temporary Group

First
range: Thing
domain: Thing
comment: The first foaf:Agent in an AgentSequence .
Coverage: world
Type: http://www.w3.org/2002/07/owl#ObjectProperty
type: ObjectProperty
range: Agent
Format: application/rdf+xml
creator: DERI International
date: 2004-10-20
Rights: http://www.deri.org/privacy.html
publisher: DERI International
domain: AgentSequence
type: Property
domain: Resource
range: Resource
range: http://lodlaundromat.org/.well-known/genid/240cd8d701a3c44280314a4f06cca6bb#63

Initiative
subclass of: Resource
subclass of: Thing
type: Class
Rights: http://www.deri.org/privacy.html
description: An initiative is a group which has specific aims. It differs from foaf:Project in that it normally doesn’t have any funding. Often, its duration is longer.
creator: DERI International
publisher: DERI International
Coverage: world
Type: http://www.w3.org/2002/07/owl#Class
date: 2004-10-20
subclass of: Temporary Group
Format: application/rdf+xml
subclass of: http://lodlaundromat.org/.well-known/genid/240cd8d701a3c44280314a4f06cca6bb#4
subclass of: http://lodlaundromat.org/.well-known/genid/240cd8d701a3c44280314a4f06cca6bb#7
subclass of: Group
subclass of: http://lodlaundromat.org/.well-known/genid/240cd8d701a3c44280314a4f06cca6bb#47
subclass of: Agent
subclass of: http://lodlaundromat.org/.well-known/genid/240cd8d701a3c44280314a4f06cca6bb#63

Contains Chapters
range: Thing
domain: Thing
domain: Book
comment: The chapters or similar which a book contains.
inverse of: Contained in Book
Format: application/rdf+xml
type: InverseFunctionalProperty
creator: DERI International
range: Inbook
Type: http://www.w3.org/2002/07/owl#InverseFunctionalProperty
Rights: http://www.deri.org/privacy.html
publisher: DERI International
Coverage: world
date: 2004-10-20
type: ObjectProperty
type: Property
domain: http://lodlaundromat.org/.well-known/genid/240cd8d701a3c44280314a4f06cca6bb#25
domain: Resource
domain: Publication Container
domain: Publication
domain: http://lodlaundromat.org/.well-known/genid/240cd8d701a3c44280314a4f06cca6bb#3
domain: http://lodlaundromat.org/.well-known/genid/240cd8d701a3c44280314a4f06cca6bb#19
domain: http://lodlaundromat.org/.well-known/genid/240cd8d701a3c44280314a4f06cca6bb#23
domain: http://lodlaundromat.org/.well-known/genid/240cd8d701a3c44280314a4f06cca6bb#11
domain: http://lodlaundromat.org/.well-known/genid/240cd8d701a3c44280314a4f06cca6bb#38
domain: Document
domain: Dated Publication
range: http://lodlaundromat.org/.well-known/genid/240cd8d701a3c44280314a4f06cca6bb#45
range: Publication
range: http://lodlaundromat.org/.well-known/genid/240cd8d701a3c44280314a4f06cca6bb#3
range: Document
range: Resource

Title
sub property of: Title
Type: http://www.w3.org/2002/07/owl#FunctionalProperty
Format: application/rdf+xml
domain: Publication
description: The title of the publication (book, article, ...) or publication container (series, journal).
creator: DERI International
Rights: http://www.deri.org/privacy.html
equivalent property: Title
type: DatatypeProperty
Coverage: world
publisher: DERI International
date: 2004-10-20
type: FunctionalProperty
range: string
type: Property
range: Resource
domain: RSS1.0 News Item
domain: Thing
domain: Resource
domain: News Item
domain: Document
domain: http://lodlaundromat.org/.well-known/genid/240cd8d701a3c44280314a4f06cca6bb#3

Contained in Journal
range: Volume
range: Thing
domain: Thing
type: ObjectProperty
domain: Article
inverse of: Contains Articles
type: FunctionalProperty
publisher: DERI International
date: 2004-10-20
Format: application/rdf+xml
Type: http://www.w3.org/2002/07/owl#ObjectProperty
description: The journal or magazine which contains this article.
creator: DERI International
Coverage: world
Rights: http://www.deri.org/privacy.html
range: Journal
type: Property
domain: Resource
domain: Publication
domain: http://lodlaundromat.org/.well-known/genid/240cd8d701a3c44280314a4f06cca6bb#45
domain: Document
domain: http://lodlaundromat.org/.well-known/genid/240cd8d701a3c44280314a4f06cca6bb#3
range: Publication Container
range: Publication
range: Resource
range: Dated Publication
range: http://lodlaundromat.org/.well-known/genid/240cd8d701a3c44280314a4f06cca6bb#25
range: http://lodlaundromat.org/.well-known/genid/240cd8d701a3c44280314a4f06cca6bb#11
range: Document
range: http://lodlaundromat.org/.well-known/genid/240cd8d701a3c44280314a4f06cca6bb#23
range: http://lodlaundromat.org/.well-known/genid/240cd8d701a3c44280314a4f06cca6bb#3

Tenth
range: Thing
domain: Thing
publisher: DERI International
Format: application/rdf+xml
description: The tenth foaf:Agent in an AgentSequence .
domain: AgentSequence
Coverage: world
type: ObjectProperty
range: Agent
creator: DERI International
Type: http://www.w3.org/2002/07/owl#ObjectProperty
Rights: http://www.deri.org/privacy.html
date: 2004-10-20
type: Property
domain: Resource
range: Resource
range: http://lodlaundromat.org/.well-known/genid/240cd8d701a3c44280314a4f06cca6bb#63

Country
subclass of: Thing
subclass of: Resource
type: Class
subclass of: Sub-Continent
Coverage: world
Rights: http://www.deri.org/privacy.html
description: This class defines geopraphical bodies that are countries.
date: 2004-10-20
publisher: DERI International
creator: DERI International
Format: application/rdf+xml
Type: http://www.w3.org/2000/01/rdf-schema#Class
subclass of: Location
subclass of: http://lodlaundromat.org/.well-known/genid/240cd8d701a3c44280314a4f06cca6bb#63

Researcher
subclass of: http://lodlaundromat.org/.well-known/genid/240cd8d701a3c44280314a4f06cca6bb#35
subclass of: Resource
subclass of: Thing
type: Class
Coverage: world
Format: application/rdf+xml
subclass of: Person
Rights: http://www.deri.org/privacy.html
date: 2004-10-20
description: This class represents all kinds of persons who are researchers. Each has a research area.
creator: DERI International
publisher: DERI International
Type: http://www.w3.org/2002/07/owl#Class
subclass of: Agent
subclass of: http://lodlaundromat.org/.well-known/genid/240cd8d701a3c44280314a4f06cca6bb#63

Project
subclass of: Thing
subclass of: Resource
type: Class
description: "A project (a collective endeavour of some kind)." Within the context of the SWPortal Ontology we specify foaf:Project as such: A project is an endeavour of a group which has a specific aim. As a project can also be individualized and can publish documents and the like, we model it as a subclass of foaf:Agent. It has members and inherits all properties of foaf:Agent and foaf:Group . Also, projects are usually funded.
Type: http://www.w3.org/2000/01/rdf-schema#Class
creator: Dan Brickley
publisher: Libby Miller
creator: Libby Miller
Format: application/rdf+xml
subclass of: Temporary Group
Contributor: http://www.w3.org/RDF/Interest/
Coverage: world
publisher: Dan Brickley
Contributor: http://rdfweb.org/mailman/listinfo/rdfweb-dev
subclass of: Agent
subclass of: http://lodlaundromat.org/.well-known/genid/240cd8d701a3c44280314a4f06cca6bb#63
subclass of: http://lodlaundromat.org/.well-known/genid/240cd8d701a3c44280314a4f06cca6bb#4
subclass of: Group
subclass of: http://lodlaundromat.org/.well-known/genid/240cd8d701a3c44280314a4f06cca6bb#47
subclass of: http://lodlaundromat.org/.well-known/genid/240cd8d701a3c44280314a4f06cca6bb#7

Contained in Proceedings
range: Thing
domain: Thing
Format: application/rdf+xml
creator: DERI International
domain: Inproceedings
Rights: http://www.deri.org/privacy.html
type: ObjectProperty
description: The proceedings some paper or similar is contained in.
Type: http://www.w3.org/2002/07/owl#ObjectProperty
range: Proceedings
date: 2004-10-20
Coverage: world
publisher: DERI International
inverse of: Contains Papers
type: Property
domain: Resource
domain: Publication
domain: http://lodlaundromat.org/.well-known/genid/240cd8d701a3c44280314a4f06cca6bb#45
domain: Document
domain: http://lodlaundromat.org/.well-known/genid/240cd8d701a3c44280314a4f06cca6bb#3
range: Resource
range: Document
range: http://lodlaundromat.org/.well-known/genid/240cd8d701a3c44280314a4f06cca6bb#3
range: http://lodlaundromat.org/.well-known/genid/240cd8d701a3c44280314a4f06cca6bb#32
range: http://lodlaundromat.org/.well-known/genid/240cd8d701a3c44280314a4f06cca6bb#23
range: http://lodlaundromat.org/.well-known/genid/240cd8d701a3c44280314a4f06cca6bb#38
range: Publication Container
range: Dated Publication
range: http://lodlaundromat.org/.well-known/genid/240cd8d701a3c44280314a4f06cca6bb#25
range: Publication
range: http://lodlaundromat.org/.well-known/genid/240cd8d701a3c44280314a4f06cca6bb#11
range: http://lodlaundromat.org/.well-known/genid/240cd8d701a3c44280314a4f06cca6bb#19

Belongs to Project
range: Thing
domain: Thing
domain: Work Package
Rights: http://www.deri.org/privacy.html
type: ObjectProperty
range: Project
creator: DERI International
comment: Defines what project a workpackage belongs to.
Coverage: world
date: 2004-10-20
Format: application/rdf+xml
Type: http://www.w3.org/2002/07/owl#ObjectProperty
inverse of: Workpackages
publisher: DERI International
type: Property
domain: http://lodlaundromat.org/.well-known/genid/240cd8d701a3c44280314a4f06cca6bb#63
domain: Agent
domain: Resource
domain: http://lodlaundromat.org/.well-known/genid/240cd8d701a3c44280314a4f06cca6bb#47
domain: Temporary Group
domain: http://lodlaundromat.org/.well-known/genid/240cd8d701a3c44280314a4f06cca6bb#7
domain: http://lodlaundromat.org/.well-known/genid/240cd8d701a3c44280314a4f06cca6bb#4
domain: Group
range: http://lodlaundromat.org/.well-known/genid/240cd8d701a3c44280314a4f06cca6bb#4
range: Resource
range: http://lodlaundromat.org/.well-known/genid/240cd8d701a3c44280314a4f06cca6bb#7
range: Agent
range: http://lodlaundromat.org/.well-known/genid/240cd8d701a3c44280314a4f06cca6bb#63
range: http://lodlaundromat.org/.well-known/genid/240cd8d701a3c44280314a4f06cca6bb#47
range: Group
range: Temporary Group

Document
subclass of: Thing
subclass of: Resource
type: Class
subclass of: http://lodlaundromat.org/.well-known/genid/240cd8d701a3c44280314a4f06cca6bb#3
subclass of: Publication
Contributor: http://www.w3.org/RDF/Interest/
comment: Similar to the Agent concept, we have again decided to include a concept from the popular FOAF ontology. The FOAF Vocabulary Specification currently defines Document in a very loose way: "The foaf:Document class represents those things which are, broadly conceived, 'documents'. ... We do not (currently) distinguish between physical and electronic documents, or between copies of a work and the abstraction those copies embody." The intended use of this concept within the SWPortal ontology is to subsume everything that contains some sort of information and has been produced by some foaf:Agent An instance of Document can either refer to an electronic or physical thing, as long as it is adressable by means of a URI. Examples are a book written, or a picture taken by a person, but also a log file generated by a machine.
creator: Dan Brickley
creator: Libby Miller
publisher: Libby Miller
Type: http://www.w3.org/2000/01/rdf-schema#Class
publisher: Dan Brickley
Coverage: world
Format: application/rdf+xml
Contributor: http://rdfweb.org/mailman/listinfo/rdfweb-dev

Seventh
range: Thing
domain: Thing
domain: AgentSequence
creator: DERI International
Coverage: world
description: The seventh foaf:Agent in an AgentSequence .
date: 2004-10-20
type: ObjectProperty
Format: application/rdf+xml
range: Agent
publisher: DERI International
Type: http://www.w3.org/2002/07/owl#ObjectProperty
Rights: http://www.deri.org/privacy.html
type: Property
domain: Resource
range: Resource
range: http://lodlaundromat.org/.well-known/genid/240cd8d701a3c44280314a4f06cca6bb#63

Publications
domain: AgentSequence
range: Thing
domain: Thing
range: Document
Type: http://www.w3.org/2002/07/owl#ObjectProperty
Format: application/rdf+xml
domain: Agent
Contributor: http://rdfweb.org/mailman/listinfo/rdfweb-dev
publisher: Libby Miller
creator: Dan Brickley
Contributor: http://www.w3.org/RDF/Interest/
description: "A link to the publications of this person." This property relates an agent to its publications. NOTE: foaf defines the range as foaf:Person - we decided to change this to the more general foaf:Agent , since other types of Agents (e.g. a company) can also have publications (with no specific human authors).
inverse of: Authors
publisher: Dan Brickley
type: ObjectProperty
creator: Libby Miller
Coverage: world
type: Property
domain: http://lodlaundromat.org/.well-known/genid/240cd8d701a3c44280314a4f06cca6bb#63
domain: Resource
range: Resource
range: Publication
range: http://lodlaundromat.org/.well-known/genid/240cd8d701a3c44280314a4f06cca6bb#3

Topic
subclass of: Thing
subclass of: Resource
type: Class
date: 2004-10-20
Format: application/rdf+xml
publisher: DERI International
creator: DERI International
Rights: http://www.deri.org/privacy.html
comment: All research topics inherit from this concept. This should serve as a plugin point for the research topic ontology.
Coverage: world
Type: http://www.w3.org/2000/01/rdf-schema#Class

Software Company
subclass of: Resource
subclass of: Thing
type: Class
description: This class models companies that develop software and sell it.
creator: DERI International
Rights: http://www.deri.org/privacy.html
date: 2004-10-20
Coverage: world
subclass of: Company
Format: application/rdf+xml
Type: http://www.w3.org/2002/07/owl#Class
publisher: DERI International
subclass of: Organization
subclass of: Group
subclass of: Agent
subclass of: http://lodlaundromat.org/.well-known/genid/240cd8d701a3c44280314a4f06cca6bb#63

Book
type: Class
subclass of: Resource
subclass of: http://lodlaundromat.org/.well-known/genid/240cd8d701a3c44280314a4f06cca6bb#38
subclass of: http://lodlaundromat.org/.well-known/genid/240cd8d701a3c44280314a4f06cca6bb#11
subclass of: Thing
subclass of: http://lodlaundromat.org/.well-known/genid/240cd8d701a3c44280314a4f06cca6bb#25
subclass of: http://lodlaundromat.org/.well-known/genid/240cd8d701a3c44280314a4f06cca6bb#3
subclass of: http://lodlaundromat.org/.well-known/genid/240cd8d701a3c44280314a4f06cca6bb#19
publisher: DERI International
description: A book with an explicit publisher. NOTES: - Either authors or editedBy must be given - Either volume or number may be given.
Type: http://www.w3.org/2000/01/rdf-schema#Class
subclass of: Publication Container
Rights: http://www.deri.org/privacy.html
creator: DERI International
date: 2004-10-20
Format: application/rdf+xml
Coverage: world
subclass of: Dated Publication
subclass of: http://lodlaundromat.org/.well-known/genid/240cd8d701a3c44280314a4f06cca6bb#23
subclass of: Publication
subclass of: Document

PhD Thesis
subclass of: Resource
subclass of: Thing
type: Class
Rights: http://www.deri.org/privacy.html
creator: DERI International
date: 2004-10-20
Format: application/rdf+xml
Coverage: world
Type: http://www.w3.org/2002/07/owl#Class
publisher: DERI International
description: A thesis written to receive a PhD degree.
subclass of: Thesis
subclass of: Dated Publication
subclass of: Document
subclass of: http://lodlaundromat.org/.well-known/genid/240cd8d701a3c44280314a4f06cca6bb#23
subclass of: http://lodlaundromat.org/.well-known/genid/240cd8d701a3c44280314a4f06cca6bb#3
subclass of: Publication

Products
domain: Thing
description: This property defines the products of a company.
range: Thing
publisher: DERI International
Rights: http://www.deri.org/privacy.html
Format: application/rdf+xml
creator: DERI International
type: ObjectProperty
domain: Company
Type: http://www.w3.org/2002/07/owl#ObjectProperty
date: 2004-10-20
Coverage: world
type: Property
domain: http://lodlaundromat.org/.well-known/genid/240cd8d701a3c44280314a4f06cca6bb#63
domain: Agent
domain: Resource
domain: Organization
domain: Group
range: Resource

time
subclass of: Thing
subclass of: Resource
type: Class
Type: http://www.w3.org/2000/01/rdf-schema#Class
creator: DERI International
creator: Jos de Bruin
publisher: Jos de Bruin
creator: Holger Lausen
comment: A specific point in time during any arbitrary day. For the excat definition of this class, please refere to http://www.wsmo.org/2004/d3/d3.3/v0.1/ .
publisher: Holger Lausen
publisher: DERI International
Format: application/rdf+xml
Rights: http://www.deri.org/privacy.html
Coverage: world

Publication Container
subclass of: Thing
subclass of: Resource
type: Class
description: This class comprises all kinds of publications which contain other publications, such as journal, proceedings, series, etc. An instance of PublicationContainer has an editor.
publisher: DERI International
date: 2004-10-20
Format: application/rdf+xml
creator: DERI International
subclass of: Publication
Rights: http://www.deri.org/privacy.html
Coverage: world
Type: http://www.w3.org/2000/01/rdf-schema#Class

Agent
subclass of: http://lodlaundromat.org/.well-known/genid/240cd8d701a3c44280314a4f06cca6bb#63
subclass of: Thing
subclass of: Resource
type: Class
description: "An agent (e.g. person, group, software or physical artifact)." NOTE: We adopted this concept partially from the FOAF ontology. However, in our ontology the agent concept does not comprise the subclasses software and physical artifact. We decided to introduce this main concept in order to make the range of e.g. the attribute authors of a publication more general.
Format: application/rdf+xml
Contributor: http://rdfweb.org/mailman/listinfo/rdfweb-dev
Type: http://www.w3.org/2000/01/rdf-schema#Class
Coverage: world
publisher: Dan Brickley
creator: Dan Brickley
publisher: Libby Miller
Contributor: http://www.w3.org/RDF/Interest/
creator: Libby Miller

University
subclass of: Thing
subclass of: Resource
type: Class
subclass of: http://lodlaundromat.org/.well-known/genid/240cd8d701a3c44280314a4f06cca6bb#35
description: This class represents universities. We decided to introduce two different classes to distinguish between universities and independent research institutes. The main difference is actually the different kinds of independence. In contrast to a university, a research institute is independent from the rigorous bureaucracy of the mainly state-run universities. On the other hand, a university is independent from the economy and the financial support of companies. Thus, the kind of research an independent research institute practises is generally more application-oriented.
Coverage: world
date: 2004-10-20
Type: http://www.w3.org/2000/01/rdf-schema#Class
Rights: http://www.deri.org/privacy.html
subclass of: Organization
publisher: DERI International
Format: application/rdf+xml
creator: DERI International
subclass of: Agent
subclass of: Group
subclass of: http://lodlaundromat.org/.well-known/genid/240cd8d701a3c44280314a4f06cca6bb#63

Deliverables
range: Thing
domain: Thing
domain: Project
type: ObjectProperty
creator: DERI International
description: The deliverables for this project. The inverse is forProject .
range: Deliverable
domain: http://lodlaundromat.org/.well-known/genid/240cd8d701a3c44280314a4f06cca6bb#7
inverse of: For Project
Type: http://www.w3.org/2002/07/owl#ObjectProperty
date: 2004-10-20
Rights: http://www.deri.org/privacy.html
Coverage: world
publisher: DERI International
Format: application/rdf+xml
type: Property
domain: http://lodlaundromat.org/.well-known/genid/240cd8d701a3c44280314a4f06cca6bb#63
domain: Agent
domain: Resource
domain: http://lodlaundromat.org/.well-known/genid/240cd8d701a3c44280314a4f06cca6bb#47
domain: Temporary Group
domain: http://lodlaundromat.org/.well-known/genid/240cd8d701a3c44280314a4f06cca6bb#4
domain: Group
range: Resource
range: Publication
range: Dated Publication
range: Document
range: http://lodlaundromat.org/.well-known/genid/240cd8d701a3c44280314a4f06cca6bb#61
range: http://lodlaundromat.org/.well-known/genid/240cd8d701a3c44280314a4f06cca6bb#3
range: http://lodlaundromat.org/.well-known/genid/240cd8d701a3c44280314a4f06cca6bb#23
range: Unpublished
range: http://lodlaundromat.org/.well-known/genid/240cd8d701a3c44280314a4f06cca6bb#11

Second
range: Thing
domain: Thing
type: ObjectProperty
range: Agent
Coverage: world
Rights: http://www.deri.org/privacy.html
description: The second foaf:Agent in an AgentSequence .
Format: application/rdf+xml
publisher: DERI International
domain: AgentSequence
creator: DERI International
Type: http://www.w3.org/2002/07/owl#ObjectProperty
date: 2004-10-20
type: Property
domain: Resource
range: Resource
range: http://lodlaundromat.org/.well-known/genid/240cd8d701a3c44280314a4f06cca6bb#63

Gives Presentations
range: Thing
domain: Thing
date: 2004-10-20
Coverage: world
Type: http://www.w3.org/2002/07/owl#ObjectProperty
publisher: DERI International
inverse of: Presenter
comment: This property relates an agent to the presentations it gives. The inverse property is presenter .
creator: DERI International
type: ObjectProperty
range: Presentation
Format: application/rdf+xml
Rights: http://www.deri.org/privacy.html
domain: Agent
type: Property
domain: http://lodlaundromat.org/.well-known/genid/240cd8d701a3c44280314a4f06cca6bb#63
domain: Resource
range: http://lodlaundromat.org/.well-known/genid/240cd8d701a3c44280314a4f06cca6bb#4
range: Resource
range: Event
range: http://lodlaundromat.org/.well-known/genid/240cd8d701a3c44280314a4f06cca6bb#50
range: http://lodlaundromat.org/.well-known/genid/240cd8d701a3c44280314a4f06cca6bb#15
range: http://lodlaundromat.org/.well-known/genid/240cd8d701a3c44280314a4f06cca6bb#47
range: http://lodlaundromat.org/.well-known/genid/240cd8d701a3c44280314a4f06cca6bb#63

Contained in Book
range: Thing
domain: Thing
date: 2004-10-20
Format: application/rdf+xml
publisher: DERI International
type: FunctionalProperty
creator: DERI International
Type: http://www.w3.org/2002/07/owl#FunctionalProperty
inverse of: Contains Chapters
Coverage: world
type: ObjectProperty
Rights: http://www.deri.org/privacy.html
description: The Book in which an Inbook is contained.
range: Book
domain: Inbook
type: Property
domain: Resource
domain: Publication
domain: http://lodlaundromat.org/.well-known/genid/240cd8d701a3c44280314a4f06cca6bb#45
domain: Document
domain: http://lodlaundromat.org/.well-known/genid/240cd8d701a3c44280314a4f06cca6bb#3
range: Resource
range: http://lodlaundromat.org/.well-known/genid/240cd8d701a3c44280314a4f06cca6bb#23
range: Document
range: Publication
range: http://lodlaundromat.org/.well-known/genid/240cd8d701a3c44280314a4f06cca6bb#3
range: Dated Publication
range: http://lodlaundromat.org/.well-known/genid/240cd8d701a3c44280314a4f06cca6bb#19
range: http://lodlaundromat.org/.well-known/genid/240cd8d701a3c44280314a4f06cca6bb#38
range: http://lodlaundromat.org/.well-known/genid/240cd8d701a3c44280314a4f06cca6bb#11
range: Publication Container
range: http://lodlaundromat.org/.well-known/genid/240cd8d701a3c44280314a4f06cca6bb#25

Surname
Format: application/rdf+xml
type: DatatypeProperty
Contributor: http://www.w3.org/RDF/Interest/
Coverage: world
Type: http://www.w3.org/2002/07/owl#DatatypeProperty
creator: Libby Miller
Contributor: http://rdfweb.org/mailman/listinfo/rdfweb-dev
comment: "The surname of a person." NOTE: the naming substructure of foaf is currently quite unstable.
domain: Person
type: FunctionalProperty
range: string
publisher: Libby Miller
publisher: Dan Brickley
creator: Dan Brickley
type: Property
domain: http://lodlaundromat.org/.well-known/genid/240cd8d701a3c44280314a4f06cca6bb#63
domain: Agent
domain: Resource
domain: Thing
range: Resource

Chapter
range: int
creator: DERI International
type: DatatypeProperty
comment: The chapter (or section or whatever) number which this Inbook represents.
Format: application/rdf+xml
domain: Inbook
publisher: DERI International
Type: http://www.w3.org/2002/07/owl#DatatypeProperty
type: FunctionalProperty
Coverage: world
date: 2004-10-20
Rights: http://www.deri.org/privacy.html
type: Property
domain: Resource
domain: Publication
domain: Thing
domain: http://lodlaundromat.org/.well-known/genid/240cd8d701a3c44280314a4f06cca6bb#45
domain: Document
domain: http://lodlaundromat.org/.well-known/genid/240cd8d701a3c44280314a4f06cca6bb#3
range: Resource
range: long
range: integer
range: decimal

Items
description: "Points to a list of rss:item elements that are members of the subject channel." NOTE: the range is actually rdf:Seq
creator: RSS-DEV Working Group
Format: application/rdf+xml
Coverage: world
Type: http://www.w3.org/2002/07/owl#FunctionalProperty
domain: RSS1.0 News Channel
range: string
type: DatatypeProperty
publisher: RSS-DEV Working Group
type: FunctionalProperty
type: Property
domain: Resource
domain: Publication Container
domain: Publication
domain: Thing
range: Resource

Publisher
modified: 2008-01-14
issued: 1999-07-02
description: Examples of a Publisher include a person, an organization, or a service. Typically, the name of a Publisher should be used to indicate the entity.
type: AnnotationProperty
comment: An entity responsible for making the resource available.
has version: publisher-006
note: A second property with the same name as this property has been declared in the dcterms: namespace (http://purl.org/dc/terms/). See the Introduction to the document "DCMI Metadata Terms" (http://dublincore.org/documents/dcmi-terms/) for an explanation.
type: Property

How Published
comment: How something strange has been published.
publisher: DERI International
range: string
domain: http://lodlaundromat.org/.well-known/genid/240cd8d701a3c44280314a4f06cca6bb#1
Coverage: world
Type: http://www.w3.org/2002/07/owl#FunctionalProperty
date: 2004-10-20
Rights: http://www.deri.org/privacy.html
creator: DERI International
type: FunctionalProperty
Format: application/rdf+xml
type: DatatypeProperty
type: Property
domain: Resource
domain: Thing
range: Resource

Coverage
description: Spatial topic and spatial applicability may be a named place or a location specified by its geographic coordinates. Temporal topic may be a named period, date, or date range. A jurisdiction may be a named administrative entity or a geographic place to which the resource applies. Recommended best practice is to use a controlled vocabulary such as the Thesaurus of Geographic Names [TGN]. Where appropriate, named places or time periods can be used in preference to numeric identifiers such as sets of coordinates or date ranges.
type: AnnotationProperty
type: Property
modified: 2008-01-14
has version: coverage-006
issued: 1999-07-02
note: A second property with the same name as this property has been declared in the dcterms: namespace (http://purl.org/dc/terms/). See the Introduction to the document "DCMI Metadata Terms" (http://dublincore.org/documents/dcmi-terms/) for an explanation.
comment: The spatial or temporal topic of the resource, the spatial applicability of the resource, or the jurisdiction under which the resource is relevant.

Number
creator: DERI International
Format: application/rdf+xml
Rights: http://www.deri.org/privacy.html
range: nonNegativeInteger
domain: http://lodlaundromat.org/.well-known/genid/240cd8d701a3c44280314a4f06cca6bb#11
comment: The number of a journal, magazine, techreport, or of a work in a series. An issue of a journal or magazine is usually identified by its volume and number; the organization that issues a technical report usually gives it a number; and sometimes books are given numbers in a numbered series. Deliverables for a project may also be given numbers.
Type: http://www.w3.org/2002/07/owl#DatatypeProperty
publisher: DERI International
type: DatatypeProperty
type: FunctionalProperty
date: 2004-10-20
Coverage: world
type: Property
domain: Resource
domain: Thing
range: Resource
range: integer
range: decimal

Goal
Format: application/rdf+xml
Rights: http://www.deri.org/privacy.html
Coverage: world
date: 2004-10-20
type: FunctionalProperty
Type: http://www.w3.org/2002/07/owl#DatatypeProperty
range: string
type: DatatypeProperty
description: The goal a group aims at. NOTE: foaf:theme provides a similar functionality.
creator: DERI International
publisher: DERI International
domain: Group
type: Property
domain: http://lodlaundromat.org/.well-known/genid/240cd8d701a3c44280314a4f06cca6bb#63
domain: Agent
domain: Resource
domain: Thing
range: Resource

Identifier
description: Recommended best practice is to identify the resource by means of a string conforming to a formal identification system.
has version: identifier-006
issued: 1999-07-02
modified: 2008-01-14
type: Property
comment: An unambiguous reference to the resource within a given context.
note: A second property with the same name as this property has been declared in the dcterms: namespace (http://purl.org/dc/terms/). See the Introduction to the document "DCMI Metadata Terms" (http://dublincore.org/documents/dcmi-terms/) for an explanation.

Language
issued: 1999-07-02
note: A second property with the same name as this property has been declared in the dcterms: namespace (http://purl.org/dc/terms/). See the Introduction to the document "DCMI Metadata Terms" (http://dublincore.org/documents/dcmi-terms/) for an explanation.
has version: language-007
description: Recommended best practice is to use a controlled vocabulary such as RFC 4646 [RFC4646].
type: Property
comment: A language of the resource.
modified: 2008-01-14

Subject
description: Typically, the subject will be represented using keywords, key phrases, or classification codes. Recommended best practice is to use a controlled vocabulary.
has version: subject-007
issued: 1999-07-02
modified: 2012-06-14
type: Property
comment: The topic of the resource.
note: A second property with the same name as this property has been declared in the dcterms: namespace (http://purl.org/dc/terms/). See the Introduction to the document "DCMI Metadata Terms" (http://dublincore.org/documents/dcmi-terms/) for an explanation.

Relation
description: Recommended best practice is to identify the related resource by means of a string conforming to a formal identification system.
has version: relation-006
issued: 1999-07-02
modified: 2008-01-14
type: Property
comment: A related resource.
note: A second property with the same name as this property has been declared in the dcterms: namespace (http://purl.org/dc/terms/). See the Introduction to the document "DCMI Metadata Terms" (http://dublincore.org/documents/dcmi-terms/) for an explanation.

Complete Name
Type: http://www.w3.org/2002/07/owl#FunctionalProperty
range: string
creator: Libby Miller
comment: "The name of some thing."
domain: http://lodlaundromat.org/.well-known/genid/240cd8d701a3c44280314a4f06cca6bb#63
type: FunctionalProperty
publisher: Libby Miller
publisher: Dan Brickley
creator: Dan Brickley
Contributor: http://rdfweb.org/mailman/listinfo/rdfweb-dev
Contributor: http://www.w3.org/RDF/Interest/
type: DatatypeProperty
Coverage: world
Format: application/rdf+xml
type: Property
domain: Resource
domain: Thing
range: Resource

Creator
comment: An entity primarily responsible for making the resource.
has version: creator-006
description: Examples of a Creator include a person, an organization, or a service. Typically, the name of a Creator should be used to indicate the entity.
issued: 1999-07-02
note: A second property with the same name as this property has been declared in the dcterms: namespace (http://purl.org/dc/terms/). See the Introduction to the document "DCMI Metadata Terms" (http://dublincore.org/documents/dcmi-terms/) for an explanation.
type: Property
modified: 2008-01-14
type: AnnotationProperty

Format
type: AnnotationProperty
description: Examples of dimensions include size and duration. Recommended best practice is to use a controlled vocabulary such as the list of Internet Media Types [MIME].
modified: 2008-01-14
type: Property
issued: 1999-07-02
note: A second property with the same name as this property has been declared in the dcterms: namespace (http://purl.org/dc/terms/). See the Introduction to the document "DCMI Metadata Terms" (http://dublincore.org/documents/dcmi-terms/) for an explanation.
has version: format-007
comment: The file format, physical medium, or dimensions of the resource.

Publication Date
publisher: DERI International
comment: The date of publication of some publication or software. Bibtex defines year and month. These are here combined to publicationDate.
Type: http://www.w3.org/2002/07/owl#DatatypeProperty
Coverage: world
Format: application/rdf+xml
date: 2004-10-20
creator: DERI International
domain: http://lodlaundromat.org/.well-known/genid/240cd8d701a3c44280314a4f06cca6bb#23
Rights: http://www.deri.org/privacy.html
type: FunctionalProperty
range: date
type: DatatypeProperty
type: Property
domain: Resource
domain: Thing
range: Resource

Source
description: The described resource may be derived from the related resource in whole or in part. Recommended best practice is to identify the related resource by means of a string conforming to a formal identification system.
has version: source-006
issued: 1999-07-02
modified: 2008-01-14
type: Property
comment: A related resource from which the described resource is derived.
note: A second property with the same name as this property has been declared in the dcterms: namespace (http://purl.org/dc/terms/). See the Introduction to the document "DCMI Metadata Terms" (http://dublincore.org/documents/dcmi-terms/) for an explanation.

SWPortal Ontology - Semantic Web Portal Ontology
description: The aim of the Semantic Web Portal Ontology is to serve as the conceptual backbone for community portals driven by Semantic Web technologies.
Format: application/rdf+xml
Type: http://www.w3.org/2002/07/owl#Ontology
creator: DERI International
date: 2004-10-20
Rights: http://www.deri.org/privacy.html
type: Ontology
imports: Dublin Core Metadata Element Set, Version 1.1
Coverage: world
publisher: DERI International

Description
modified: 2008-01-14
type: AnnotationProperty
has version: description-006
note: A second property with the same name as this property has been declared in the dcterms: namespace (http://purl.org/dc/terms/). See the Introduction to the document "DCMI Metadata Terms" (http://dublincore.org/documents/dcmi-terms/) for an explanation.
comment: An account of the resource.
type: Property
issued: 1999-07-02
description: Description may include but is not limited to: an abstract, a table of contents, a graphical representation, or a free-text account of the resource.

Version
Type: http://www.w3.org/2002/07/owl#FunctionalProperty
comment: The version number of a document or tool.
Coverage: world
publisher: DERI International
type: DatatypeProperty
domain: http://lodlaundromat.org/.well-known/genid/240cd8d701a3c44280314a4f06cca6bb#61
Rights: http://www.deri.org/privacy.html
date: 2004-10-20
creator: DERI International
range: float
type: FunctionalProperty
Format: application/rdf+xml
type: Property
domain: Resource
domain: Thing
range: Resource

Link
publisher: RSS-DEV Working Group
Type: http://www.w3.org/2002/07/owl#FunctionalProperty
type: FunctionalProperty
type: DatatypeProperty
Coverage: world
comment: If this publication can be accessed in electronic form, the corresponding URL can be using the rss:link property. NOTE: this definition is a slightly extended version of the definition in the RSS 1.0 specification.
creator: RSS-DEV Working Group
domain: Publication
range: string
Format: application/rdf+xml
type: Property
domain: Resource
domain: Thing
range: Resource

hasZipcode
date: 2004-10-20
domain: Postal Address
Type: http://www.w3.org/2002/07/owl#DatatypeProperty
publisher: DERI International
type: DatatypeProperty
range: string
creator: DERI International
Coverage: world
description: The zipcode of some PostalAddress (if applicable). This is simply a string with no prescribed syntax.
Rights: http://www.deri.org/privacy.html
Format: application/rdf+xml
type: Property
domain: http://lodlaundromat.org/.well-known/genid/240cd8d701a3c44280314a4f06cca6bb#63
domain: Sub-Continent
domain: Resource
domain: Thing
domain: Sub-Region
domain: Sub-City
domain: Sub-Country
domain: Location
range: Resource

Contributor
issued: 1999-07-02
comment: An entity responsible for making contributions to the resource.
modified: 2008-01-14
description: Examples of a Contributor include a person, an organization, or a service. Typically, the name of a Contributor should be used to indicate the entity.
note: A second property with the same name as this property has been declared in the dcterms: namespace (http://purl.org/dc/terms/). See the Introduction to the document "DCMI Metadata Terms" (http://dublincore.org/documents/dcmi-terms/) for an explanation.
has version: contributor-006
type: Property
type: AnnotationProperty

Edition
Coverage: world
range: nonNegativeInteger
Format: application/rdf+xml
comment: The edition of a book---for example, ``Second''. This should be an ordinal, and should have the first letter capitalized, as shown here; the standard styles convert to lower case when necessary.
type: DatatypeProperty
domain: Book
Rights: http://www.deri.org/privacy.html
type: FunctionalProperty
creator: DERI International
Type: http://www.w3.org/2002/07/owl#DatatypeProperty
publisher: DERI International
date: 2004-10-20
type: Property
domain: http://lodlaundromat.org/.well-known/genid/240cd8d701a3c44280314a4f06cca6bb#25
domain: Thing
domain: Resource
domain: Publication Container
domain: Publication
domain: http://lodlaundromat.org/.well-known/genid/240cd8d701a3c44280314a4f06cca6bb#3
domain: http://lodlaundromat.org/.well-known/genid/240cd8d701a3c44280314a4f06cca6bb#19
domain: http://lodlaundromat.org/.well-known/genid/240cd8d701a3c44280314a4f06cca6bb#23
domain: http://lodlaundromat.org/.well-known/genid/240cd8d701a3c44280314a4f06cca6bb#11
domain: http://lodlaundromat.org/.well-known/genid/240cd8d701a3c44280314a4f06cca6bb#38
domain: Document
domain: Dated Publication
range: Resource
range: integer
range: decimal

Volume
publisher: DERI International
description: The volume of a journal or a multi-volume book.
type: DatatypeProperty
range: nonNegativeInteger
Coverage: world
domain: http://lodlaundromat.org/.well-known/genid/240cd8d701a3c44280314a4f06cca6bb#25
Format: application/rdf+xml
Type: http://www.w3.org/2002/07/owl#DatatypeProperty
date: 2004-10-20
Rights: http://www.deri.org/privacy.html
creator: DERI International
type: FunctionalProperty
type: Property
domain: Thing
domain: Resource
range: Resource
range: integer
range: decimal

Date
has version: date-006
modified: 2008-01-14
type: AnnotationProperty
description: Date may be used to express temporal information at any level of granularity. Recommended best practice is to use an encoding scheme, such as the W3CDTF profile of ISO 8601 [W3CDTF].
comment: A point or period of time associated with an event in the lifecycle of the resource.
note: A second property with the same name as this property has been declared in the dcterms: namespace (http://purl.org/dc/terms/). See the Introduction to the document "DCMI Metadata Terms" (http://dublincore.org/documents/dcmi-terms/) for an explanation.
issued: 1999-07-02
type: Property

POBox
range: string
Format: application/rdf+xml
comment: The PO-Box of some PostalAddress .
domain: Postal Address
date: 2004-10-20
publisher: DERI International
type: DatatypeProperty
type: FunctionalProperty
creator: DERI International
Rights: http://www.deri.org/privacy.html
Type: http://www.w3.org/2002/07/owl#DatatypeProperty
Coverage: world
type: Property
domain: http://lodlaundromat.org/.well-known/genid/240cd8d701a3c44280314a4f06cca6bb#63
domain: Sub-Continent
domain: Resource
domain: Thing
domain: Sub-Region
domain: Sub-City
domain: Sub-Country
domain: Location
range: Resource

Rights
comment: Information about rights held in and over the resource.
has version: rights-006
type: AnnotationProperty
description: Typically, rights information includes a statement about various property rights associated with the resource, including intellectual property rights.
issued: 1999-07-02
type: Property
note: A second property with the same name as this property has been declared in the dcterms: namespace (http://purl.org/dc/terms/). See the Introduction to the document "DCMI Metadata Terms" (http://dublincore.org/documents/dcmi-terms/) for an explanation.
modified: 2008-01-14

Street
date: 2004-10-20
description: The street address part of an PostalAddress . Can have multiple lines.
Rights: http://www.deri.org/privacy.html
Type: http://www.w3.org/2002/07/owl#DatatypeProperty
publisher: DERI International
creator: DERI International
range: string
type: DatatypeProperty
Format: application/rdf+xml
domain: Postal Address
Coverage: world
type: FunctionalProperty
type: Property
domain: http://lodlaundromat.org/.well-known/genid/240cd8d701a3c44280314a4f06cca6bb#63
domain: Sub-Continent
domain: Resource
domain: Thing
domain: Sub-Region
domain: Sub-City
domain: Sub-Country
domain: Location
range: Resource

Dublin Core Metadata Element Set, Version 1.1
modified: 2012-06-14
publisher: DCMI
type: Ontology

Title
has version: title-006
issued: 1999-07-02
modified: 2008-01-14
type: Property
comment: A name given to the resource.
note: A second property with the same name as this property has been declared in the dcterms: namespace (http://purl.org/dc/terms/). See the Introduction to the document "DCMI Metadata Terms" (http://dublincore.org/documents/dcmi-terms/) for an explanation.
type: AnnotationProperty

Type
comment: The nature or genre of the resource.
type: Property
note: A second property with the same name as this property has been declared in the dcterms: namespace (http://purl.org/dc/terms/). See the Introduction to the document "DCMI Metadata Terms" (http://dublincore.org/documents/dcmi-terms/) for an explanation.
type: AnnotationProperty
issued: 1999-07-02
has version: type-006
description: Recommended best practice is to use a controlled vocabulary such as the DCMI Type Vocabulary [DCMITYPE]. To describe the file format, physical medium, or dimensions of the resource, use the Format element.
modified: 2008-01-14

Pages
creator: DERI International
type: FunctionalProperty
domain: http://lodlaundromat.org/.well-known/genid/240cd8d701a3c44280314a4f06cca6bb#45
description: One or more page numbers or range of numbers, such as 42--111 or 7,41,73--97 or 43+ (the `+' in this last example indicates pages following that don't form a simple range). To make it easier to maintain Scribe-compatible databases, the standard styles convert a single dash (as in 7-33) to the double dash used in TeX to denote number ranges (as in 7--33).
Type: http://www.w3.org/2002/07/owl#DatatypeProperty
publisher: DERI International
Format: application/rdf+xml
range: nonNegativeInteger
date: 2004-10-20
Coverage: world
Rights: http://www.deri.org/privacy.html
type: DatatypeProperty
type: Property
domain: Resource
domain: Thing
range: Resource
range: integer
range: decimal

First Name
Format: application/rdf+xml
type: FunctionalProperty
creator: Libby Miller
publisher: Dan Brickley
Type: http://www.w3.org/2002/07/owl#DatatypeProperty
comment: "The first name of a person." NOTE: the naming substructure of foaf is currently quite unstable.
domain: Person
Contributor: http://www.w3.org/RDF/Interest/
creator: Dan Brickley
publisher: Libby Miller
range: string
type: DatatypeProperty
Contributor: http://rdfweb.org/mailman/listinfo/rdfweb-dev
Coverage: world
type: Property
domain: http://lodlaundromat.org/.well-known/genid/240cd8d701a3c44280314a4f06cca6bb#63
domain: Agent
domain: Resource
domain: Thing
range: Resource