http://lodlaundromat.org/.well-known/genid/12811acf10ce267d4572f8314a56f0f4#25
subclass of: Resource
subclass of: Thing
type: Class
type: Restriction
max cardinality: 1
on property: sampling location

processing details
range: Thing
domain: Thing
type: ObjectProperty
domain: AnyFeature
range: Sampling process
type: Property
range: Resource
range: Not a sampling feature
range: AnyFeature
domain: Resource

lineage
range: Thing
domain: Thing
type: ObjectProperty
domain: AnyFeature
range: Lineage
definition: If present, the attribute lineage:LI_Lineage shall describe the history and provenance of the SF_SamplingFeature. This might include information relating to the handling of the specimen, or details of the survey procedure of a spatial sampling feature.
type: Property
range: Resource
domain: Resource

http://lodlaundromat.org/.well-known/genid/12811acf10ce267d4572f8314a56f0f4#12
subclass of: Thing
subclass of: Resource
type: Class
type: Restriction
min cardinality: 1
on property: sampled feature

preparation step time
range: Thing
type: ObjectProperty
domain: Thing
range: Object
definition: The attribute time:TM_Object shall describe the time that the SF_Process was applied to the SF_Specimen. It supports ordering of preparation steps.
type: Property
range: Resource
domain: Resource

sampling location
range: Thing
domain: Thing
type: ObjectProperty
domain: AnyFeature
range: Object
definition: If present, the attribute samplingLocation:GM_Object shall describe the location from where the specimen was obtained. NOTE Where a specimen has a relatedSamplingFeature whose location provides an unambiguous location then this attribute is not required. However, if the specific sampling location within the sampledFeature is important, then this attribute supports its description.
type: Property
range: Resource
range: Location
domain: Resource

role
range: Thing
type: ObjectProperty
domain: Thing
type: Property
range: Resource
domain: Resource

sampling method
range: Thing
domain: Thing
type: ObjectProperty
domain: AnyFeature
range: Sampling process
definition: If present, the attribute samplingMethod:SF_Process shall describe the method used to obtain the specimen from its sampledFeature.
type: Property
range: Resource
range: Not a sampling feature
range: AnyFeature
domain: Resource

http://lodlaundromat.org/.well-known/genid/12811acf10ce267d4572f8314a56f0f4#20
subclass of: Resource
subclass of: Thing
type: Class
type: Restriction
max cardinality: 2
on property: positional accuracy

current location
range: Thing
domain: Thing
type: ObjectProperty
domain: AnyFeature
range: Location
definition: If present, the attribute currentLocation:Location shall describe the location of a physical specimen. This may be a storage location, such as a shelf in a warehouse or a drawer in a museum. NOTE If a specimen no longer exists, for example, it was destroyed in connection with an observation act, then the currentLocation should be omitted or carry a suitable null indicator.
type: Property
range: Resource
domain: Resource

http://lodlaundromat.org/.well-known/genid/12811acf10ce267d4572f8314a56f0f4#28
subclass of: Resource
subclass of: Thing
type: Class
type: Restriction
max cardinality: 1
on property: specimen type

http://lodlaundromat.org/.well-known/genid/12811acf10ce267d4572f8314a56f0f4#15
subclass of: Resource
subclass of: Thing
type: Class
type: Restriction
on class: Sampling Feature
on property: related sampling feature
qualified cardinality: 1

process operator
range: Thing
domain: Thing
type: ObjectProperty
domain: AnyFeature
definition: the attribute processOperator:CI_ResponsibleParty shall describe the operator of the process involved in the preparation step.
type: Property
range: Resource
domain: Resource

sampling feature complex
range: Thing
domain: Thing
type: ObjectProperty
domain: AnyFeature
range: Sampling feature complex
type: Property
range: http://lodlaundromat.org/.well-known/genid/12811acf10ce267d4572f8314a56f0f4#14
range: Resource
range: http://lodlaundromat.org/.well-known/genid/12811acf10ce267d4572f8314a56f0f4#15
domain: Resource

http://lodlaundromat.org/.well-known/genid/12811acf10ce267d4572f8314a56f0f4#6
subclass of: Resource
subclass of: Thing
type: Class
type: Restriction
on class: Object
on property: preparation step time
qualified cardinality: 1

specimen type
range: Thing
domain: Thing
type: ObjectProperty
domain: AnyFeature
definition: the attribute specimenType:GenericName shall describe the basic form of the specimen. EXAMPLE Polished section; core; pulp; solution.
type: Property
range: Resource
domain: Resource

http://lodlaundromat.org/.well-known/genid/12811acf10ce267d4572f8314a56f0f4#23
subclass of: Resource
type: Class
subclass of: Thing
type: Restriction
cardinality: 1
on property: sampling time

sampling time
range: Thing
domain: Thing
type: ObjectProperty
domain: AnyFeature
range: Object
definition: The attribute samplingTime:TM_Object shall record when the specimen was retrieved from the sampled feature.
type: Property
range: Resource
domain: Resource

Preparation step
subclass of: Resource
type: Class
subclass of: http://lodlaundromat.org/.well-known/genid/12811acf10ce267d4572f8314a56f0f4#7
comment: Discrete stage in specimen-preparation process
notation: com.hp.hpl.jena.datatypes.BaseDatatype$TypedValue@e1eaeda8
subclass of: http://lodlaundromat.org/.well-known/genid/12811acf10ce267d4572f8314a56f0f4#5
subclass of: http://lodlaundromat.org/.well-known/genid/12811acf10ce267d4572f8314a56f0f4#6
subclass of: Thing
comment: In many applications, specimen preparation procedures are applied to the material prior to its use in an observation. The class PreparationStep (Figure 13) shall link an SF_Specimen to an SF_Process that describes a phase of the specimen preparation.

http://lodlaundromat.org/.well-known/genid/12811acf10ce267d4572f8314a56f0f4#10
subclass of: Resource
subclass of: Thing
type: Class
type: Restriction
min cardinality: 0
on property: related observation

Location
subclass of: Resource
subclass of: Thing
type: Class
comment: Location, expressed as either a spatial object or geographic identifier
union of: http://lodlaundromat.org/.well-known/genid/12811acf10ce267d4572f8314a56f0f4#3
notation: com.hp.hpl.jena.datatypes.BaseDatatype$TypedValue@9edfdb9e

related observation
range: Thing
domain: Thing
type: ObjectProperty
domain: AnyFeature
range: Observation
definition: Sampling features are distinctive compared with other features from application domains by having navigable associations to observations. If present, the association Design shall link the SF_SamplingFeature to an OM_Observation that was made utilizing the sampling feature, and the description of the sampling feature provides an intrinsic element of the observation protocol, along with the observation procedure (7.2.2) and the decomposition of the domain geometry in the case of a coverage-valued result (8.3.2). The OM_Observation has the role relatedObservation with respect to the sampling feature. Multiple observations may be made on a single sampling feature.
type: Property
range: Resource
range: Not a sampling feature
range: AnyFeature
domain: Resource

Sampling feature collection
subclass of: Resource
subclass of: Thing
type: Class
comment: Collection of sampling features
comment: The class SF_SamplingFeatureCollection (Figure 9) is an instance of the «metaclass» GF_FeatureType (ISO 19109), which therefore represents a feature type. SF_SamplingFeatureCollection shall support one association.
subclass of: AnyFeature
subclass of: http://lodlaundromat.org/.well-known/genid/12811acf10ce267d4572f8314a56f0f4#13
notation: com.hp.hpl.jena.datatypes.BaseDatatype$TypedValue@44d20e4a

Specimen
subclass of: Resource
type: Class
subclass of: Thing
subclass of: http://lodlaundromat.org/.well-known/genid/12811acf10ce267d4572f8314a56f0f4#23
subclass of: http://lodlaundromat.org/.well-known/genid/12811acf10ce267d4572f8314a56f0f4#24
subclass of: http://lodlaundromat.org/.well-known/genid/12811acf10ce267d4572f8314a56f0f4#22
subclass of: http://lodlaundromat.org/.well-known/genid/12811acf10ce267d4572f8314a56f0f4#28
subclass of: http://lodlaundromat.org/.well-known/genid/12811acf10ce267d4572f8314a56f0f4#27
subclass of: Sampling Feature
comment: A Specimen is a physical sample, obtained for observation(s) normally carried out ex-situ, sometimes in a laboratory.
notation: com.hp.hpl.jena.datatypes.BaseDatatype$TypedValue@77aca3df
subclass of: http://lodlaundromat.org/.well-known/genid/12811acf10ce267d4572f8314a56f0f4#26
subclass of: http://lodlaundromat.org/.well-known/genid/12811acf10ce267d4572f8314a56f0f4#25
subclass of: http://lodlaundromat.org/.well-known/genid/12811acf10ce267d4572f8314a56f0f4#12
subclass of: http://lodlaundromat.org/.well-known/genid/12811acf10ce267d4572f8314a56f0f4#11
subclass of: http://lodlaundromat.org/.well-known/genid/12811acf10ce267d4572f8314a56f0f4#9
subclass of: http://lodlaundromat.org/.well-known/genid/12811acf10ce267d4572f8314a56f0f4#10
subclass of: AnyFeature

http://lodlaundromat.org/.well-known/genid/12811acf10ce267d4572f8314a56f0f4#9
subclass of: Resource
subclass of: Thing
type: Class
type: Restriction
max cardinality: 1
on property: lineage

http://lodlaundromat.org/.well-known/genid/12811acf10ce267d4572f8314a56f0f4#26
subclass of: Resource
subclass of: Thing
type: Class
type: Restriction
max cardinality: 1
on property: sampling method

Not a sampling feature
subclass of: Resource
subclass of: Thing
type: Class
comment: Complement of SamplingFeature
subclass of: AnyFeature
disjoint with: Sampling Feature

positional accuracy
range: Thing
domain: Thing
type: ObjectProperty
domain: AnyFeature
range: PositionalAccuracy
definition: Positioning metadata is commonly associated with sampling features defined in the context of field surveys. If present, positionalAccuracy:DQ_PositionalAccuracy shall describe the accuracy of the positioning of the sampling feature. Up to two instances of the attribute support the independent description of horizontal and vertical accuracy.
type: Property
range: Resource
domain: Resource

http://lodlaundromat.org/.well-known/genid/12811acf10ce267d4572f8314a56f0f4#13
type: Class
subclass of: Thing
subclass of: Resource
type: Restriction
min cardinality: 1
on property: member sampling feature

Sampling process
subclass of: Thing
subclass of: Resource
type: Class
comment: In many applications, specimen preparation procedures are applied to the material prior to its use in an observation. The class PreparationStep (Figure 13) shall link an SF_Specimen to an SF_Process that describes a phase of the specimen preparation.
comment: Process involved in sampling. This may include specimen retrieval or processing, surveying a spatial sampling feature, excavation to provide access to a sampling feature, or any other process whose outcome is a new sampling feature.
subclass of: AnyFeature
subclass of: Not a sampling feature
disjoint with: Process
notation: com.hp.hpl.jena.datatypes.BaseDatatype$TypedValue@702ebc28

http://lodlaundromat.org/.well-known/genid/12811acf10ce267d4572f8314a56f0f4#21
subclass of: Resource
subclass of: Thing
type: Class
type: Restriction
min cardinality: 0
on property: hosted procedure or instrument

material class
range: Thing
domain: Thing
type: ObjectProperty
domain: AnyFeature
definition: The attribute materialClass:GenericName shall provide a basic classification of the material type of the specimen. EXAMPLE Soil, water, rock, aqueous, liquid, tissue, vegetation, food.
type: Property
range: Resource
domain: Resource

Sampling feature complex
subclass of: Resource
type: Class
comment: Sampling features are frequently related to each other, as parts of complexes, through sub-sampling, and in other ways. If present, the association class SamplingFeatureComplex (Figure 9) shall link an SF_SamplingFeature to another SF_SamplingFeature.
comment: Set of sampling features related to each other in a specific and deliberate way.
subclass of: http://lodlaundromat.org/.well-known/genid/12811acf10ce267d4572f8314a56f0f4#14
subclass of: http://lodlaundromat.org/.well-known/genid/12811acf10ce267d4572f8314a56f0f4#15
subclass of: Thing
notation: com.hp.hpl.jena.datatypes.BaseDatatype$TypedValue@7d0d908a

preparation step
range: Thing
domain: Thing
type: ObjectProperty
domain: AnyFeature
range: Preparation step
type: Property
range: Resource
range: http://lodlaundromat.org/.well-known/genid/12811acf10ce267d4572f8314a56f0f4#7
range: http://lodlaundromat.org/.well-known/genid/12811acf10ce267d4572f8314a56f0f4#6
range: http://lodlaundromat.org/.well-known/genid/12811acf10ce267d4572f8314a56f0f4#5
domain: Resource

Sampling curve
subclass of: Thing
subclass of: Resource
type: Class
comment: Spatial sampling feature whose shape is a 1-D manifold (Curve)
subclass of: Spatial sampling feature
subclass of: http://lodlaundromat.org/.well-known/genid/12811acf10ce267d4572f8314a56f0f4#8
notation: com.hp.hpl.jena.datatypes.BaseDatatype$TypedValue@4b43c077
subclass of: http://lodlaundromat.org/.well-known/genid/12811acf10ce267d4572f8314a56f0f4#19
subclass of: http://lodlaundromat.org/.well-known/genid/12811acf10ce267d4572f8314a56f0f4#12
subclass of: http://lodlaundromat.org/.well-known/genid/12811acf10ce267d4572f8314a56f0f4#21
subclass of: http://lodlaundromat.org/.well-known/genid/12811acf10ce267d4572f8314a56f0f4#10
subclass of: http://lodlaundromat.org/.well-known/genid/12811acf10ce267d4572f8314a56f0f4#11
subclass of: http://lodlaundromat.org/.well-known/genid/12811acf10ce267d4572f8314a56f0f4#20
subclass of: http://lodlaundromat.org/.well-known/genid/12811acf10ce267d4572f8314a56f0f4#9
subclass of: AnyFeature
subclass of: Sampling Feature

Sampling Feature
subclass of: Resource
subclass of: Thing
type: Class
subclass of: http://lodlaundromat.org/.well-known/genid/12811acf10ce267d4572f8314a56f0f4#9
comment: Feature on which observations may be made, that is intended to be representative of a different (usually larger) feature that is not fully accessible for some reason.
subclass of: http://lodlaundromat.org/.well-known/genid/12811acf10ce267d4572f8314a56f0f4#11
notation: com.hp.hpl.jena.datatypes.BaseDatatype$TypedValue@25f02b48
subclass of: http://lodlaundromat.org/.well-known/genid/12811acf10ce267d4572f8314a56f0f4#10
comment: Sampling features are artefacts of an observational strategy, and have no significant function outside of their role in the observation process. The physical characteristics of the features themselves are of little interest, except perhaps to the manager of a sampling campaign. EXAMPLE A “station” is essentially an identifiable locality where a sensor system or procedure may be deployed and an observation made. In the context of the observation model, it connotes the “world in the vicinity of the station”, so the observed properties relate to the physical medium at the station, and not to any physical artefact such as a mooring, buoy, benchmark, monument, well, etc. NOTE A transient sampling feature, such as a ships-track or flight-line, might be identified and described, but is unlikely to be revisited exactly. A sampling feature is intended to sample some feature-of-interest in an application domain. However, in some cases the identity, and even the exact type, of the sampled feature may not be known when observations are made using the sampling features.
subclass of: http://lodlaundromat.org/.well-known/genid/12811acf10ce267d4572f8314a56f0f4#12
disjoint with: Not a sampling feature
subclass of: AnyFeature

http://lodlaundromat.org/.well-known/genid/12811acf10ce267d4572f8314a56f0f4#7
subclass of: Resource
subclass of: Thing
type: Class
type: Restriction
on class: Sampling process
on property: processing details
qualified cardinality: 1

http://lodlaundromat.org/.well-known/genid/12811acf10ce267d4572f8314a56f0f4#24
subclass of: Resource
subclass of: Thing
type: Class
type: Restriction
max cardinality: 1
on property: current location

spatial sampling feature shape
range: Thing
domain: Thing
type: ObjectProperty
domain: AnyFeature
range: Object
definition: The association Geometry shall link an SF_SpatialSamplingFeature to a GM_Object that describes its shape.
type: Property
range: Resource
range: Location
domain: Resource

http://lodlaundromat.org/.well-known/genid/12811acf10ce267d4572f8314a56f0f4#11
subclass of: Resource
subclass of: Thing
type: Class
type: Restriction
min cardinality: 0
on property: sampling feature complex

http://lodlaundromat.org/.well-known/genid/12811acf10ce267d4572f8314a56f0f4#19
type: Class
subclass of: Thing
subclass of: Resource
type: Restriction
cardinality: 1
on property: spatial sampling feature shape

member sampling feature
range: Thing
domain: Thing
type: ObjectProperty
domain: AnyFeature
range: Sampling Feature
definition: The association Collection shall link an SF_SamplingFeatureCollection to member SF_SamplingFeatures.
type: Property
range: Resource
range: http://lodlaundromat.org/.well-known/genid/12811acf10ce267d4572f8314a56f0f4#10
range: AnyFeature
range: http://lodlaundromat.org/.well-known/genid/12811acf10ce267d4572f8314a56f0f4#12
range: http://lodlaundromat.org/.well-known/genid/12811acf10ce267d4572f8314a56f0f4#9
range: http://lodlaundromat.org/.well-known/genid/12811acf10ce267d4572f8314a56f0f4#11
domain: Resource

sampling feature parameter
range: Thing
domain: Thing
sub property of: parameter
type: ObjectProperty
domain: AnyFeature
equivalent property: parameter
definition: the attribute parameter:NamedValue shall describe an arbitrary parameter associated with the SF_SamplingFeature. This might be a parameter that qualifies the interaction with the sampled feature, or an environmental parameter associated with the sampling process.
type: Property
domain: Resource
range: Resource

Sampling solid
type: Class
subclass of: Resource
subclass of: Thing
comment: Spatial sampling feature whose shape is a 3-D manifold (Solid)
subclass of: Spatial sampling feature
subclass of: http://lodlaundromat.org/.well-known/genid/12811acf10ce267d4572f8314a56f0f4#17
notation: com.hp.hpl.jena.datatypes.BaseDatatype$TypedValue@4a6165b3
subclass of: http://lodlaundromat.org/.well-known/genid/12811acf10ce267d4572f8314a56f0f4#20
subclass of: http://lodlaundromat.org/.well-known/genid/12811acf10ce267d4572f8314a56f0f4#11
subclass of: http://lodlaundromat.org/.well-known/genid/12811acf10ce267d4572f8314a56f0f4#19
subclass of: Sampling Feature
subclass of: http://lodlaundromat.org/.well-known/genid/12811acf10ce267d4572f8314a56f0f4#9
subclass of: http://lodlaundromat.org/.well-known/genid/12811acf10ce267d4572f8314a56f0f4#12
subclass of: http://lodlaundromat.org/.well-known/genid/12811acf10ce267d4572f8314a56f0f4#21
subclass of: http://lodlaundromat.org/.well-known/genid/12811acf10ce267d4572f8314a56f0f4#10
subclass of: AnyFeature

http://lodlaundromat.org/.well-known/genid/12811acf10ce267d4572f8314a56f0f4#27
subclass of: Resource
subclass of: Thing
type: Class
type: Restriction
max cardinality: 1
on property: specimen size

Sampling point
subclass of: Thing
type: Class
subclass of: Resource
comment: Spatial sampling feature whose shape is a 0-D manifold (Point)
subclass of: Spatial sampling feature
subclass of: http://lodlaundromat.org/.well-known/genid/12811acf10ce267d4572f8314a56f0f4#16
notation: com.hp.hpl.jena.datatypes.BaseDatatype$TypedValue@4a9fb496
subclass of: http://lodlaundromat.org/.well-known/genid/12811acf10ce267d4572f8314a56f0f4#19
subclass of: http://lodlaundromat.org/.well-known/genid/12811acf10ce267d4572f8314a56f0f4#21
subclass of: http://lodlaundromat.org/.well-known/genid/12811acf10ce267d4572f8314a56f0f4#20
subclass of: http://lodlaundromat.org/.well-known/genid/12811acf10ce267d4572f8314a56f0f4#10
subclass of: http://lodlaundromat.org/.well-known/genid/12811acf10ce267d4572f8314a56f0f4#11
subclass of: http://lodlaundromat.org/.well-known/genid/12811acf10ce267d4572f8314a56f0f4#12
subclass of: http://lodlaundromat.org/.well-known/genid/12811acf10ce267d4572f8314a56f0f4#9
subclass of: Sampling Feature
subclass of: AnyFeature

sampled feature
range: Thing
domain: Thing
type: ObjectProperty
domain: AnyFeature
range: Not a sampling feature
definition: A sampling feature is established in order to make observations concerning some domain feature. The association Intention shall link the SF_SamplingFeature to the feature which the sampling feature was designed to sample. The target of this association has the role sampledFeature with respect to the sampling feature, and shall not be a sampling feature or observation. It is usually a real-world feature from an application domain (Figures 5 and 10). EXAMPLE A profile typically samples a water- or atmospheric-column; a well samples the water in an aquifer; a tissue specimen samples a part of an organism.
type: Property
range: Resource
range: AnyFeature
domain: Resource

http://lodlaundromat.org/.well-known/genid/12811acf10ce267d4572f8314a56f0f4#14
subclass of: Resource
subclass of: Thing
type: Class
type: Restriction
cardinality: 1
on property: role

Spatial sampling feature
subclass of: Resource
subclass of: Thing
type: Class
subclass of: Sampling Feature
comment: Sampling feature whose defining characteristic is that it samples the intended feature by geometric subsetting.
subclass of: http://lodlaundromat.org/.well-known/genid/12811acf10ce267d4572f8314a56f0f4#20
subclass of: http://lodlaundromat.org/.well-known/genid/12811acf10ce267d4572f8314a56f0f4#21
notation: com.hp.hpl.jena.datatypes.BaseDatatype$TypedValue@e0d8bebc
comment: When observations are made to estimate properties of a geospatial feature, in particular where the value of a property varies within the scope of the feature, a spatial sampling feature is used. Depending on accessibility and on the nature of the expected property variation, the sampling feature may be extensive in one, two or three spatial dimensions. Processing and visualization methods are often dependent on the topological dimension of the sampling manifold, so this provides a natural classification system for sampling features. This classification follows common practice in focussing on conventional spatial dimensions. Properties observed on sampling features may be time-dependent, but the temporal axis does not generally contribute to the classification of sampling feature classes. Sampling feature identity is usually less time-dependent than the property value.
subclass of: http://lodlaundromat.org/.well-known/genid/12811acf10ce267d4572f8314a56f0f4#19
subclass of: http://lodlaundromat.org/.well-known/genid/12811acf10ce267d4572f8314a56f0f4#12
subclass of: http://lodlaundromat.org/.well-known/genid/12811acf10ce267d4572f8314a56f0f4#10
subclass of: http://lodlaundromat.org/.well-known/genid/12811acf10ce267d4572f8314a56f0f4#9
subclass of: http://lodlaundromat.org/.well-known/genid/12811acf10ce267d4572f8314a56f0f4#11
subclass of: AnyFeature

http://lodlaundromat.org/.well-known/genid/12811acf10ce267d4572f8314a56f0f4#5
subclass of: Resource
subclass of: Thing
type: Class
type: Restriction
max qualified cardinality: 1
on class: ResponsibleParty
on property: process operator

Sampling surface
subclass of: Thing
type: Class
subclass of: Resource
comment: Spatial sampling feature whose shape is a 2-D manifold (Surface)
subclass of: Spatial sampling feature
subclass of: http://lodlaundromat.org/.well-known/genid/12811acf10ce267d4572f8314a56f0f4#18
notation: com.hp.hpl.jena.datatypes.BaseDatatype$TypedValue@7218bcf1
subclass of: http://lodlaundromat.org/.well-known/genid/12811acf10ce267d4572f8314a56f0f4#11
subclass of: http://lodlaundromat.org/.well-known/genid/12811acf10ce267d4572f8314a56f0f4#12
subclass of: http://lodlaundromat.org/.well-known/genid/12811acf10ce267d4572f8314a56f0f4#19
subclass of: http://lodlaundromat.org/.well-known/genid/12811acf10ce267d4572f8314a56f0f4#21
subclass of: http://lodlaundromat.org/.well-known/genid/12811acf10ce267d4572f8314a56f0f4#10
subclass of: http://lodlaundromat.org/.well-known/genid/12811acf10ce267d4572f8314a56f0f4#20
subclass of: http://lodlaundromat.org/.well-known/genid/12811acf10ce267d4572f8314a56f0f4#9
subclass of: Sampling Feature
subclass of: AnyFeature

http://lodlaundromat.org/.well-known/genid/12811acf10ce267d4572f8314a56f0f4#22
type: Class
subclass of: Resource
subclass of: Thing
type: Restriction
cardinality: 1
on property: material class

related sampling feature
range: Thing
domain: Thing
type: ObjectProperty
domain: AnyFeature
range: Sampling Feature
type: Property
range: Resource
range: http://lodlaundromat.org/.well-known/genid/12811acf10ce267d4572f8314a56f0f4#10
range: AnyFeature
range: http://lodlaundromat.org/.well-known/genid/12811acf10ce267d4572f8314a56f0f4#12
range: http://lodlaundromat.org/.well-known/genid/12811acf10ce267d4572f8314a56f0f4#9
range: http://lodlaundromat.org/.well-known/genid/12811acf10ce267d4572f8314a56f0f4#11
domain: Resource

specimen size
range: Thing
domain: Thing
type: ObjectProperty
domain: AnyFeature
sub property of: measure
definition: the attribute size:Measure shall describe a physical extent of the specimen. This may be length, mass, volume, etc., as appropriate for the specimen instance and its material class.
type: Property
range: Resource
domain: Resource

hosted procedure or instrument
range: Thing
domain: Thing
type: ObjectProperty
domain: AnyFeature
range: Process
definition: A common role for a spatial sampling feature is to host instruments or procedures deployed repetitively or permanently. If present, the association Platform shall link the SF_SpatialSamplingFeature to an OM_Process deployed at it. The OM_Process has the role hostedProcedure with respect to the sampling feature.
type: Property
range: Resource
range: Not a sampling feature
range: AnyFeature
domain: Resource

OWL representation of ISO 19156 Sampling Features model
has part: sampling time
type: Ontology
has part: member sampling feature
has part: Preparation step
has part: sampled feature
has part: Sampling process
has part: material class
has part: preparation step
has part: sampling location
has part: positional accuracy
comment: An OWL representation of the Sampling Features Schema described in clauses 8-10 of ISO 19156:2011 Geographic Information - Observations and Measurements. This vocabulary is provisional, pending finalization of ISO 19150-2. NOTE: The URI stem http://def.seegrid.csiro.au/isotc211/ is temporary. The vocabulary is expected to be ultimately published in the domain http://def.isotc211.org/
has part: role
description: An OWL representation of the Sampling Features Schema described in clauses 8-10 of ISO 19156:2011 Geographic Information - Observations and Measurements
has part: related sampling feature
has part: specimen size
has part: spatial sampling feature shape
has part: Sampling point
has part: sampling feature parameter
version IRI: sampling.rdf
imports: geometry
has part: Sampling surface
has part: Not a sampling feature
has part: Spatial sampling feature
preferred namespace uri: http://def.seegrid.csiro.au/isotc211/iso19156/2011/sampling#
has part: hosted procedure or instrument
has part: processing details
creator: com.hp.hpl.jena.datatypes.BaseDatatype$TypedValue@f965ffca
imports: basic
imports: observation
created: 2012-01-19T00:00:00
has part: process operator
has part: lineage
has part: Specimen
imports: dataquality
license: http://creativecommons.org/licenses/by/3.0/
type: Vocabulary
source: ISO 19156:2011
prior version: sampling.rdf
imports: temporal
has part: current location
has part: sampling method
has part: Sampling curve
has part: Location
preferred namespace prefix: sam
has part: sampling feature complex
has part: Sampling feature collection
has part: Sampling feature complex
has part: Sampling Feature
has part: specimen type
modified: 2013-11-14T00:00:00
has part: preparation step time
has part: Sampling solid
has part: related observation