Base64 content
subclass of: Resource
subclass of: Thing
type: Class
comment: The base64 encoded content (can be used for binary content).
subclass of: Content

XML version
range: Thing
domain: Thing
type: Property
type: ObjectProperty
comment: The XML version declared in the XML declaration.
domain: XML content
range: Literal
range: Resource
domain: Resource
domain: Content

Document type declaration
range: Thing
domain: Thing
type: Property
type: ObjectProperty
comment: The document type declaration.
domain: XML content
range: Document type declaration
range: Resource
domain: Resource
domain: Content

Public ID
range: Thing
domain: Thing
type: Property
type: ObjectProperty
comment: The document type declarations's public identifier.
domain: Document type declaration
range: Literal
range: Resource
domain: Resource

Base64 encoded byte sequence
range: Thing
domain: Thing
type: Property
type: ObjectProperty
comment: The Base64 encoded byte sequence of the content.
domain: Base64 content
range: base64Binary
range: Resource
domain: Resource
domain: Content

XML rest
range: Thing
domain: Thing
type: Property
type: ObjectProperty
comment: The XML content following the document type declaration.
domain: XML content
range: XMLLiteral
range: Resource
domain: Resource
domain: Content

Document type name
range: Thing
domain: Thing
type: Property
type: ObjectProperty
comment: The document type name.
domain: Document type declaration
range: Literal
range: Resource
domain: Resource

Character encoding
range: Thing
domain: Thing
type: Property
type: ObjectProperty
comment: The character encoding used to create a character sequence from a byte sequence or vice versa.
domain: Content
range: Literal
range: Resource
domain: Resource

Document type declaration
subclass of: Resource
subclass of: Thing
type: Class
comment: The document type declaration.

Text content
subclass of: Resource
subclass of: Thing
type: Class
comment: The text content (can be used for text content).
subclass of: Content

Internal DTD subset
range: Thing
domain: Thing
type: Property
type: ObjectProperty
comment: The internal document type definition subset within the document type declarations.
domain: Document type declaration
range: Literal
range: Resource
domain: Resource

XML leading misc
range: Thing
domain: Thing
type: Property
type: ObjectProperty
comment: The XML content preceding the document type declaration.
domain: XML content
range: XMLLiteral
range: Resource
domain: Resource
domain: Content

XML content
subclass of: Resource
subclass of: Thing
type: Class
comment: The XML content (can only be used for XML-wellformed content).
subclass of: Content

XML character encoding
range: Thing
domain: Thing
type: Property
type: ObjectProperty
comment: The character encoding declared in the XML declaration.
domain: XML content
range: Literal
range: Resource
domain: Resource
domain: Content

System ID
range: Thing
domain: Thing
type: Property
type: ObjectProperty
comment: The document type declarations's system identifier (typed: xsd:anyURI)
domain: Document type declaration
range: anyURI
range: Resource
domain: Resource

Content
subclass of: Resource
subclass of: Thing
type: Class
comment: The content.

Character sequence
range: Thing
domain: Thing
type: Property
type: ObjectProperty
comment: The character sequence of the text content.
domain: Text content
range: Literal
range: Resource
domain: Content
domain: Resource

XML standalone document declaration
range: Thing
domain: Thing
type: Property
type: ObjectProperty
comment: The standalone declaration in the XML declaration.
domain: XML content
range: Literal
range: Resource
domain: Resource
domain: Content

Representing Content in RDF
type: Ontology
comment: Representing Content in RDF as defined by http://www.w3.org/TR/Content-in-RDF/
imports: terms
version info: Working Draft 29 April 2011