image-data
type: Class
subclass of: Restriction
  on property: plays
  cardinality: 1

aggregation
type: Class
comment: Corrresponds to the "aggregation" attribute of the "GoFGoPColorType" (part 3, page 56). The value of the "aggregation" is a string of {Intersection Median Average}
subclass of: gof-gop-color-descriptor-parameter
subclass of: aggregation-enumeration

aggregation-enumeration
type: Class
comment: the string of {Median Intersection Average}
subclass of: enumeration
subclass of: Class
  one of: aggregation-median
  one of: aggregation-average
  one of: aggregation-intersection

average-texture
type: Class
comment: Corrresponds to the "Average" element of the "HomogeneousTextureType" (part 3, page 59)
subclass of: homogeneous-texture-descriptor-parameter
subclass of: unsigned-8

bin-counts
type: Class
comment: Corrresponds to the "BinCounts" element of the "EdgeHistogramType" (part 3, page 64)
subclass of: edge-histogram-descriptor-parameter
subclass of: unsigned-3-vector-dim-80

bits-per-bin
type: Class
comment: Corrresponds to the "bitsPerBin" attribute of the "Shape3DType" (part 3, page 72)
subclass of: shape-3d-descriptor-parameter
subclass of: unsigned-4

camera-follows
type: Class
comment: Corrresponds to the "cameraFollows" attribute of the "MotionTrjectoryType" (part 3, page 81)
subclass of: boolean
subclass of: motion-trajectory-descriptor-parameter

camera-motion-descriptor
type: Class
comment: Corresponds to the "CameraMotionType", specified in part 3, page 73-81
subclass of: motion-descriptor
subclass of: Restriction
  on property: about
  all values from: camera-motion-segment-descriptor
subclass of: digital-data

camera-motion-segment-descriptor
type: Class
comment: Corresponds to the local complex type which consits of two local complex types of the "CameraMotionSegmentType", specified in part 3, page 44 - 46.
subclass of: nested-visual-descriptor
subclass of: digital-data

cbac-coefficient-14
type: Class
comment: Corrresponds to the "CbACCoeff14” element of the "ColorLayoutType" (part 3, page 45)
subclass of: cbac-crac-coefficient-14-descriptor-parameter
subclass of: unsigned-5-vector-dim-14

cbac-coefficient-2
type: Class
comment: Corrresponds to the "CbACCoeff2” element of the "ColorLayoutType" (part 3, page 44)
subclass of: cbac-crac-coefficient-2-descriptor-parameter
subclass of: unsigned-5-vector-dim-2

cbac-coefficient-20
type: Class
comment: Corrresponds to the "CrACCoeff20” element of the "ColorLayoutType" (part 3, page 45-46)
subclass of: unsigned-5-vector-dim-20
subclass of: cbac-crac-coefficient-20-descriptor-parameter

cbac-coefficient-27
type: Class
comment: Corrresponds to the "CrACCoeff27” element of the "ColorLayoutType" (part 3, page 46)
subclass of: cbac-crac-coefficient-27-descriptor-parameter
subclass of: unsigned-5-vector-dim-27

cbac-coefficient-5
type: Class
comment: Corrresponds to the "CrACCoeff5” element of the "ColorLayoutType" (part 3, page 44-45)
subclass of: cbac-crac-coefficient-5-descriptor-parameter
subclass of: unsigned-5-vector-dim-5

cbac-coefficient-63
type: Class
comment: Corrresponds to the "CrACCoeff63” element of the "ColorLayoutType" (part 3, page 46)
subclass of: cbac-crac-coefficient-63-descriptor-parameter
subclass of: unsigned-5-vector-dim-63

cbac-coefficient-9
type: Class
comment: Corrresponds to the "CrACCoeff9” element of the "ColorLayoutType" (part 3, page 45)
subclass of: cbac-crac-coefficient-9-descriptor-parameter
subclass of: unsigned-5-vector-dim-9

cbac-crac-coefficient-14-descriptor
type: Class
comment: Corresponds to the local complex type of one choice element of the "ColorLayoutType", specified in part 3, page 45.
subclass of: Restriction
  on property: about
  all values from: cbac-crac-coefficient-14-descriptor-parameter
subclass of: digital-data
subclass of: cbac-crac-coefficient-descriptor

cbac-crac-coefficient-descriptor
type: Class
comment: Corresponds to the local complex type which consits of further seven local complex types of one choice element of the "ColorLayoutType", specified in part 3, page 44 - 46.
subclass of: nested-visual-descriptor
subclass of: digital-data

cbac-crac-coefficient-2-descriptor
type: Class
comment: Corresponds to the local complex type of one choice element of the "ColorLayoutType", specified in part 3, page 44.
subclass of: Restriction
  on property: about
  all values from: cbac-crac-coefficient-2-descriptor-parameter
subclass of: digital-data
subclass of: cbac-crac-coefficient-descriptor

cbac-crac-coefficient-20-descriptor
type: Class
comment: Corresponds to the local complex type of one choice element of the "ColorLayoutType", specified in part 3, page 45-46.
subclass of: Restriction
  on property: about
  all values from: cbac-crac-coefficient-20-descriptor-parameter
subclass of: digital-data
subclass of: cbac-crac-coefficient-descriptor

cbac-crac-coefficient-27-descriptor
type: Class
comment: Corresponds to the local complex type of one choice element of the "ColorLayoutType", specified in part 3, page 46.
subclass of: Restriction
  on property: about
  all values from: cbac-crac-coefficient-27-descriptor-parameter
subclass of: digital-data
subclass of: cbac-crac-coefficient-descriptor

cbac-crac-coefficient-5-descriptor
type: Class
comment: Corresponds to the local complex type of one choice element of the "ColorLayoutType", specified in part 3, page 44 - 45.
subclass of: Restriction
  on property: about
  all values from: cbac-crac-coefficient-5-descriptor-parameter
subclass of: digital-data
subclass of: cbac-crac-coefficient-descriptor

cbac-crac-coefficient-63-descriptor
type: Class
comment: Corresponds to the local complex type of one choice element of the "ColorLayoutType", specified in part 3, page 46.
subclass of: Restriction
  on property: about
  all values from: cbac-crac-coefficient-63-descriptor-parameter
subclass of: digital-data
subclass of: cbac-crac-coefficient-descriptor

cbac-crac-coefficient-9-descriptor
type: Class
comment: Corresponds to the local complex type of one choice element of the "ColorLayoutType", specified in part 3, page 45.
subclass of: digital-data
subclass of: cbac-crac-coefficient-descriptor
subclass of: Restriction
  on property: about
  all values from: cbac-crac-coefficient-9-descriptor-parameter

cbdc-coefficient
type: Class
comment: Corrresponds to the "CbDCCoeff” element of the "ColorLayoutType" (part 3, page 43)
subclass of: unsigned-6
subclass of: color-layout-descriptor-parameter

color-component
type: Class
comment: Corrresponds to the "Component" element of the "ColorQuantizationType" (part 3, page 33 -34). The value of the "aggregation" is a string of {B R Max Sum H V G Min S Cr Y Diff Cb }
subclass of: color-component-enumeration
subclass of: color-quantization-component-descriptor-parameter

color-component-enumeration
type: Class
comment: the string of {B R Max Sum H V G Min S Cr Y Diff Cb }
subclass of: Class
  one of: color-component-g
  one of: color-component-max
  one of: color-component-b
  one of: color-component-s
  one of: color-component-y
  one of: color-component-h
  one of: color-component-diff
  one of: color-component-sum
  one of: color-component-v
  one of: color-component-cb
  one of: color-component-cr
  one of: color-component-r
  one of: color-component-min
subclass of: enumeration

color-index
type: Class
comment: Corrresponds to the "Index" element of the "DominantColorType" (part 3, page 35)
subclass of: dominant-color-value-descriptor-parameter
subclass of: unsigned-12-vector-dim-3

color-layout-descriptor
type: Class
comment: Corresponds to the "ColorLayoutType", specified in part 3, page 42 - 50
subclass of: color-descriptor
subclass of: Restriction
  on property: about
  all values from: Class
    union of: yac-coefficient-descriptor
    union of: cbac-crac-coefficient-descriptor
    union of: color-layout-descriptor-parameter
subclass of: digital-data

yac-coefficient-descriptor
type: Class
comment: Corresponds to the local complex type which consits of further seven local complex types of one choice element of the "ColorLayoutType", specified in part 3, page 44 - 46.
subclass of: nested-visual-descriptor
subclass of: digital-data

color-percentage
type: Class
comment: Corrresponds to the "Percentage" element of the "DominantColorType" (part 3, page 35)
subclass of: unsigned-5
subclass of: dominant-color-value-descriptor-parameter

color-quantization
type: Class
comment: Corrresponds to the "colorQuant" attribute of the "ColorStructureType" (part 3, page 51)
subclass of: unsigned-3
subclass of: color-structure-descriptor-parameter

color-quantization-component-descriptor
type: Class
comment: Corresponds to the local complex type which consits of the two elements "Component" and "NumOfBins" of the "ColorQuantizationType", specified in part 3, page 33 - 34.
subclass of: Restriction
  on property: about
  all values from: color-quantization-component-descriptor-parameter
subclass of: nested-visual-descriptor
subclass of: digital-data

color-quantization-descriptor
type: Class
comment: Corresponds to the "ColorQuantizationType", specified in part 3, page 33 - 34.
subclass of: Restriction
  on property: about
  all values from: color-quantization-component-descriptor
subclass of: nested-visual-descriptor
subclass of: digital-data

color-reference-flag
type: Class
comment: Corrresponds to the "colorReferenceFlag" element of the "ColorSpaceType" (part 3, page 30)
subclass of: color-space-descriptor-parameter
subclass of: boolean

color-space-descriptor
type: Class
comment: Corresponds to the "DominantColorType", specified in part 3, page 29 - 33.
subclass of: nested-visual-descriptor
subclass of: Restriction
  on property: about
  all values from: color-space-descriptor-parameter

color-space-transformation-matrix
type: Class
comment: Corrresponds to the "ColorTransMat" element of the "ColorSpaceType" (part 3, page 29 - 30)
subclass of: color-space-descriptor-parameter
subclass of: unsigned-16-matrix-dim-3-3

color-space-type
type: Class
comment: Corrresponds to the "type" element of the "ColorSpaceType" (part 3, page 30). The value of the "aggregation" is a string of {RGB HSV HMMD LinearMatrix YCbCr Monochrome }.
subclass of: color-space-descriptor-parameter
subclass of: color-space-type-enumeration

color-space-type-enumeration
type: Class
comment: the string of {RGB HSV HMMD LinearMatrix YCbCr Monochrome }
subclass of: Class
  one of: color-space-type-hsv
  one of: color-space-type-monochrome
  one of: color-space-type-hmmd
  one of: color-space-type-ycbcr
  one of: color-space-type-linearmatrix
  one of: color-space-type-rgb
subclass of: enumeration

color-structure-descriptor
type: Class
comment: Corresponds to the "ColorStructureType", specified in part 3, page 50 - 56.
subclass of: color-descriptor
subclass of: digital-data
subclass of: Restriction
  on property: about
  all values from: color-structure-descriptor-parameter

color-structure-values
type: Class
comment: Corrresponds to the "Values" element of the "ColorStructureType" (part 3, page 51)
subclass of: unsigned-8-vector-max-dim-256
subclass of: color-structure-descriptor-parameter

color-variance
type: Class
comment: Corrresponds to the "ColorVariance" element of the "DominantColorType" (part 3, page 35)
subclass of: unsigned-1-vector-dim-3
subclass of: dominant-color-value-descriptor-parameter

contour-shape-descriptor
type: Class
comment: Corresponds to the "ContourShapeType", specified in part 3, page 68-71
subclass of: Restriction
  on property: about
  all values from: Class
    union of: contour-shape-peak-descriptor
    union of: contour-shape-descriptor-parameter
subclass of: shape-descriptor
subclass of: digital-data

contour-shape-peak-descriptor
type: Class
comment: Corresponds to the "ContourShapeType", specified in part 3, page 68-71.
subclass of: nested-visual-descriptor
subclass of: Restriction
  on property: about
  all values from: contour-shape-peak-descriptor-parameter
subclass of: digital-data

crac-coefficient-14
type: Class
comment: Corrresponds to the "CrACCoeff14” element of the "ColorLayoutType" (part 3, page 45)
subclass of: cbac-crac-coefficient-14-descriptor-parameter
subclass of: unsigned-5-vector-dim-14

crac-coefficient-2
type: Class
comment: Corrresponds to the "CrACCoeff2” element of the "ColorLayoutType" (part 3, page 44)
subclass of: cbac-crac-coefficient-2-descriptor-parameter
subclass of: unsigned-5-vector-dim-2

crac-coefficient-20
type: Class
comment: Corrresponds to the "CrACCoeff20” element of the "ColorLayoutType" (part 3, page 45-46)
subclass of: unsigned-5-vector-dim-20
subclass of: cbac-crac-coefficient-20-descriptor-parameter

crac-coefficient-27
type: Class
comment: Corrresponds to the "CrACCoeff27” element of the "ColorLayoutType" (part 3, page 46)
subclass of: cbac-crac-coefficient-27-descriptor-parameter
subclass of: unsigned-5-vector-dim-27

crac-coefficient-5
type: Class
comment: Corrresponds to the "CrACCoeff5” element of the "ColorLayoutType" (part 3, page 44-45)
subclass of: cbac-crac-coefficient-5-descriptor-parameter
subclass of: unsigned-5-vector-dim-5

crac-coefficient-63
type: Class
comment: Corrresponds to the "CrACCoeff63” element of the "ColorLayoutType" (part 3, page 46)
subclass of: cbac-crac-coefficient-63-descriptor-parameter
subclass of: unsigned-5-vector-dim-63

crac-coefficient-9
type: Class
comment: Corrresponds to the "CrACCoeff9” element of the "ColorLayoutType" (part 3, page 45)
subclass of: cbac-crac-coefficient-9-descriptor-parameter
subclass of: unsigned-5-vector-dim-9

crdc-coefficient
type: Class
comment: Corrresponds to the "CrDCCoeff” element of the "ColorLayoutType" (part 3, page 43)
subclass of: unsigned-6
subclass of: color-layout-descriptor-parameter

dominant-color-descriptor
type: Class
comment: Corresponds to the "DominantColorType", specified in part 3, page 35 - 37
subclass of: Restriction
  on property: about
  all values from: Class
    union of: dominant-color-descriptor-parameter
    union of: color-quantization-descriptor
    union of: color-space-descriptor
    union of: dominant-color-value-descriptor
subclass of: color-descriptor
subclass of: digital-data

dominant-color-value-descriptor
type: Class
comment: Corresponds to the local complex type of the element "Value" of the "DominantColorType", specified in part 3, page 35 - 37.
subclass of: Restriction
  on property: about
  all values from: dominant-color-value-descriptor-parameter
subclass of: nested-visual-descriptor
subclass of: digital-data

dominant-direction
type: Class
comment: Corrresponds to the "DominantDirection" element of the "MotionActivityType" (part 3, page 87)
subclass of: unsigned-3
subclass of: motion-activity-descriptor-parameter

edge-histogram-descriptor
type: Class
comment: Corresponds to the "EdgeHistorgramType", specified in part 3, page 63-66
subclass of: Restriction
  on property: about
  all values from: edge-histogram-descriptor-parameter
subclass of: digital-data
subclass of: texture-descriptor

energy
type: Class
comment: Corrresponds to the "Energy" element of the "HomogeneousTextureType" (part 3, page 59)
subclass of: homogeneous-texture-descriptor-parameter
subclass of: unsigned-8-vector-dim-30

energy-deviation
type: Class
comment: Corrresponds to the "EnergyDerivation" element of the "HomogeneousTextureType" (part 3, page 59)
subclass of: homogeneous-texture-descriptor-parameter
subclass of: unsigned-8-vector-dim-30

focus-of-expansion-descriptor
type: Class
comment: Corrresponds to the local complex "FocusOfExpansionType" element of the "CameraMotionType" (part 3, page 74)
subclass of: nested-visual-descriptor
subclass of: Restriction
  on property: about
  all values from: focus-of-expansion-descriptor-parameter
subclass of: digital-data

fractional-boom-down
type: Class
comment: Corrresponds to the "BoomDown" element of the local comlex type "FractionalPresenceType" (part 3, page 74)
subclass of: fractional-presence-descriptor-parameter
subclass of: unsigned-7

fractional-boom-up
type: Class
comment: Corrresponds to the "BoomUp" element of the local comlex type "FractionalPresenceType" (part 3, page 74)
subclass of: fractional-presence-descriptor-parameter
subclass of: unsigned-7

fractional-dolly-backward
type: Class
comment: Corrresponds to the "DollyBackward" element of the local comlex type "FractionalPresenceType" (part 3, page 74)
subclass of: fractional-presence-descriptor-parameter
subclass of: unsigned-7

fractional-dolly-forward
type: Class
comment: Corrresponds to the "DollyForward" element of the local comlex type "FractionalPresenceType" (part 3, page 74)
subclass of: fractional-presence-descriptor-parameter
subclass of: unsigned-7

fractional-fixed
type: Class
comment: Corrresponds to the "Fixed" element of the local comlex type "FractionalPresenceType" (part 3, page 74)
subclass of: fractional-presence-descriptor-parameter
subclass of: unsigned-7

fractional-pan-left
type: Class
comment: Corrresponds to the "PanLeft" element of the local comlex type "FractionalPresenceType" (part 3, page 74)
subclass of: fractional-presence-descriptor-parameter
subclass of: unsigned-7

fractional-pan-right
type: Class
comment: Corrresponds to the "PanRight" element of the local comlex type "FractionalPresenceType" (part 3, page 74)
subclass of: fractional-presence-descriptor-parameter
subclass of: unsigned-7

fractional-presence-descriptor
type: Class
comment: Corrresponds to the local complex "FractioanlPresence" element of the "MixtureCameraMotionSegmentType" (part 3, page 74)
subclass of: nested-visual-descriptor
subclass of: Restriction
  on property: about
  all values from: fractional-presence-descriptor-parameter
subclass of: digital-data

fractional-roll-anti-clockwise
type: Class
comment: Corrresponds to the "RollAntiClockwise" element of the local comlex type "FractionalPresenceType" (part 3, page 74)
subclass of: fractional-presence-descriptor-parameter
subclass of: unsigned-7

fractional-roll-clockwise
type: Class
comment: Corrresponds to the "RollClockwise" element of the local comlex type "FractionalPresenceType" (part 3, page 74)
subclass of: fractional-presence-descriptor-parameter
subclass of: unsigned-7

fractional-tilt-down
type: Class
comment: Corrresponds to the "TiltDown" element of the local comlex type "FractionalPresenceType" (part 3, page 74)
subclass of: fractional-presence-descriptor-parameter
subclass of: unsigned-7

fractional-tilt-up
type: Class
comment: Corrresponds to the "TiltUp" element of the local comlex type "FractionalPresenceType" (part 3, page 74)
subclass of: fractional-presence-descriptor-parameter
subclass of: unsigned-7

fractional-track-left
type: Class
comment: Corrresponds to the "TrackLeft" element of the local comlex type "FractionalPresenceType" (part 3, page 74)
subclass of: fractional-presence-descriptor-parameter
subclass of: unsigned-7

fractional-track-right
type: Class
comment: Corrresponds to the "TrackRight" element of the local comlex type "FractionalPresenceType" (part 3, page 74)
subclass of: fractional-presence-descriptor-parameter
subclass of: unsigned-7

fractional-zoom-in
type: Class
comment: Corrresponds to the "ZoomIn" element of the local comlex type "FractionalPresenceType" (part 3, page 74)
subclass of: fractional-presence-descriptor-parameter
subclass of: unsigned-7

fractional-zoom-out
type: Class
comment: Corrresponds to the "ZoomOut" element of the local comlex type "FractionalPresenceType" (part 3, page 74)
subclass of: fractional-presence-descriptor-parameter
subclass of: unsigned-7

global-curvature
type: Class
comment: Corrresponds to the "GlobalCurvature" element of the "ContourShapeType" (part 3, page 69)
subclass of: unsigned-6-vector-dim-2
subclass of: contour-shape-descriptor-parameter

gof-gop-color-descriptor
type: Class
comment: Corresponds to the "GoFGoPColorType", specified in part 3, page 56 - 57
subclass of: color-descriptor
subclass of: digital-data
subclass of: Restriction
  on property: about
  all values from: Class
    union of: scalable-color-descriptor
    union of: gof-gop-color-descriptor-parameter

scalable-color-descriptor
type: Class
comment: Corresponds to the "ScalableColorType", specified in part 3, page 37 - 42.
subclass of: Restriction
  on property: about
  all values from: scalable-color-descriptor-parameter
subclass of: color-descriptor
subclass of: digital-data

highest-peak-y
type: Class
comment: Corrresponds to the "HighestPeakY" element of the "ContourShapeType" (part 3, page 69)
subclass of: unsigned-7
subclass of: contour-shape-descriptor-parameter

homogeneous-texture-descriptor
type: Class
comment: Corresponds to the "HomogeneousTextureType", specified in part 3, page 57-61
subclass of: Restriction
  on property: about
  all values from: homogeneous-texture-descriptor-parameter
subclass of: digital-data
subclass of: texture-descriptor

horzontal-position
type: Class
comment: Corrresponds to the "HorizontalPostion" element of the local comlex type "FocusOfExpansionType" (part 3, page 74)
subclass of: focus-of-expansion-descriptor-parameter
subclass of: float-scalar

image-text-role
type: Class
comment: The still region role coresponds to the name of the MPEG-7 "StillRegionType" in part 5, page 285-286. It is defined according to the MPEG-7 Segment DS hierarchy.
subclass of: still-region-role

still-region-role
type: Class
comment: The still region role coresponds to the name of the MPEG-7 "StillRegionType" in part 5, page 280-281. It is defined according to the MPEG-7 Segment DS hierarchy.
subclass of: output-segment-role
subclass of: Restriction
  on property: played-by
  all values from: image-data

intensity
type: Class
comment: Corrresponds to the "Intensity" element of the "MotionActivityType" (part 3, page 87)
subclass of: motion-activity-descriptor-parameter
subclass of: unsigned-3-dim-5

key-media-time-point
type: Class
comment: Corrresponds to the "MediaTimePoint" element of the "TemporalInterpolationType" (part 3, page 24-25)
subclass of: basic-time-point

magnitude-of-art
type: Class
comment: Corrresponds to the "MagnitudeOfArt" element of the "RegionShapeType" (part 3, page 67)
subclass of: unsigned-4-vector-dim-35
subclass of: region-shape-descriptor-parameter

mixture-amount-boom-down
type: Class
comment: Corrresponds to the "BoomDown" element of the local comlex type "CameraMotionSegmentType" (part 3, page 74)
subclass of: unsigned-11
subclass of: mixture-amount-of-motion-descriptor-parameter

mixture-amount-boom-up
type: Class
comment: Corrresponds to the "BoomUp" element of the local comlex type "CameraMotionSegmentType" (part 3, page 74)
subclass of: unsigned-11
subclass of: mixture-amount-of-motion-descriptor-parameter

mixture-amount-dolly-backward
type: Class
comment: Corrresponds to the "DollyBackward" element of the local comlex type "CameraMotionSegmentType" (part 3, page 74)
subclass of: unsigned-11
subclass of: mixture-amount-of-motion-descriptor-parameter

mixture-amount-dolly-forward
type: Class
comment: Corrresponds to the "DollyForward" element of the local comlex type "CameraMotionSegmentType" (part 3, page 74)
subclass of: unsigned-11
subclass of: mixture-amount-of-motion-descriptor-parameter

mixture-amount-of-motion-descriptor
type: Class
comment: Corresponds to the local complex type of the element "AmountOfMotion" of the "CameraMotionSegmentType", specified in part 3, page 73-74.
subclass of: Restriction
  on property: about
  all values from: mixture-amount-of-motion-descriptor-parameter
subclass of: nested-visual-descriptor
subclass of: digital-data

mixture-amount-pan-left
type: Class
comment: Corrresponds to the "PanLeft" element of the local comlex type "CameraMotionSegmentType" (part 3, page 74)
subclass of: unsigned-11
subclass of: mixture-amount-of-motion-descriptor-parameter

mixture-amount-pan-right
type: Class
comment: Corrresponds to the "PanRight" element of the local comlex type "CameraMotionSegmentType" (part 3, page 74)
subclass of: unsigned-11
subclass of: mixture-amount-of-motion-descriptor-parameter

mixture-amount-roll-anti-clockwise
type: Class
comment: Corrresponds to the "RollAntiClockwise" element of the local comlex type "CameraMotionSegmentType" (part 3, page 74)
subclass of: unsigned-11
subclass of: mixture-amount-of-motion-descriptor-parameter

mixture-amount-roll-clockwise
type: Class
comment: Corrresponds to the "RollClockwise" element of the local comlex type "CameraMotionSegmentType" (part 3, page 74)
subclass of: unsigned-11
subclass of: mixture-amount-of-motion-descriptor-parameter

mixture-amount-tilt-down
type: Class
comment: Corrresponds to the "TiltDown" element of the local comlex type "CameraMotionSegmentType" (part 3, page 74)
subclass of: unsigned-11
subclass of: mixture-amount-of-motion-descriptor-parameter

mixture-amount-tilt-up
type: Class
comment: Corrresponds to the "TiltUp" element of the local comlex type "CameraMotionSegmentType" (part 3, page 74)
subclass of: unsigned-11
subclass of: mixture-amount-of-motion-descriptor-parameter

mixture-amount-track-left
type: Class
comment: Corrresponds to the "TrackLeft" element of the local comlex type "CameraMotionSegmentType" (part 3, page 74)
subclass of: unsigned-11
subclass of: mixture-amount-of-motion-descriptor-parameter

mixture-amount-track-right
type: Class
comment: Corrresponds to the "TrackRight" element of the local comlex type "CameraMotionSegmentType" (part 3, page 74)
subclass of: unsigned-11
subclass of: mixture-amount-of-motion-descriptor-parameter

mixture-amount-zoom-in
type: Class
comment: Corrresponds to the "ZoomIn" element of the local comlex type "CameraMotionSegmentType" (part 3, page 74)
subclass of: unsigned-11
subclass of: mixture-amount-of-motion-descriptor-parameter

mixture-amount-zoom-out
type: Class
comment: Corrresponds to the "ZoomOut" element of the local comlex type "CameraMotionSegmentType" (part 3, page 74)
subclass of: unsigned-11
subclass of: mixture-amount-of-motion-descriptor-parameter

mixture-camera-motion-segment-descriptor
type: Class
comment: Corresponds to the local complex type "MixtureCameraMotionSegmentType" of the "CameraMotionSegmentType", specified in part 3, page 73-74.
subclass of: Restriction
  on property: about
  all values from: Class
    union of: fractional-presence-descriptor
    union of: focus-of-expansion-descriptor
    union of: mixture-amount-of-motion-descriptor
    union of: media-time-descriptor
subclass of: camera-motion-segment-descriptor

motion-activity-descriptor
type: Class
comment: Corresponds to the "MotionActivityType", specified in part 3, page 87-92
subclass of: motion-descriptor
subclass of: digital-data
subclass of: Restriction
  on property: about
  all values from: Class
    union of: spatial-distribution-parameters-descriptor
    union of: motion-activity-descriptor-parameter

spatial-distribution-parameters-descriptor
type: Class
comment: Corresponds to the element with three attributes "numOfShortRuns" , "numOfMediumRuns" and "numOfLongRuns" of the "MotionActivityType", specified in part 3, page 87
subclass of: Restriction
  on property: about
  all values from: spatial-distribution-parameters-descriptor-parameter
subclass of: nested-visual-descriptor
subclass of: digital-data

motion-trajectory-descriptor
type: Class
comment: Corresponds to the "MotionTrjectoryType", specified in part 3, page 81-84
subclass of: motion-descriptor
subclass of: Restriction
  on property: about
  all values from: Class
    union of: trajectory-coordinate-definition-descriptor
    union of: temporal-interpolation-descriptor
    union of: motion-trajectory-descriptor-parameter
subclass of: digital-data

trajectory-coordinate-definition-descriptor
type: Class
comment: Corresponds to the local complex type of the element "CoordDef" of the "MotionTrajectoryType", specified in part 3, page 81-84.
subclass of: nested-visual-descriptor
subclass of: Restriction
  on property: about
  all values from: Class
    union of: trajectory-coordinate-representation-descriptor
    union of: trajectory-coordinate-definition-descriptor-parameter
subclass of: digital-data

non-mixture-amount-boom-down
type: Class
comment: Corrresponds to the "BoomDown" element of the local comlex type "CameraMotionSegmentType" (part 3, page 74)
subclass of: unsigned-11
subclass of: non-mixture-amount-of-motion-descriptor-parameter

non-mixture-amount-boom-up
type: Class
comment: Corrresponds to the "BoomUp" element of the local comlex type "CameraMotionSegmentType" (part 3, page 74)
subclass of: unsigned-11
subclass of: non-mixture-amount-of-motion-descriptor-parameter

non-mixture-amount-dolly-backward
type: Class
comment: Corrresponds to the "DollyBackward" element of the local comlex type "CameraMotionSegmentType" (part 3, page 74)
subclass of: unsigned-11
subclass of: non-mixture-amount-of-motion-descriptor-parameter

non-mixture-amount-dolly-forward
type: Class
comment: Corrresponds to the "DollyForward" element of the local comlex type "CameraMotionSegmentType" (part 3, page 74)
subclass of: unsigned-11
subclass of: non-mixture-amount-of-motion-descriptor-parameter

non-mixture-amount-fixed
type: Class
comment: Corrresponds to the "Fixed" element of the local comlex type "CameraMotionSegmentType" (part 3, page 74)
subclass of: unsigned-11
subclass of: non-mixture-amount-of-motion-descriptor-parameter

non-mixture-amount-of-motion-descriptor
type: Class
comment: Corresponds to the local complex type of the element "AmountOfMotion" of the "CameraMotionSegmentType", specified in part 3, page 73-74.
subclass of: nested-visual-descriptor
subclass of: Restriction
  on property: about
  all values from: non-mixture-amount-of-motion-descriptor-parameter
subclass of: digital-data

non-mixture-amount-pan-left
type: Class
comment: Corrresponds to the "PanLeft" element of the local comlex type "CameraMotionSegmentType" (part 3, page 74)
subclass of: unsigned-11
subclass of: non-mixture-amount-of-motion-descriptor-parameter

non-mixture-amount-pan-right
type: Class
comment: Corrresponds to the "PanRight" element of the local comlex type "CameraMotionSegmentType" (part 3, page 74)
subclass of: unsigned-11
subclass of: non-mixture-amount-of-motion-descriptor-parameter

non-mixture-amount-roll-anti-clockwise
type: Class
comment: Corrresponds to the "RollAntiClockwise" element of the local comlex type "CameraMotionSegmentType" (part 3, page 74)
subclass of: unsigned-11
subclass of: non-mixture-amount-of-motion-descriptor-parameter

non-mixture-amount-roll-clockwise
type: Class
comment: Corrresponds to the "RollClockwise" element of the local comlex type "CameraMotionSegmentType" (part 3, page 74)
subclass of: unsigned-11
subclass of: non-mixture-amount-of-motion-descriptor-parameter

non-mixture-amount-tilt-down
type: Class
comment: Corrresponds to the "TiltDown" element of the local comlex type "CameraMotionSegmentType" (part 3, page 74)
subclass of: unsigned-11
subclass of: non-mixture-amount-of-motion-descriptor-parameter

non-mixture-amount-tilt-up
type: Class
comment: Corrresponds to the "TiltUp" element of the local comlex type "CameraMotionSegmentType" (part 3, page 74)
subclass of: unsigned-11
subclass of: non-mixture-amount-of-motion-descriptor-parameter

non-mixture-amount-track-left
type: Class
comment: Corrresponds to the "TrackLeft" element of the local comlex type "CameraMotionSegmentType" (part 3, page 74)
subclass of: unsigned-11
subclass of: non-mixture-amount-of-motion-descriptor-parameter

non-mixture-amount-track-right
type: Class
comment: Corrresponds to the "TrackRight" element of the local comlex type "CameraMotionSegmentType" (part 3, page 74)
subclass of: unsigned-11
subclass of: non-mixture-amount-of-motion-descriptor-parameter

non-mixture-amount-zoom-in
type: Class
comment: Corrresponds to the "ZoomIn" element of the local comlex type "CameraMotionSegmentType" (part 3, page 74)
subclass of: unsigned-11
subclass of: non-mixture-amount-of-motion-descriptor-parameter

non-mixture-amount-zoom-out
type: Class
comment: Corrresponds to the "ZoomOut" element of the local comlex type "CameraMotionSegmentType" (part 3, page 74)
subclass of: unsigned-11
subclass of: non-mixture-amount-of-motion-descriptor-parameter

non-mixture-camera-motion-segment-descriptor
type: Class
comment: Corresponds to the local complex type "NonMixtureCameraMotionSegmentType" of the "CameraMotionSegmentType", specified in part 3, page 73-74.
subclass of: Restriction
  on property: about
  all values from: Class
    union of: focus-of-expansion-descriptor
    union of: media-time-descriptor
    union of: non-mixture-amount-of-motion-descriptor
subclass of: camera-motion-segment-descriptor
subclass of: digital-data

number-of-bins-per-component
type: Class
comment: Corrresponds to the "NumOfBins" element of the "ColorQuantizationType" (part 3, page 33 -34)
subclass of: unsigned-12
subclass of: color-quantization-component-descriptor-parameter

number-of-bitplanes-discarded
type: Class
comment: Corrresponds to the "numOfBitplanesDiscarded" element of the "ScalableColorType" (part 3, page 37 -38). the value ist a string of {0 1 2 3 4 6 8}
subclass of: number-of-bitplanes-discarded-enumeration
subclass of: scalable-color-descriptor-parameter

number-of-bitplanes-discarded-enumeration
type: Class
comment: The string of {0 1 2 3 4 6 8}
subclass of: enumeration
subclass of: Class
  one of: number-of-bitplanes-discarded-0
  one of: number-of-bitplanes-discarded-8
  one of: number-of-bitplanes-discarded-6
  one of: number-of-bitplanes-discarded-4
  one of: number-of-bitplanes-discarded-1
  one of: number-of-bitplanes-discarded-3
  one of: number-of-bitplanes-discarded-2

number-of-coefficents
type: Class
comment: Corrresponds to the "numOfCoeff" element of the "ScalableColorType" (part 3, page 37 -38). The value is a string of {16 32 64 128 256}.
subclass of: number-of-coefficents-enumeration
subclass of: scalable-color-descriptor-parameter

number-of-coefficents-enumeration
type: Class
comment: The string of {16 32 64 128 256}.
subclass of: Class
  one of: number-of-coefficents-16
  one of: number-of-coefficents-32
  one of: number-of-coefficents-128
  one of: number-of-coefficents-256
  one of: number-of-coefficentsv-64
subclass of: enumeration

number-of-long-runs
type: Class
comment: Corrresponds to the "numOfSLongRuns" attribute of the "MotionActivityType" (part 3, page 87)
subclass of: unsigned-5
subclass of: spatial-distribution-parameters-descriptor-parameter

number-of-medium-runs
type: Class
comment: Corrresponds to the "numOfMediumRuns" attribute of the "MotionActivityType" (part 3, page 87)
subclass of: unsigned-5
subclass of: spatial-distribution-parameters-descriptor-parameter

number-of-short-runs
type: Class
comment: Corrresponds to the "numOfShortRuns" attribute of the "MotionActivityType" (part 3, page 87)
subclass of: unsigned-5
subclass of: spatial-distribution-parameters-descriptor-parameter

origin-x
type: Class
comment: Corrresponds to the "originX" attribute of the "ParametricMotionType" (part 3, page 85)
subclass of: float-scalar
subclass of: parametric-coordinate-definition-descriptor-parameter

origin-y
type: Class
comment: Corrresponds to the "originY" attribute of the "ParametricMotionType" (part 3, page 85)
subclass of: float-scalar
subclass of: parametric-coordinate-definition-descriptor-parameter

parametric-coordinate-definition-descriptor
type: Class
comment: Corresponds to the local complex type of the element "CoordDef" of the "ParametricMotionType", specified in part 3, page 84-85.
subclass of: nested-visual-descriptor
subclass of: Restriction
  on property: about
  all values from: parametric-coordinate-definition-descriptor-parameter
subclass of: digital-data

parametric-motion-descriptor
type: Class
comment: Corresponds to the "ParametricMotionType", specified in part 3, page 84-87
subclass of: Restriction
  on property: about
  all values from: Class
    union of: media-duration
    union of: parametric-coordinate-definition-descriptor
    union of: parametric-motion-descriptor-parameter
subclass of: motion-descriptor
subclass of: digital-data

parametric-motion-media-duration
type: Class
comment: Corrresponds to the "MediaDuration" element of the "ParametricMotionType" (part 3, page 85)
subclass of: basic-duration
subclass of: parametric-motion-descriptor-parameter

parametric-motion-model
type: Class
comment: Corrresponds to the "modelMotion" attribute of the "ParametricMotionType" (part 3, page 85). The value is a string of {affine translational rotationOrScaling quadric perspective}
subclass of: parametric-motion-model-enumeration
subclass of: parametric-motion-descriptor-parameter

parametric-motion-model-enumeration
type: Class
comment: the string of {affine translational rotationOrScaling quadric perspective}
subclass of: enumeration
subclass of: Class
  one of: parametric-motion-model-affine
  one of: parametric-motion-model-perspective
  one of: parametric-motion-model-translational
  one of: parametric-motion-model-quadric
  one of: parametric-motion-model-rotation-or-scaling

parametric-motion-parameters
type: Class
comment: Corrresponds to the "Params" element of the "ParametricMotionType" (part 3, page 85)
subclass of: parameters-vector-max-dim-12
subclass of: parametric-motion-descriptor-parameter

peak-x
type: Class
comment: Corrresponds to the "peakX" attibute of the "ContourShapeType" (part 3, page 69)
subclass of: contour-shape-peak-descriptor-parameter
subclass of: unsigned-6

peak-y
type: Class
comment: Corrresponds to the "peakY" attibute of the "ContourShapeType" (part 3, page 69)
subclass of: unsigned-3
subclass of: contour-shape-peak-descriptor-parameter

planar-surfaces
type: Class
comment: Corrresponds to the "PlanarSurfaces" element of the "Shape3DType" (part 3, page 72)
subclass of: unsigned-12
subclass of: shape-3d-descriptor-parameter

prototype-curvature
type: Class
comment: Corrresponds to the "PrototypeCurvature" element of the "ContourShapeType" (part 3, page 69)
subclass of: unsigned-6-vector-dim-2
subclass of: contour-shape-descriptor-parameter

region-shape-descriptor
type: Class
comment: Corresponds to the "RegionShapeType", specified in part 3, page 66-68
subclass of: Restriction
  on property: about
  all values from: region-shape-descriptor-parameter
subclass of: digital-data
subclass of: shape-descriptor

scalable-color-coefficients
type: Class
comment: Corrresponds to the "Coeff" element of the "ScalableColorType" (part 3, page 37 -38)
subclass of: integer-vector
subclass of: scalable-color-descriptor-parameter

shape-3d-descriptor
type: Class
comment: Corresponds to the "RegionhapeType", specified in part 3, page 66-68
subclass of: Restriction
  on property: about
  all values from: shape-3d-descriptor-parameter
subclass of: digital-data
subclass of: shape-descriptor

singular-surfaces
type: Class
comment: Corrresponds to the "SingularSurfaces" element of the "Shape3DType" (part 3, page 72)
subclass of: unsigned-12
subclass of: shape-3d-descriptor-parameter

spatial-localization-parameters-descriptor
type: Class
comment: Corresponds to the choice of four elements "Vector4" , "Vector16", "Vector64" and "Vector256" of the "MotionActivityType", specified in part 3, page 87-88
subclass of: nested-visual-descriptor
subclass of: digital-data

spatial-segment-decomposition
type: Class
comment: This specialization of segment-decomposition follows the MPEG-7 hierarchy of decompositions. It coresponds to the MPEG-7 "SpatialSegmentDecompositionType" in part 5, page 257-258.
subclass of: segment-decomposition

spectrum
type: Class
comment: Corrresponds to the "Specturm" element of the "Shape3DType" (part 3, page 72)
subclass of: shape-3d-descriptor-parameter
subclass of: unsigned-12-vector-max-dim-255

standard-deviation
type: Class
comment: Corrresponds to the "StandardDeviation" element of the "HomogeneousTextureType" (part 3, page 59)
subclass of: homogeneous-texture-descriptor-parameter
subclass of: unsigned-8

still-region-spatial-decomposition
type: Class
comment: This specialization follows the MPEG-7 hierarchy of decompositions. It coresponds to the MPEG-7 "StillRegionSpatialDecompositionType" in part 5, page 283.
subclass of: spatial-segment-decomposition

texture-browsing-component-descriptor
type: Class
comment: Corresponds to the sequence of the two elements "Derection" and "Scale"of the "TextureBrowsingType", specified in part 3, page 61-63
subclass of: Restriction
  on property: about
  all values from: texture-browsing-component-descriptor-parameter
subclass of: nested-visual-descriptor
subclass of: digital-data

texture-browsing-descriptor
type: Class
comment: Corresponds to the "TextureBrowsingType", specified in part 3, page 61-63
subclass of: digital-data
subclass of: texture-descriptor
subclass of: Restriction
  on property: about
  all values from: Class
    union of: texture-browsing-descriptor-parameter
    union of: texture-browsing-component-descriptor

texture-browsing-direction
type: Class
comment: Corrresponds to the "Direction" element of the "TextureBrowsingType" (part 3, page 61-62). The value is a string of {150Degree 120Degree noDirectionality 30Degree 90Degree 0Degree 60Degree }
subclass of: texture-browsing-direction-enumeration
subclass of: texture-browsing-component-descriptor-parameter

texture-browsing-regularity
type: Class
comment: Corrresponds to the "Regularity" element of the "TextureBrowsingType" (part 3, page 61). The value is a string of {iiregular regular highlyRegular slightlyRegular}.
subclass of: texture-browsing-descriptor-parameter
subclass of: texture-browsing-regularity-enumeration

texture-browsing-scale
type: Class
comment: Corrresponds to the "Scale" element of the "TextureBrowsingType" (part 3, page 61-62). The value is a string of {veryCoarse medium coarse fine }
subclass of: texture-browsing-scale-enumeration
subclass of: texture-browsing-component-descriptor-parameter

trajectory-coordinate-representation-descriptor
type: Class
comment: Corresponds to the local complex type of the element "Repr" of the "MotionTrajectoryType", specified in part 3, page 81-84.
subclass of: Restriction
  on property: about
  all values from: trajectory-coordinate-representation-descriptor-parameter
subclass of: nested-visual-descriptor
subclass of: digital-data

trajectory-coordinate-definition-units
type: Class
comment: Corrresponds to the "units" attribute of the "TrajectoryMotionType" (part 3, page 81). The value is a string of {meter pictureHeight pictureWidthAndHeight pictureWidth }.
subclass of: trajectory-coordinate-definition-units-enumeration
subclass of: trajectory-coordinate-definition-descriptor-parameter

trajectory-x
type: Class
comment: Corrresponds to the "X" element of the "TrajectoryMotionType" (part 3, page 81)
subclass of: trajectory-coordinate-representation-descriptor-parameter
subclass of: unsigned-8

trajectory-y
type: Class
comment: Corrresponds to the "Y" element of the "TrajectoryMotionType" (part 3, page 81)
subclass of: trajectory-coordinate-representation-descriptor-parameter
subclass of: unsigned-8

vector-16
type: Class
comment: Corrresponds to the "Vector16” element of the "MotionActivityType" (part 3, page 87-88)
subclass of: vector-16-descriptor-parameter
subclass of: unsigned-3-vector-dim-16

vector-16-descriptor
type: Class
comment: Corrresponds to the local complex type of one choice "Vector16" of the "MotionActivityType" (part 3, page 87-88)
subclass of: Restriction
  on property: about
  all values from: vector-16-descriptor-parameter
subclass of: spatial-localization-parameters-descriptor
subclass of: digital-data

vector-256
type: Class
comment: Corrresponds to the "Vector256” element of the "MotionActivityType" (part 3, page 87-88)
subclass of: unsigned-3-vector-dim-256
subclass of: vector-256-descriptor-parameter

vector-256-descriptor
type: Class
comment: Corrresponds to the local complex type of one choice "Vector256" of the "MotionActivityType" (part 3, page 87-88)
subclass of: spatial-localization-parameters-descriptor
subclass of: Restriction
  on property: about
  all values from: vector-256-descriptor-parameter
subclass of: digital-data

vector-4
type: Class
comment: Corrresponds to the "Vector4” element of the "MotionActivityType" (part 3, page 87-88)
subclass of: vector-4-descriptor-parameter
subclass of: unsigned-3-vector-dim-4

vector-4-descriptor
type: Class
comment: Corrresponds to the local complex type of one choice "Vector4" of the "MotionActivityType" (part 3, page 87-88)
subclass of: spatial-localization-parameters-descriptor
subclass of: digital-data
subclass of: Restriction
  on property: about
  all values from: vector-4-descriptor-parameter

vector-64
type: Class
comment: Corrresponds to the "Vector64” element of the "MotionActivityType" (part 3, page 87-88)
subclass of: unsigned-3-vector-dim-64
subclass of: vector-64-descriptor-parameter

vector-64-descriptor
type: Class
comment: Corrresponds to the local complex type of one choice "Vector64" of the "MotionActivityType" (part 3, page 87-88)
subclass of: Restriction
  on property: about
  all values from: vector-64-descriptor-parameter
subclass of: spatial-localization-parameters-descriptor
subclass of: digital-data

vertical-postition
type: Class
comment: Corrresponds to the "VerticalPostion" element of the local comlex type "FocusOfExpansionType" (part 3, page 74)
subclass of: focus-of-expansion-descriptor-parameter
subclass of: float-scalar

whole-interval-media-duration
type: Class
comment: Corrresponds to the "MediaDuration" element of the "TemporalInterpolationType" (part 3, page 24-25)
subclass of: basic-duration

yac-coefficient-14
type: Class
comment: Corrresponds to the "YACCoeff14” element of the "ColorLayoutType" (part 3, page 43)
subclass of: yac-coefficient-14-descriptor-parameter
subclass of: unsigned-5-vector-dim-14

yac-coefficient-14-descriptor
type: Class
comment: Corresponds to the local complex type of one choice element of the "ColorLayoutType", specified in part 3, page 45-46.
subclass of: yac-coefficient-descriptor
subclass of: Restriction
  on property: about
  all values from: yac-coefficient-14-descriptor-parameter
subclass of: digital-data

yac-coefficient-2
type: Class
comment: Corrresponds to the "YACCoeff2” element of the "ColorLayoutType" (part 3, page 43)
subclass of: yac-coefficient-2-descriptor-parameter
subclass of: unsigned-5-vector-dim-2

yac-coefficient-2-descriptor
type: Class
comment: Corresponds to the local complex type of one choice element of the "ColorLayoutType", specified in part 3, page 45-46.
subclass of: yac-coefficient-descriptor
subclass of: digital-data
subclass of: Restriction
  on property: about
  all values from: yac-coefficient-2-descriptor-parameter

yac-coefficient-20
type: Class
comment: Corrresponds to the "YACCoeff20” element of the "ColorLayoutType" (part 3, page 43-44)
subclass of: yac-coefficient-20-descriptor-parameter
subclass of: unsigned-5-vector-dim-20

yac-coefficient-20-descriptor
type: Class
comment: Corresponds to the local complex type of one choice element of the "ColorLayoutType", specified in part 3, page 45-46.
subclass of: yac-coefficient-descriptor
subclass of: Restriction
  on property: about
  all values from: yac-coefficient-20-descriptor-parameter
subclass of: digital-data

yac-coefficient-27
type: Class
comment: Corrresponds to the "YACCoeff27” element of the "ColorLayoutType" (part 3, page 44)
subclass of: unsigned-5-vector-dim-27
subclass of: yac-coefficient-27-descriptor-parameter

yac-coefficient-27-descriptor
type: Class
comment: Corresponds to the local complex type of one choice element of the "ColorLayoutType", specified in part 3, page 45-46.
subclass of: yac-coefficient-descriptor
subclass of: digital-data
subclass of: Restriction
  on property: about
  all values from: yac-coefficient-27-descriptor-parameter

yac-coefficient-5
type: Class
comment: Corrresponds to the "YACCoeff5” element of the "ColorLayoutType" (part 3, page 43)
subclass of: unsigned-5-vector-dim-5
subclass of: yac-coefficient-5-descriptor-parameter

yac-coefficient-5-descriptor
type: Class
comment: Corresponds to the local complex type of one choice element of the "ColorLayoutType", specified in part 3, page 45-46.
subclass of: yac-coefficient-descriptor
subclass of: digital-data
subclass of: Restriction
  on property: about
  all values from: yac-coefficient-5-descriptor-parameter

yac-coefficient-63
type: Class
comment: Corrresponds to the "YACCoeff63” element of the "ColorLayoutType" (part 3, page 44)
subclass of: yac-coefficient-63-descriptor-parameter
subclass of: unsigned-5-vector-dim-63

yac-coefficient-63-descriptor
type: Class
comment: Corresponds to the local complex type of one choice element of the "ColorLayoutType", specified in part 3, page 45-46.
subclass of: yac-coefficient-descriptor
subclass of: digital-data
subclass of: Restriction
  on property: about
  all values from: yac-coefficient-63-descriptor-parameter

yac-coefficient-9
type: Class
comment: Corrresponds to the "YACCoeff9” element of the "ColorLayoutType" (part 3, page 43)
subclass of: yac-coefficient-9-descriptor-parameter
subclass of: unsigned-5-vector-dim-9

yac-coefficient-9-descriptor
type: Class
comment: Corresponds to the local complex type of one choice element of the "ColorLayoutType", specified in part 3, page 45-46.
subclass of: yac-coefficient-descriptor
subclass of: digital-data
subclass of: Restriction
  on property: about
  all values from: yac-coefficient-9-descriptor-parameter

ydc-coefficient
type: Class
comment: Corrresponds to the "YDCCoeff” element of the "ColorLayoutType" (part 3, page 43)
subclass of: unsigned-6
subclass of: color-layout-descriptor-parameter