ical
type: Thing
source: rfc2445.txt
version info: $Id: ical.rdf,v 1.14 2004/04/07 18:45:16 connolly Exp $
version info: subject to change with notice to www-rdf-calendar@w3.org

VEVENT
type: Class
comment: Provide a grouping of component properties that describe an event.
subclass of: http://lodlaundromat.org/.well-known/genid/a9d2d9aa83a933f718702d9463cc60d8#1
subclass of: http://lodlaundromat.org/.well-known/genid/a9d2d9aa83a933f718702d9463cc60d8#2
subclass of: http://lodlaundromat.org/.well-known/genid/a9d2d9aa83a933f718702d9463cc60d8#3
subclass of: http://lodlaundromat.org/.well-known/genid/a9d2d9aa83a933f718702d9463cc60d8#4
subclass of: http://lodlaundromat.org/.well-known/genid/a9d2d9aa83a933f718702d9463cc60d8#5
subclass of: http://lodlaundromat.org/.well-known/genid/a9d2d9aa83a933f718702d9463cc60d8#6
subclass of: http://lodlaundromat.org/.well-known/genid/a9d2d9aa83a933f718702d9463cc60d8#7
subclass of: http://lodlaundromat.org/.well-known/genid/a9d2d9aa83a933f718702d9463cc60d8#8
subclass of: http://lodlaundromat.org/.well-known/genid/a9d2d9aa83a933f718702d9463cc60d8#9
subclass of: http://lodlaundromat.org/.well-known/genid/a9d2d9aa83a933f718702d9463cc60d8#10
subclass of: http://lodlaundromat.org/.well-known/genid/a9d2d9aa83a933f718702d9463cc60d8#11
subclass of: http://lodlaundromat.org/.well-known/genid/a9d2d9aa83a933f718702d9463cc60d8#12
subclass of: http://lodlaundromat.org/.well-known/genid/a9d2d9aa83a933f718702d9463cc60d8#13
subclass of: http://lodlaundromat.org/.well-known/genid/a9d2d9aa83a933f718702d9463cc60d8#14
subclass of: http://lodlaundromat.org/.well-known/genid/a9d2d9aa83a933f718702d9463cc60d8#15
subclass of: http://lodlaundromat.org/.well-known/genid/a9d2d9aa83a933f718702d9463cc60d8#16
subclass of: http://lodlaundromat.org/.well-known/genid/a9d2d9aa83a933f718702d9463cc60d8#17
subclass of: http://lodlaundromat.org/.well-known/genid/a9d2d9aa83a933f718702d9463cc60d8#18
subclass of: http://lodlaundromat.org/.well-known/genid/a9d2d9aa83a933f718702d9463cc60d8#19
subclass of: http://lodlaundromat.org/.well-known/genid/a9d2d9aa83a933f718702d9463cc60d8#20
subclass of: http://lodlaundromat.org/.well-known/genid/a9d2d9aa83a933f718702d9463cc60d8#21
subclass of: http://lodlaundromat.org/.well-known/genid/a9d2d9aa83a933f718702d9463cc60d8#22
subclass of: http://lodlaundromat.org/.well-known/genid/a9d2d9aa83a933f718702d9463cc60d8#23
subclass of: http://lodlaundromat.org/.well-known/genid/a9d2d9aa83a933f718702d9463cc60d8#24
subclass of: http://lodlaundromat.org/.well-known/genid/a9d2d9aa83a933f718702d9463cc60d8#25
subclass of: http://lodlaundromat.org/.well-known/genid/a9d2d9aa83a933f718702d9463cc60d8#26
subclass of: http://lodlaundromat.org/.well-known/genid/a9d2d9aa83a933f718702d9463cc60d8#27
subclass of: http://lodlaundromat.org/.well-known/genid/a9d2d9aa83a933f718702d9463cc60d8#28
subclass of: http://lodlaundromat.org/.well-known/genid/a9d2d9aa83a933f718702d9463cc60d8#29
subclass of: http://lodlaundromat.org/.well-known/genid/a9d2d9aa83a933f718702d9463cc60d8#30
subclass of: http://lodlaundromat.org/.well-known/genid/a9d2d9aa83a933f718702d9463cc60d8#31
subclass of: http://lodlaundromat.org/.well-known/genid/a9d2d9aa83a933f718702d9463cc60d8#32

http://lodlaundromat.org/.well-known/genid/a9d2d9aa83a933f718702d9463cc60d8#1
type: Restriction
on property: ATTACH
min cardinality: 0

http://lodlaundromat.org/.well-known/genid/a9d2d9aa83a933f718702d9463cc60d8#2
type: Restriction
on property: CATEGORIES
min cardinality: 0

http://lodlaundromat.org/.well-known/genid/a9d2d9aa83a933f718702d9463cc60d8#3
type: Restriction
on property: CLASS
min cardinality: 0

http://lodlaundromat.org/.well-known/genid/a9d2d9aa83a933f718702d9463cc60d8#4
type: Restriction
on property: COMMENT
min cardinality: 0

http://lodlaundromat.org/.well-known/genid/a9d2d9aa83a933f718702d9463cc60d8#5
type: Restriction
on property: DESCRIPTION
min cardinality: 0

http://lodlaundromat.org/.well-known/genid/a9d2d9aa83a933f718702d9463cc60d8#6
type: Restriction
on property: GEO
min cardinality: 0

http://lodlaundromat.org/.well-known/genid/a9d2d9aa83a933f718702d9463cc60d8#7
type: Restriction
on property: LOCATION
min cardinality: 0

http://lodlaundromat.org/.well-known/genid/a9d2d9aa83a933f718702d9463cc60d8#8
type: Restriction
on property: PRIORITY
min cardinality: 0

http://lodlaundromat.org/.well-known/genid/a9d2d9aa83a933f718702d9463cc60d8#9
type: Restriction
on property: RESOURCES
min cardinality: 0

http://lodlaundromat.org/.well-known/genid/a9d2d9aa83a933f718702d9463cc60d8#10
type: Restriction
on property: STATUS
min cardinality: 0

http://lodlaundromat.org/.well-known/genid/a9d2d9aa83a933f718702d9463cc60d8#11
type: Restriction
on property: SUMMARY
min cardinality: 0

http://lodlaundromat.org/.well-known/genid/a9d2d9aa83a933f718702d9463cc60d8#12
type: Restriction
on property: DTEND
min cardinality: 0

http://lodlaundromat.org/.well-known/genid/a9d2d9aa83a933f718702d9463cc60d8#13
type: Restriction
on property: DTSTART
min cardinality: 0

http://lodlaundromat.org/.well-known/genid/a9d2d9aa83a933f718702d9463cc60d8#14
type: Restriction
on property: DURATION
min cardinality: 0

http://lodlaundromat.org/.well-known/genid/a9d2d9aa83a933f718702d9463cc60d8#15
type: Restriction
on property: TRANSP
min cardinality: 0

http://lodlaundromat.org/.well-known/genid/a9d2d9aa83a933f718702d9463cc60d8#16
type: Restriction
on property: ATTENDEE
min cardinality: 0

http://lodlaundromat.org/.well-known/genid/a9d2d9aa83a933f718702d9463cc60d8#17
type: Restriction
on property: CONTACT
min cardinality: 0

http://lodlaundromat.org/.well-known/genid/a9d2d9aa83a933f718702d9463cc60d8#18
type: Restriction
on property: ORGANIZER
min cardinality: 0

http://lodlaundromat.org/.well-known/genid/a9d2d9aa83a933f718702d9463cc60d8#19
type: Restriction
on property: RELATED-TO
min cardinality: 0

http://lodlaundromat.org/.well-known/genid/a9d2d9aa83a933f718702d9463cc60d8#20
type: Restriction
on property: URL
min cardinality: 0

http://lodlaundromat.org/.well-known/genid/a9d2d9aa83a933f718702d9463cc60d8#21
type: Restriction
on property: UID
min cardinality: 0

http://lodlaundromat.org/.well-known/genid/a9d2d9aa83a933f718702d9463cc60d8#22
type: Restriction
on property: EXRULE
min cardinality: 0

http://lodlaundromat.org/.well-known/genid/a9d2d9aa83a933f718702d9463cc60d8#23
type: Restriction
on property: RDATE
min cardinality: 0

http://lodlaundromat.org/.well-known/genid/a9d2d9aa83a933f718702d9463cc60d8#24
type: Restriction
on property: RRULE
min cardinality: 0

http://lodlaundromat.org/.well-known/genid/a9d2d9aa83a933f718702d9463cc60d8#25
type: Restriction
on property: EXDATE
min cardinality: 0

http://lodlaundromat.org/.well-known/genid/a9d2d9aa83a933f718702d9463cc60d8#26
type: Restriction
on property: RECURRENCE-ID
min cardinality: 0

http://lodlaundromat.org/.well-known/genid/a9d2d9aa83a933f718702d9463cc60d8#27
type: Restriction
on property: TRIGGER
min cardinality: 0

http://lodlaundromat.org/.well-known/genid/a9d2d9aa83a933f718702d9463cc60d8#28
type: Restriction
on property: CREATED
min cardinality: 0

http://lodlaundromat.org/.well-known/genid/a9d2d9aa83a933f718702d9463cc60d8#29
type: Restriction
on property: DTSTAMP
min cardinality: 0

http://lodlaundromat.org/.well-known/genid/a9d2d9aa83a933f718702d9463cc60d8#30
type: Restriction
on property: LAST-MODIFIED
min cardinality: 0

http://lodlaundromat.org/.well-known/genid/a9d2d9aa83a933f718702d9463cc60d8#31
type: Restriction
on property: SEQUENCE
min cardinality: 0

http://lodlaundromat.org/.well-known/genid/a9d2d9aa83a933f718702d9463cc60d8#32
type: Restriction
on property: REQUEST-STATUS
min cardinality: 0

VTODO
type: Class
comment: Provide a grouping of calendar properties that describe a to-do.
subclass of: http://lodlaundromat.org/.well-known/genid/a9d2d9aa83a933f718702d9463cc60d8#33
subclass of: http://lodlaundromat.org/.well-known/genid/a9d2d9aa83a933f718702d9463cc60d8#34
subclass of: http://lodlaundromat.org/.well-known/genid/a9d2d9aa83a933f718702d9463cc60d8#35
subclass of: http://lodlaundromat.org/.well-known/genid/a9d2d9aa83a933f718702d9463cc60d8#36
subclass of: http://lodlaundromat.org/.well-known/genid/a9d2d9aa83a933f718702d9463cc60d8#37
subclass of: http://lodlaundromat.org/.well-known/genid/a9d2d9aa83a933f718702d9463cc60d8#38
subclass of: http://lodlaundromat.org/.well-known/genid/a9d2d9aa83a933f718702d9463cc60d8#39
subclass of: http://lodlaundromat.org/.well-known/genid/a9d2d9aa83a933f718702d9463cc60d8#40
subclass of: http://lodlaundromat.org/.well-known/genid/a9d2d9aa83a933f718702d9463cc60d8#41
subclass of: http://lodlaundromat.org/.well-known/genid/a9d2d9aa83a933f718702d9463cc60d8#42
subclass of: http://lodlaundromat.org/.well-known/genid/a9d2d9aa83a933f718702d9463cc60d8#43
subclass of: http://lodlaundromat.org/.well-known/genid/a9d2d9aa83a933f718702d9463cc60d8#44
subclass of: http://lodlaundromat.org/.well-known/genid/a9d2d9aa83a933f718702d9463cc60d8#45
subclass of: http://lodlaundromat.org/.well-known/genid/a9d2d9aa83a933f718702d9463cc60d8#46
subclass of: http://lodlaundromat.org/.well-known/genid/a9d2d9aa83a933f718702d9463cc60d8#47
subclass of: http://lodlaundromat.org/.well-known/genid/a9d2d9aa83a933f718702d9463cc60d8#48
subclass of: http://lodlaundromat.org/.well-known/genid/a9d2d9aa83a933f718702d9463cc60d8#49
subclass of: http://lodlaundromat.org/.well-known/genid/a9d2d9aa83a933f718702d9463cc60d8#50
subclass of: http://lodlaundromat.org/.well-known/genid/a9d2d9aa83a933f718702d9463cc60d8#51
subclass of: http://lodlaundromat.org/.well-known/genid/a9d2d9aa83a933f718702d9463cc60d8#52
subclass of: http://lodlaundromat.org/.well-known/genid/a9d2d9aa83a933f718702d9463cc60d8#53
subclass of: http://lodlaundromat.org/.well-known/genid/a9d2d9aa83a933f718702d9463cc60d8#54
subclass of: http://lodlaundromat.org/.well-known/genid/a9d2d9aa83a933f718702d9463cc60d8#55
subclass of: http://lodlaundromat.org/.well-known/genid/a9d2d9aa83a933f718702d9463cc60d8#56
subclass of: http://lodlaundromat.org/.well-known/genid/a9d2d9aa83a933f718702d9463cc60d8#57
subclass of: http://lodlaundromat.org/.well-known/genid/a9d2d9aa83a933f718702d9463cc60d8#58
subclass of: http://lodlaundromat.org/.well-known/genid/a9d2d9aa83a933f718702d9463cc60d8#59
subclass of: http://lodlaundromat.org/.well-known/genid/a9d2d9aa83a933f718702d9463cc60d8#60
subclass of: http://lodlaundromat.org/.well-known/genid/a9d2d9aa83a933f718702d9463cc60d8#61
subclass of: http://lodlaundromat.org/.well-known/genid/a9d2d9aa83a933f718702d9463cc60d8#62
subclass of: http://lodlaundromat.org/.well-known/genid/a9d2d9aa83a933f718702d9463cc60d8#63
subclass of: http://lodlaundromat.org/.well-known/genid/a9d2d9aa83a933f718702d9463cc60d8#64
subclass of: http://lodlaundromat.org/.well-known/genid/a9d2d9aa83a933f718702d9463cc60d8#65

http://lodlaundromat.org/.well-known/genid/a9d2d9aa83a933f718702d9463cc60d8#33
type: Restriction
on property: ATTACH
min cardinality: 0

http://lodlaundromat.org/.well-known/genid/a9d2d9aa83a933f718702d9463cc60d8#34
type: Restriction
on property: CATEGORIES
min cardinality: 0

http://lodlaundromat.org/.well-known/genid/a9d2d9aa83a933f718702d9463cc60d8#35
type: Restriction
on property: CLASS
min cardinality: 0

http://lodlaundromat.org/.well-known/genid/a9d2d9aa83a933f718702d9463cc60d8#36
type: Restriction
on property: COMMENT
min cardinality: 0

http://lodlaundromat.org/.well-known/genid/a9d2d9aa83a933f718702d9463cc60d8#37
type: Restriction
on property: DESCRIPTION
min cardinality: 0

http://lodlaundromat.org/.well-known/genid/a9d2d9aa83a933f718702d9463cc60d8#38
type: Restriction
on property: GEO
min cardinality: 0

http://lodlaundromat.org/.well-known/genid/a9d2d9aa83a933f718702d9463cc60d8#39
type: Restriction
on property: LOCATION
min cardinality: 0

http://lodlaundromat.org/.well-known/genid/a9d2d9aa83a933f718702d9463cc60d8#40
type: Restriction
on property: PERCENT-COMPLETE
min cardinality: 0

http://lodlaundromat.org/.well-known/genid/a9d2d9aa83a933f718702d9463cc60d8#41
type: Restriction
on property: PRIORITY
min cardinality: 0

http://lodlaundromat.org/.well-known/genid/a9d2d9aa83a933f718702d9463cc60d8#42
type: Restriction
on property: RESOURCES
min cardinality: 0

http://lodlaundromat.org/.well-known/genid/a9d2d9aa83a933f718702d9463cc60d8#43
type: Restriction
on property: STATUS
min cardinality: 0

http://lodlaundromat.org/.well-known/genid/a9d2d9aa83a933f718702d9463cc60d8#44
type: Restriction
on property: SUMMARY
min cardinality: 0

http://lodlaundromat.org/.well-known/genid/a9d2d9aa83a933f718702d9463cc60d8#45
type: Restriction
on property: COMPLETED
min cardinality: 0

http://lodlaundromat.org/.well-known/genid/a9d2d9aa83a933f718702d9463cc60d8#46
type: Restriction
on property: DUE
min cardinality: 0

http://lodlaundromat.org/.well-known/genid/a9d2d9aa83a933f718702d9463cc60d8#47
type: Restriction
on property: DTSTART
min cardinality: 0

http://lodlaundromat.org/.well-known/genid/a9d2d9aa83a933f718702d9463cc60d8#48
type: Restriction
on property: DURATION
min cardinality: 0

http://lodlaundromat.org/.well-known/genid/a9d2d9aa83a933f718702d9463cc60d8#49
type: Restriction
on property: ATTENDEE
min cardinality: 0

http://lodlaundromat.org/.well-known/genid/a9d2d9aa83a933f718702d9463cc60d8#50
type: Restriction
on property: CONTACT
min cardinality: 0

http://lodlaundromat.org/.well-known/genid/a9d2d9aa83a933f718702d9463cc60d8#51
type: Restriction
on property: ORGANIZER
min cardinality: 0

http://lodlaundromat.org/.well-known/genid/a9d2d9aa83a933f718702d9463cc60d8#52
type: Restriction
on property: RELATED-TO
min cardinality: 0

http://lodlaundromat.org/.well-known/genid/a9d2d9aa83a933f718702d9463cc60d8#53
type: Restriction
on property: URL
min cardinality: 0

http://lodlaundromat.org/.well-known/genid/a9d2d9aa83a933f718702d9463cc60d8#54
type: Restriction
on property: UID
min cardinality: 0

http://lodlaundromat.org/.well-known/genid/a9d2d9aa83a933f718702d9463cc60d8#55
type: Restriction
on property: EXRULE
min cardinality: 0

http://lodlaundromat.org/.well-known/genid/a9d2d9aa83a933f718702d9463cc60d8#56
type: Restriction
on property: RDATE
min cardinality: 0

http://lodlaundromat.org/.well-known/genid/a9d2d9aa83a933f718702d9463cc60d8#57
type: Restriction
on property: RRULE
min cardinality: 0

http://lodlaundromat.org/.well-known/genid/a9d2d9aa83a933f718702d9463cc60d8#58
type: Restriction
on property: EXDATE
min cardinality: 0

http://lodlaundromat.org/.well-known/genid/a9d2d9aa83a933f718702d9463cc60d8#59
type: Restriction
on property: RECURRENCE-ID
min cardinality: 0

http://lodlaundromat.org/.well-known/genid/a9d2d9aa83a933f718702d9463cc60d8#60
type: Restriction
on property: TRIGGER
min cardinality: 0

http://lodlaundromat.org/.well-known/genid/a9d2d9aa83a933f718702d9463cc60d8#61
type: Restriction
on property: CREATED
min cardinality: 0

http://lodlaundromat.org/.well-known/genid/a9d2d9aa83a933f718702d9463cc60d8#62
type: Restriction
on property: DTSTAMP
min cardinality: 0

http://lodlaundromat.org/.well-known/genid/a9d2d9aa83a933f718702d9463cc60d8#63
type: Restriction
on property: LAST-MODIFIED
min cardinality: 0

http://lodlaundromat.org/.well-known/genid/a9d2d9aa83a933f718702d9463cc60d8#64
type: Restriction
on property: SEQUENCE
min cardinality: 0

http://lodlaundromat.org/.well-known/genid/a9d2d9aa83a933f718702d9463cc60d8#65
type: Restriction
on property: REQUEST-STATUS
min cardinality: 0

VJOURNAL
type: Class
comment: Provide a grouping of component properties that describe a journal entry.
subclass of: http://lodlaundromat.org/.well-known/genid/a9d2d9aa83a933f718702d9463cc60d8#66
subclass of: http://lodlaundromat.org/.well-known/genid/a9d2d9aa83a933f718702d9463cc60d8#67
subclass of: http://lodlaundromat.org/.well-known/genid/a9d2d9aa83a933f718702d9463cc60d8#68
subclass of: http://lodlaundromat.org/.well-known/genid/a9d2d9aa83a933f718702d9463cc60d8#69
subclass of: http://lodlaundromat.org/.well-known/genid/a9d2d9aa83a933f718702d9463cc60d8#70
subclass of: http://lodlaundromat.org/.well-known/genid/a9d2d9aa83a933f718702d9463cc60d8#71
subclass of: http://lodlaundromat.org/.well-known/genid/a9d2d9aa83a933f718702d9463cc60d8#72
subclass of: http://lodlaundromat.org/.well-known/genid/a9d2d9aa83a933f718702d9463cc60d8#73
subclass of: http://lodlaundromat.org/.well-known/genid/a9d2d9aa83a933f718702d9463cc60d8#74
subclass of: http://lodlaundromat.org/.well-known/genid/a9d2d9aa83a933f718702d9463cc60d8#75
subclass of: http://lodlaundromat.org/.well-known/genid/a9d2d9aa83a933f718702d9463cc60d8#76
subclass of: http://lodlaundromat.org/.well-known/genid/a9d2d9aa83a933f718702d9463cc60d8#77
subclass of: http://lodlaundromat.org/.well-known/genid/a9d2d9aa83a933f718702d9463cc60d8#78
subclass of: http://lodlaundromat.org/.well-known/genid/a9d2d9aa83a933f718702d9463cc60d8#79
subclass of: http://lodlaundromat.org/.well-known/genid/a9d2d9aa83a933f718702d9463cc60d8#80
subclass of: http://lodlaundromat.org/.well-known/genid/a9d2d9aa83a933f718702d9463cc60d8#81
subclass of: http://lodlaundromat.org/.well-known/genid/a9d2d9aa83a933f718702d9463cc60d8#82
subclass of: http://lodlaundromat.org/.well-known/genid/a9d2d9aa83a933f718702d9463cc60d8#83
subclass of: http://lodlaundromat.org/.well-known/genid/a9d2d9aa83a933f718702d9463cc60d8#84
subclass of: http://lodlaundromat.org/.well-known/genid/a9d2d9aa83a933f718702d9463cc60d8#85
subclass of: http://lodlaundromat.org/.well-known/genid/a9d2d9aa83a933f718702d9463cc60d8#86
subclass of: http://lodlaundromat.org/.well-known/genid/a9d2d9aa83a933f718702d9463cc60d8#87
subclass of: http://lodlaundromat.org/.well-known/genid/a9d2d9aa83a933f718702d9463cc60d8#88

http://lodlaundromat.org/.well-known/genid/a9d2d9aa83a933f718702d9463cc60d8#66
type: Restriction
on property: ATTACH
min cardinality: 0

http://lodlaundromat.org/.well-known/genid/a9d2d9aa83a933f718702d9463cc60d8#67
type: Restriction
on property: CATEGORIES
min cardinality: 0

http://lodlaundromat.org/.well-known/genid/a9d2d9aa83a933f718702d9463cc60d8#68
type: Restriction
on property: CLASS
min cardinality: 0

http://lodlaundromat.org/.well-known/genid/a9d2d9aa83a933f718702d9463cc60d8#69
type: Restriction
on property: COMMENT
min cardinality: 0

http://lodlaundromat.org/.well-known/genid/a9d2d9aa83a933f718702d9463cc60d8#70
type: Restriction
on property: DESCRIPTION
min cardinality: 0

http://lodlaundromat.org/.well-known/genid/a9d2d9aa83a933f718702d9463cc60d8#71
type: Restriction
on property: STATUS
min cardinality: 0

http://lodlaundromat.org/.well-known/genid/a9d2d9aa83a933f718702d9463cc60d8#72
type: Restriction
on property: SUMMARY
min cardinality: 0

http://lodlaundromat.org/.well-known/genid/a9d2d9aa83a933f718702d9463cc60d8#73
type: Restriction
on property: ATTENDEE
min cardinality: 0

http://lodlaundromat.org/.well-known/genid/a9d2d9aa83a933f718702d9463cc60d8#74
type: Restriction
on property: CONTACT
min cardinality: 0

http://lodlaundromat.org/.well-known/genid/a9d2d9aa83a933f718702d9463cc60d8#75
type: Restriction
on property: ORGANIZER
min cardinality: 0

http://lodlaundromat.org/.well-known/genid/a9d2d9aa83a933f718702d9463cc60d8#76
type: Restriction
on property: RELATED-TO
min cardinality: 0

http://lodlaundromat.org/.well-known/genid/a9d2d9aa83a933f718702d9463cc60d8#77
type: Restriction
on property: URL
min cardinality: 0

http://lodlaundromat.org/.well-known/genid/a9d2d9aa83a933f718702d9463cc60d8#78
type: Restriction
on property: UID
min cardinality: 0

http://lodlaundromat.org/.well-known/genid/a9d2d9aa83a933f718702d9463cc60d8#79
type: Restriction
on property: EXRULE
min cardinality: 0

http://lodlaundromat.org/.well-known/genid/a9d2d9aa83a933f718702d9463cc60d8#80
type: Restriction
on property: RDATE
min cardinality: 0

http://lodlaundromat.org/.well-known/genid/a9d2d9aa83a933f718702d9463cc60d8#81
type: Restriction
on property: RRULE
min cardinality: 0

http://lodlaundromat.org/.well-known/genid/a9d2d9aa83a933f718702d9463cc60d8#82
type: Restriction
on property: EXDATE
min cardinality: 0

http://lodlaundromat.org/.well-known/genid/a9d2d9aa83a933f718702d9463cc60d8#83
type: Restriction
on property: RECURRENCE-ID
min cardinality: 0

http://lodlaundromat.org/.well-known/genid/a9d2d9aa83a933f718702d9463cc60d8#84
type: Restriction
on property: CREATED
min cardinality: 0

http://lodlaundromat.org/.well-known/genid/a9d2d9aa83a933f718702d9463cc60d8#85
type: Restriction
on property: DTSTAMP
min cardinality: 0

http://lodlaundromat.org/.well-known/genid/a9d2d9aa83a933f718702d9463cc60d8#86
type: Restriction
on property: LAST-MODIFIED
min cardinality: 0

http://lodlaundromat.org/.well-known/genid/a9d2d9aa83a933f718702d9463cc60d8#87
type: Restriction
on property: SEQUENCE
min cardinality: 0

http://lodlaundromat.org/.well-known/genid/a9d2d9aa83a933f718702d9463cc60d8#88
type: Restriction
on property: REQUEST-STATUS
min cardinality: 0

VFREEBUSY
type: Class
comment: Provide a grouping of component properties that describe either a request for free/busy time, describe a response to a request for free/busy time or describe a published set of busy time.
subclass of: http://lodlaundromat.org/.well-known/genid/a9d2d9aa83a933f718702d9463cc60d8#89
subclass of: http://lodlaundromat.org/.well-known/genid/a9d2d9aa83a933f718702d9463cc60d8#90
subclass of: http://lodlaundromat.org/.well-known/genid/a9d2d9aa83a933f718702d9463cc60d8#91
subclass of: http://lodlaundromat.org/.well-known/genid/a9d2d9aa83a933f718702d9463cc60d8#92
subclass of: http://lodlaundromat.org/.well-known/genid/a9d2d9aa83a933f718702d9463cc60d8#93
subclass of: http://lodlaundromat.org/.well-known/genid/a9d2d9aa83a933f718702d9463cc60d8#94
subclass of: http://lodlaundromat.org/.well-known/genid/a9d2d9aa83a933f718702d9463cc60d8#95
subclass of: http://lodlaundromat.org/.well-known/genid/a9d2d9aa83a933f718702d9463cc60d8#96
subclass of: http://lodlaundromat.org/.well-known/genid/a9d2d9aa83a933f718702d9463cc60d8#97
subclass of: http://lodlaundromat.org/.well-known/genid/a9d2d9aa83a933f718702d9463cc60d8#98
subclass of: http://lodlaundromat.org/.well-known/genid/a9d2d9aa83a933f718702d9463cc60d8#99
subclass of: http://lodlaundromat.org/.well-known/genid/a9d2d9aa83a933f718702d9463cc60d8#100

http://lodlaundromat.org/.well-known/genid/a9d2d9aa83a933f718702d9463cc60d8#89
type: Restriction
on property: COMMENT
min cardinality: 0

http://lodlaundromat.org/.well-known/genid/a9d2d9aa83a933f718702d9463cc60d8#90
type: Restriction
on property: DTEND
min cardinality: 0

http://lodlaundromat.org/.well-known/genid/a9d2d9aa83a933f718702d9463cc60d8#91
type: Restriction
on property: DTSTART
min cardinality: 0

http://lodlaundromat.org/.well-known/genid/a9d2d9aa83a933f718702d9463cc60d8#92
type: Restriction
on property: DURATION
min cardinality: 0

http://lodlaundromat.org/.well-known/genid/a9d2d9aa83a933f718702d9463cc60d8#93
type: Restriction
on property: FREEBUSY
min cardinality: 0

http://lodlaundromat.org/.well-known/genid/a9d2d9aa83a933f718702d9463cc60d8#94
type: Restriction
on property: ATTENDEE
min cardinality: 0

http://lodlaundromat.org/.well-known/genid/a9d2d9aa83a933f718702d9463cc60d8#95
type: Restriction
on property: CONTACT
min cardinality: 0

http://lodlaundromat.org/.well-known/genid/a9d2d9aa83a933f718702d9463cc60d8#96
type: Restriction
on property: ORGANIZER
min cardinality: 0

http://lodlaundromat.org/.well-known/genid/a9d2d9aa83a933f718702d9463cc60d8#97
type: Restriction
on property: URL
min cardinality: 0

http://lodlaundromat.org/.well-known/genid/a9d2d9aa83a933f718702d9463cc60d8#98
type: Restriction
on property: UID
min cardinality: 0

http://lodlaundromat.org/.well-known/genid/a9d2d9aa83a933f718702d9463cc60d8#99
type: Restriction
on property: DTSTAMP
min cardinality: 0

http://lodlaundromat.org/.well-known/genid/a9d2d9aa83a933f718702d9463cc60d8#100
type: Restriction
on property: REQUEST-STATUS
min cardinality: 0

VTIMEZONE
type: Class
comment: Provide a grouping of component properties that defines a time zone.
subclass of: http://lodlaundromat.org/.well-known/genid/a9d2d9aa83a933f718702d9463cc60d8#101
subclass of: http://lodlaundromat.org/.well-known/genid/a9d2d9aa83a933f718702d9463cc60d8#102
subclass of: http://lodlaundromat.org/.well-known/genid/a9d2d9aa83a933f718702d9463cc60d8#103
subclass of: http://lodlaundromat.org/.well-known/genid/a9d2d9aa83a933f718702d9463cc60d8#104
subclass of: http://lodlaundromat.org/.well-known/genid/a9d2d9aa83a933f718702d9463cc60d8#105
subclass of: http://lodlaundromat.org/.well-known/genid/a9d2d9aa83a933f718702d9463cc60d8#106
subclass of: http://lodlaundromat.org/.well-known/genid/a9d2d9aa83a933f718702d9463cc60d8#107
subclass of: http://lodlaundromat.org/.well-known/genid/a9d2d9aa83a933f718702d9463cc60d8#108
subclass of: http://lodlaundromat.org/.well-known/genid/a9d2d9aa83a933f718702d9463cc60d8#109
subclass of: http://lodlaundromat.org/.well-known/genid/a9d2d9aa83a933f718702d9463cc60d8#110
subclass of: http://lodlaundromat.org/.well-known/genid/a9d2d9aa83a933f718702d9463cc60d8#111
subclass of: http://lodlaundromat.org/.well-known/genid/a9d2d9aa83a933f718702d9463cc60d8#112

http://lodlaundromat.org/.well-known/genid/a9d2d9aa83a933f718702d9463cc60d8#101
type: Restriction
on property: COMMENT
min cardinality: 0

http://lodlaundromat.org/.well-known/genid/a9d2d9aa83a933f718702d9463cc60d8#102
type: Restriction
on property: DTSTART
min cardinality: 0

http://lodlaundromat.org/.well-known/genid/a9d2d9aa83a933f718702d9463cc60d8#103
type: Restriction
on property: TZID
min cardinality: 0

http://lodlaundromat.org/.well-known/genid/a9d2d9aa83a933f718702d9463cc60d8#104
type: Restriction
on property: TZNAME
min cardinality: 0

http://lodlaundromat.org/.well-known/genid/a9d2d9aa83a933f718702d9463cc60d8#105
type: Restriction
on property: TZOFFSETFROM
min cardinality: 0

http://lodlaundromat.org/.well-known/genid/a9d2d9aa83a933f718702d9463cc60d8#106
type: Restriction
on property: TZOFFSETTO
min cardinality: 0

http://lodlaundromat.org/.well-known/genid/a9d2d9aa83a933f718702d9463cc60d8#107
type: Restriction
on property: TZURL
min cardinality: 0

http://lodlaundromat.org/.well-known/genid/a9d2d9aa83a933f718702d9463cc60d8#108
type: Restriction
on property: RDATE
min cardinality: 0

http://lodlaundromat.org/.well-known/genid/a9d2d9aa83a933f718702d9463cc60d8#109
type: Restriction
on property: RRULE
min cardinality: 0

http://lodlaundromat.org/.well-known/genid/a9d2d9aa83a933f718702d9463cc60d8#110
type: Restriction
on property: EXDATE
min cardinality: 0

http://lodlaundromat.org/.well-known/genid/a9d2d9aa83a933f718702d9463cc60d8#111
type: Restriction
on property: RECURRENCE-ID
min cardinality: 0

http://lodlaundromat.org/.well-known/genid/a9d2d9aa83a933f718702d9463cc60d8#112
type: Restriction
on property: LAST-MODIFIED
min cardinality: 0

VALARM
type: Class
comment: Provide a grouping of component properties that define an alarm.
subclass of: http://lodlaundromat.org/.well-known/genid/a9d2d9aa83a933f718702d9463cc60d8#113
subclass of: http://lodlaundromat.org/.well-known/genid/a9d2d9aa83a933f718702d9463cc60d8#114
subclass of: http://lodlaundromat.org/.well-known/genid/a9d2d9aa83a933f718702d9463cc60d8#115
subclass of: http://lodlaundromat.org/.well-known/genid/a9d2d9aa83a933f718702d9463cc60d8#116
subclass of: http://lodlaundromat.org/.well-known/genid/a9d2d9aa83a933f718702d9463cc60d8#117
subclass of: http://lodlaundromat.org/.well-known/genid/a9d2d9aa83a933f718702d9463cc60d8#118
subclass of: http://lodlaundromat.org/.well-known/genid/a9d2d9aa83a933f718702d9463cc60d8#119
subclass of: http://lodlaundromat.org/.well-known/genid/a9d2d9aa83a933f718702d9463cc60d8#120

http://lodlaundromat.org/.well-known/genid/a9d2d9aa83a933f718702d9463cc60d8#113
type: Restriction
on property: ATTACH
min cardinality: 0

http://lodlaundromat.org/.well-known/genid/a9d2d9aa83a933f718702d9463cc60d8#114
type: Restriction
on property: DESCRIPTION
min cardinality: 0

http://lodlaundromat.org/.well-known/genid/a9d2d9aa83a933f718702d9463cc60d8#115
type: Restriction
on property: SUMMARY
min cardinality: 0

http://lodlaundromat.org/.well-known/genid/a9d2d9aa83a933f718702d9463cc60d8#116
type: Restriction
on property: DURATION
min cardinality: 0

http://lodlaundromat.org/.well-known/genid/a9d2d9aa83a933f718702d9463cc60d8#117
type: Restriction
on property: ATTENDEE
min cardinality: 0

http://lodlaundromat.org/.well-known/genid/a9d2d9aa83a933f718702d9463cc60d8#118
type: Restriction
on property: ACTION
min cardinality: 0

http://lodlaundromat.org/.well-known/genid/a9d2d9aa83a933f718702d9463cc60d8#119
type: Restriction
on property: REPEAT
min cardinality: 0

http://lodlaundromat.org/.well-known/genid/a9d2d9aa83a933f718702d9463cc60d8#120
type: Restriction
on property: TRIGGER
min cardinality: 0

CALSCALE
comment: This property defines the calendar scale used for the calendar information specified in the iCalendar object.
comment: value type: TEXT
value type: TEXT
type: DatatypeProperty
range: string

METHOD
comment: This property defines the iCalendar object method associated with the calendar object.
comment: value type: TEXT
value type: TEXT
type: DatatypeProperty
range: string

PRODID
comment: This property specifies the identifier for the product that created the iCalendar object.
comment: value type: TEXT
value type: TEXT
type: DatatypeProperty
range: string

VERSION
comment: This property specifies the identifier corresponding to the highest version number or the minimum and maximum range of the iCalendar specification that is required in order to interpret the iCalendar object.
comment: value type: TEXT
value type: TEXT
type: DatatypeProperty
range: string

ATTACH
comment: The property provides the capability to associate a document object with a calendar component.
comment: default value type: URI
value type: URI
type: ObjectProperty
domain: http://lodlaundromat.org/.well-known/genid/a9d2d9aa83a933f718702d9463cc60d8#121

CATEGORIES
comment: This property defines the categories for a calendar component.
comment: value type: TEXT
value type: TEXT
type: DatatypeProperty
range: string
domain: http://lodlaundromat.org/.well-known/genid/a9d2d9aa83a933f718702d9463cc60d8#130

CLASS
comment: This property defines the access classification for a calendar component.
comment: value type: TEXT
value type: TEXT
type: DatatypeProperty
range: string
domain: http://lodlaundromat.org/.well-known/genid/a9d2d9aa83a933f718702d9463cc60d8#137

COMMENT
comment: This property specifies non-processing information intended to provide a comment to the calendar user.
comment: value type: TEXT
value type: TEXT
type: DatatypeProperty
range: string
domain: http://lodlaundromat.org/.well-known/genid/a9d2d9aa83a933f718702d9463cc60d8#141

DESCRIPTION
comment: This property provides a more complete description of the calendar component, than that provided by the "SUMMARY" property.
comment: value type: TEXT
value type: TEXT
type: DatatypeProperty
range: string
domain: http://lodlaundromat.org/.well-known/genid/a9d2d9aa83a933f718702d9463cc60d8#147

GEO
comment: This property specifies information related to the global position for the activity specified by a calendar component.
comment: value type: list of FLOAT
value list type: FLOAT
type: ObjectProperty
range: List of Float
domain: http://lodlaundromat.org/.well-known/genid/a9d2d9aa83a933f718702d9463cc60d8#157

LOCATION
comment: The property defines the intended venue for the activity defined by a calendar component.
comment: value type: TEXT
value type: TEXT
type: DatatypeProperty
range: string
domain: http://lodlaundromat.org/.well-known/genid/a9d2d9aa83a933f718702d9463cc60d8#160

PERCENT-COMPLETE
comment: This property is used by an assignee or delegatee of a to-do to convey the percent completion of a to-do to the Organizer.
comment: value type: INTEGER
value type: INTEGER
type: DatatypeProperty
range: integer
domain: VTODO

PRIORITY
comment: The property defines the relative priority for a calendar component.
comment: value type: INTEGER
value type: INTEGER
type: DatatypeProperty
range: integer
domain: http://lodlaundromat.org/.well-known/genid/a9d2d9aa83a933f718702d9463cc60d8#163

RESOURCES
comment: This property defines the equipment or resources anticipated for an activity specified by a calendar entity..
comment: value type: TEXT
value type: TEXT
type: DatatypeProperty
range: string
domain: http://lodlaundromat.org/.well-known/genid/a9d2d9aa83a933f718702d9463cc60d8#168

STATUS
comment: This property defines the overall status or confirmation for the calendar component.
comment: value type: TEXT
value type: TEXT
type: DatatypeProperty
range: string
domain: http://lodlaundromat.org/.well-known/genid/a9d2d9aa83a933f718702d9463cc60d8#171

SUMMARY
comment: This property defines a short summary or subject for the calendar component.
comment: value type: TEXT
value type: TEXT
type: DatatypeProperty
range: string
domain: http://lodlaundromat.org/.well-known/genid/a9d2d9aa83a933f718702d9463cc60d8#178

COMPLETED
comment: This property defines the date and time that a to-do was actually completed.
comment: value type: DATE-TIME
value type: DATE-TIME
type: ObjectProperty
range: Value DATE-TIME
domain: VTODO

DTEND
comment: This property specifies the date and time that a calendar component ends.
comment: default value type: DATE-TIME
value type: DATE-TIME
type: ObjectProperty
range: http://lodlaundromat.org/.well-known/genid/a9d2d9aa83a933f718702d9463cc60d8#187
domain: http://lodlaundromat.org/.well-known/genid/a9d2d9aa83a933f718702d9463cc60d8#190

DUE
comment: This property defines the date and time that a to-do is expected to be completed.
comment: default value type: DATE-TIME
value type: DATE-TIME
type: ObjectProperty
range: http://lodlaundromat.org/.well-known/genid/a9d2d9aa83a933f718702d9463cc60d8#195
domain: VTODO

DTSTART
comment: This property specifies when the calendar component begins.
comment: default value type: DATE-TIME
value type: DATE-TIME
type: ObjectProperty
range: http://lodlaundromat.org/.well-known/genid/a9d2d9aa83a933f718702d9463cc60d8#198
domain: http://lodlaundromat.org/.well-known/genid/a9d2d9aa83a933f718702d9463cc60d8#202

DURATION
comment: The property specifies a positive duration of time.
comment: value type: DURATION
value type: DURATION
type: ObjectProperty
range: Value DURATION
domain: http://lodlaundromat.org/.well-known/genid/a9d2d9aa83a933f718702d9463cc60d8#212

FREEBUSY
comment: The property defines one or more free or busy time intervals.
comment: value type: PERIOD
value type: PERIOD
type: ObjectProperty
range: Value PERIOD
domain: http://lodlaundromat.org/.well-known/genid/a9d2d9aa83a933f718702d9463cc60d8#221

TRANSP
comment: This property defines whether an event is transparent or not to busy time searches.
comment: value type: TEXT
value type: TEXT
type: DatatypeProperty
range: string
domain: VEVENT

TZID
comment: This property specifies the text value that uniquely identifies the "VTIMEZONE" calendar component.
comment: value type: TEXT
value type: TEXT
type: DatatypeProperty
range: string
domain: VTIMEZONE

TZNAME
comment: This property specifies the customary designation for a time zone description.
comment: value type: TEXT
value type: TEXT
type: DatatypeProperty
range: string
domain: VTIMEZONE

TZOFFSETFROM
comment: This property specifies the offset which is in use prior to this time zone observance.
comment: value type: UTC-OFFSET
value type: UTC-OFFSET
type: DatatypeProperty
range: string
domain: http://lodlaundromat.org/.well-known/genid/a9d2d9aa83a933f718702d9463cc60d8#224

TZOFFSETTO
comment: This property specifies the offset which is in use in this time zone observance.
comment: value type: UTC-OFFSET
value type: UTC-OFFSET
type: DatatypeProperty
range: string
domain: VTIMEZONE

TZURL
comment: The TZURL provides a means for a VTIMEZONE component to point to a network location that can be used to retrieve an up-to- date version of itself.
comment: value type: URI
value type: URI
type: ObjectProperty
domain: http://lodlaundromat.org/.well-known/genid/a9d2d9aa83a933f718702d9463cc60d8#228

ATTENDEE
comment: The property defines an "Attendee" within a calendar component.
comment: value type: CAL-ADDRESS
value type: CAL-ADDRESS
type: ObjectProperty
range: Value CAL-ADDRESS
domain: http://lodlaundromat.org/.well-known/genid/a9d2d9aa83a933f718702d9463cc60d8#232

CONTACT
comment: The property is used to represent contact information or alternately a reference to contact information associated with the calendar component.
comment: value type: TEXT
value type: TEXT
type: DatatypeProperty
range: string
domain: http://lodlaundromat.org/.well-known/genid/a9d2d9aa83a933f718702d9463cc60d8#239

ORGANIZER
comment: The property defines the organizer for a calendar component.
comment: value type: CAL-ADDRESS
value type: CAL-ADDRESS
type: ObjectProperty
range: Value CAL-ADDRESS
domain: http://lodlaundromat.org/.well-known/genid/a9d2d9aa83a933f718702d9463cc60d8#244

RECURRENCE-ID
comment: This property is used in conjunction with the "UID" and "SEQUENCE" property to identify a specific instance of a recurring "VEVENT", "VTODO" or "VJOURNAL" calendar component. The property value is the effective value of the "DTSTART" property of the recurrence instance.
comment: default value type: DATE-TIME
value type: DATE-TIME
type: ObjectProperty
range: http://lodlaundromat.org/.well-known/genid/a9d2d9aa83a933f718702d9463cc60d8#250
domain: DomainOf rrule

RELATED-TO
comment: The property is used to represent a relationship or reference between one calendar component and another.
comment: value type: TEXT
value type: TEXT
type: DatatypeProperty
range: string
domain: http://lodlaundromat.org/.well-known/genid/a9d2d9aa83a933f718702d9463cc60d8#255

URL
comment: This property defines a Uniform Resource Locator (URL) associated with the iCalendar object.
comment: value type: URI
value type: URI
type: ObjectProperty
domain: http://lodlaundromat.org/.well-known/genid/a9d2d9aa83a933f718702d9463cc60d8#259

UID
comment: This property defines the persistent, globally unique identifier for the calendar component.
comment: value type: TEXT
value type: TEXT
type: DatatypeProperty
range: string
domain: http://lodlaundromat.org/.well-known/genid/a9d2d9aa83a933f718702d9463cc60d8#264

EXDATE
comment: This property defines the list of date/time exceptions for a recurring calendar component.
comment: default value type: DATE-TIME
value type: DATE-TIME
type: ObjectProperty
range: http://lodlaundromat.org/.well-known/genid/a9d2d9aa83a933f718702d9463cc60d8#275
domain: DomainOf rrule

EXRULE
comment: This property defines a rule or repeating pattern for an exception to a recurrence set.
comment: value type: RECUR
value type: RECUR
type: ObjectProperty
range: Value RECUR
domain: http://lodlaundromat.org/.well-known/genid/a9d2d9aa83a933f718702d9463cc60d8#278

RDATE
comment: This property defines the list of date/times for a recurrence set.
comment: default value type: DATE-TIME
value type: DATE-TIME
type: ObjectProperty
range: http://lodlaundromat.org/.well-known/genid/a9d2d9aa83a933f718702d9463cc60d8#282
domain: http://lodlaundromat.org/.well-known/genid/a9d2d9aa83a933f718702d9463cc60d8#286

RRULE
comment: This property defines a rule or repeating pattern for recurring events, to-dos, or time zone definitions.
comment: value type: RECUR
value type: RECUR
type: ObjectProperty
range: Value RECUR
domain: http://lodlaundromat.org/.well-known/genid/a9d2d9aa83a933f718702d9463cc60d8#291

ACTION
comment: This property defines the action to be invoked when an alarm is triggered.
comment: value type: TEXT
value type: TEXT
type: DatatypeProperty
range: string
domain: http://lodlaundromat.org/.well-known/genid/a9d2d9aa83a933f718702d9463cc60d8#299

REPEAT
comment: This property defines the number of time the alarm should be repeated, after the initial trigger.
comment: value type: INTEGER
value type: INTEGER
type: DatatypeProperty
range: integer
domain: VALARM

TRIGGER
comment: This property specifies when an alarm will trigger.
comment: default value type: DURATION
value type: DURATION
type: ObjectProperty
range: http://lodlaundromat.org/.well-known/genid/a9d2d9aa83a933f718702d9463cc60d8#302
domain: http://lodlaundromat.org/.well-known/genid/a9d2d9aa83a933f718702d9463cc60d8#306

CREATED
comment: This property specifies the date and time that the calendar information was created by the calendar user agent in the calendar store. Note: This is analogous to the creation date and time for a file in the file system.
comment: value type: DATE-TIME
value type: DATE-TIME
type: ObjectProperty
range: Value DATE-TIME
domain: http://lodlaundromat.org/.well-known/genid/a9d2d9aa83a933f718702d9463cc60d8#313

DTSTAMP
comment: The property indicates the date/time that the instance of the iCalendar object was created.
comment: value type: DATE-TIME
value type: DATE-TIME
type: ObjectProperty
range: Value DATE-TIME
domain: http://lodlaundromat.org/.well-known/genid/a9d2d9aa83a933f718702d9463cc60d8#317

LAST-MODIFIED
comment: The property specifies the date and time that the information associated with the calendar component was last revised in the calendar store. Note: This is analogous to the modification date and time for a file in the file system.
comment: value type: DATE-TIME
value type: DATE-TIME
type: ObjectProperty
range: Value DATE-TIME
domain: http://lodlaundromat.org/.well-known/genid/a9d2d9aa83a933f718702d9463cc60d8#322

SEQUENCE
comment: This property defines the revision sequence number of the calendar component within a sequence of revisions.
comment: value type: integer
value type: integer
type: DatatypeProperty
range: integer
domain: http://lodlaundromat.org/.well-known/genid/a9d2d9aa83a933f718702d9463cc60d8#327

Any property name with a "X-" prefix
comment: This class of property provides a framework for defining non-standard properties.
comment: value type: TEXT
value type: TEXT
type: DatatypeProperty
range: string

REQUEST-STATUS
comment: This property defines the status code returned for a scheduling request.
comment: value type: TEXT
value type: TEXT
type: DatatypeProperty
range: string
domain: http://lodlaundromat.org/.well-known/genid/a9d2d9aa83a933f718702d9463cc60d8#331