tgproton.owl
type: Ontology
imports: upproton.owl
comment: This is the Travel Guides ontology created by Danica Damljanovic, contains knowledge about tourism domain, and extends PROTON ontology.

Rating
type: Class
disjoint with: Topic
disjoint with: SocialAbstraction
disjoint with: BusinessAbstraction
disjoint with: Number
subclass of: Abstract
disjoint with: ContactInformation
disjoint with: TemporalAbstraction
disjoint with: Language
disjoint with: NaturalPhenomenon
disjoint with: GeneralTerm
disjoint with: Destination
comment: Term representing any concept that is applicable for anything that can be evaluated or measured. It is usually a subject of some standard.

Destination
type: Class
disjoint with: Rating
subclass of: Abstract
disjoint with: GeneralTerm
disjoint with: SocialAbstraction
disjoint with: NaturalPhenomenon
disjoint with: Language
disjoint with: BusinessAbstraction
disjoint with: ContactInformation
comment: This is concept of destination and describes destination as general term. It represents a super class for different types of destination such as FamilyDestination, ClubbingDestination, etc.
disjoint with: Number
disjoint with: TemporalAbstraction
disjoint with: Topic

TransportService
type: Class
comment: Any service offering transportation.
subclass of: Service

ParkingPlace
type: Class
subclass of: Roadway
comment: The notion for a parking place within a city, hotel, etc.

AccommodationRating
type: Class
comment: This term expresses the rating of an accommodation, usually rated as one star, two stars, three stars, four stars, five stars.
subclass of: Rating

Room
type: Class
subclass of: Facility
comment: The notion of room usually in hotels, hostels or any other building.

BoardService
type: Class
comment: Food service offered at different kind of accommodations, mostly at hotels: full-board, half-board, breakfast, all-inclusive, etc.
subclass of: FoodService

FoodService
type: Class
subclass of: Service
comment: Any service that is offering a food service, such as catering service, fast food places, etc.

TouristOffer
type: Class
comment: Synonims for this term are "tourist deal", "tourist destination", "vacation package" offered in any tourist agency.
subclass of: Offer

discounts
type: DatatypeProperty
range: string
comment: Discounts for a certain offer. Similar to benefits.
domain: TouristOffer

benefits
type: DatatypeProperty
comment: Benefits description for a certain tourist deal, such as discounts for children, etc.
range: string
domain: TouristOffer

Kontiki homepage
type: HomePage
description: www.kontiki.co.yu