agent-descriptor
type: Class
comment: Corresponds to the local complex type of the element "RatingSource" of the "AgentType" specified in mpeg 7, part 5 page 158.
subclass of: http://lodlaundromat.org/.well-known/genid/85d373edf16945c6598ba0cfb24d8aa2#1
subclass of: nested-media-descriptor
subclass of: digital-data

anchor-frame-distance
type: Class
comment: Corresponds to the "anchorFrameDistance" element of the "MediaTranscodingHintsType" (part 5, page 211)
subclass of: coding-hints-descriptor-parameter
subclass of: positive-integer

audio-channels
type: Class
comment: Corresponds to the "AudioChannels" element of the "MediaFormatType" (part 5, page 203 - 204)
subclass of: non-negative-integer
subclass of: audio-channels-descriptor-parameter

audio-channels-descriptor
type: Class
comment: Corresponds to the local complex type of the element "AudioChannels" of the "MediaFormatType", specified in part 5, page 203 - 204.
subclass of: nested-media-descriptor
subclass of: digital-data
subclass of: http://lodlaundromat.org/.well-known/genid/85d373edf16945c6598ba0cfb24d8aa2#2

audio-coding-descriptor
type: Class
comment: Corresponds to the local complex type of the element "AudioCoding" of the "MediaFormatType", specified in part 5, page 203 - 204.
subclass of: http://lodlaundromat.org/.well-known/genid/85d373edf16945c6598ba0cfb24d8aa2#3
subclass of: nested-media-descriptor
subclass of: digital-data

audio-coding-format
type: Class
comment: Corresponds to the "Format" element of the "MediaFormatType" (part 5, page 203)
subclass of: audio-coding-descriptor-parameter
subclass of: controlled-term-use-type

audio-defects
type: Class
comment: Corresponds to the "VisualDefects" element of the "MediaQualityType" (part 5, page 213)
subclass of: perceptible-defects-descriptor-parameter
subclass of: controlled-term-use-type

audio-presentation
type: Class
comment: Corresponds to the "Presentation" element of the "MediaFormatType" (part 5, page 204)
subclass of: audio-coding-descriptor-parameter
subclass of: controlled-term-use-type

authority
type: Class
comment: Corrresponds to the "authority" attribute of the "UniqueIDType" (part 5, page 76)
subclass of: unique-id-descriptor-parameter
subclass of: nmtoken

average-bitrate
type: Class
comment: Corresponds to the "average" attribute of the "MediaFormatType" (part 5, page 202)
subclass of: non-negative-integer
subclass of: bitrate-descriptor-parameter

average-quantization-scale
type: Class
comment: Corresponds to the "avgQuantScale" element of the "MediaTranscodingHintsType" (part 5, page 211)
subclass of: coding-hints-descriptor-parameter
subclass of: non-negative-real

bandwidth
type: Class
comment: Corrresponds to the "Bandwidth" element of the "MediaFormatType" (part 5, page 202)
subclass of: media-format-descriptor-parameter
subclass of: float-scalar

bitrate
type: Class
comment: Corresponds to the "BitRate" element of the "MediaFormatType" (part 5, page 202)
subclass of: non-negative-integer
subclass of: bitrate-descriptor-parameter

bitrate-descriptor
type: Class
comment: Corresponds to the local complex type of the element "BitRate" of the "MediaFormatType", specified in part 5, page 202.
subclass of: http://lodlaundromat.org/.well-known/genid/85d373edf16945c6598ba0cfb24d8aa2#7
subclass of: digital-data
subclass of: nested-media-descriptor

bits-per-pixel
type: Class
comment: Corresponds to the "bitsPer" attribute of the "MediaFormatType" (part 5, page 203)
subclass of: non-negative-integer
subclass of: pixel-descriptor-parameter

bits-per-sample
type: Class
comment: Corresponds to the "bitsPer" attribute of the "Sample" element of the "MediaFormatType" (part 5, page 204)
subclass of: non-negative-integer
subclass of: audio-coding-descriptor-parameter

coding-hints-descriptor
type: Class
comment: Corresponds to the local complex type of the element "CodingHints" of the "MediaTranscodingType", specified in part 5, page 211.
subclass of: nested-media-descriptor
subclass of: digital-data
subclass of: http://lodlaundromat.org/.well-known/genid/85d373edf16945c6598ba0cfb24d8aa2#8

color-domain
type: Class
comment: Corresponds to the "colorDomain" attribute of the "MediaFormatType" (part 5, page 202 - 203). The type union can collect a string of {binary color colorized graylevel } or anyuri
subclass of: visual-coding-format-descriptor-parameter
subclass of: color-domain-union

color-sampling-component
type: Class
comment: Corresponds to the "Component" element of the "ColorSamplingType" (part 5, page 205)
subclass of: color-sampling-component-descriptor-parameter
subclass of: term-use-type

color-sampling-component-descriptor
type: Class
comment: Corresponds to the local complex type of the element "Component" of the "ColorSamplingType", specified in part 5, page 205
subclass of: http://lodlaundromat.org/.well-known/genid/85d373edf16945c6598ba0cfb24d8aa2#9
subclass of: nested-media-descriptor
subclass of: digital-data

color-sampling-offset-descriptor
type: Class
comment: Corresponds to the local complex type of the element "Offset" of the "ColorSamplingType", specified in part 5, page 205
subclass of: http://lodlaundromat.org/.well-known/genid/85d373edf16945c6598ba0cfb24d8aa2#25
subclass of: nested-media-descriptor
subclass of: digital-data

color-sampling-period-descriptor
type: Class
comment: Corresponds to the local complex type of the element "Period" of the "ColorSamplingType", specified in part 5, page 205
subclass of: http://lodlaundromat.org/.well-known/genid/85d373edf16945c6598ba0cfb24d8aa2#26
subclass of: digital-data
subclass of: nested-media-descriptor

color-sampling-descriptor
type: Class
comment: Corresponds to the "ColorSamplingType", specified in part 5, page 204 - 210.
subclass of: http://lodlaundromat.org/.well-known/genid/85d373edf16945c6598ba0cfb24d8aa2#14
subclass of: http://lodlaundromat.org/.well-known/genid/85d373edf16945c6598ba0cfb24d8aa2#15
subclass of: digital-data
subclass of: nested-media-descriptor

color-sampling-field-descriptor
type: Class
comment: Corresponds to the local complex type of the element "Field" of the "ColorSamplingType", specified in part 5, page 205. about some color-sampling-component-descriptor
subclass of: http://lodlaundromat.org/.well-known/genid/85d373edf16945c6598ba0cfb24d8aa2#19
subclass of: nested-media-descriptor
subclass of: digital-data
subclass of: http://lodlaundromat.org/.well-known/genid/85d373edf16945c6598ba0cfb24d8aa2#23

color-sampling-lattice-descriptor
type: Class
comment: Corresponds to the local complex type of the element "Lattice" of the "ColorSamplingType", specified in part 5, page 204 - 205.
subclass of: http://lodlaundromat.org/.well-known/genid/85d373edf16945c6598ba0cfb24d8aa2#24
subclass of: nested-media-descriptor
subclass of: digital-data

difficulty
type: Class
comment: Corresponds to the "difficulty" attribute of the "MediaTranscodingHintsType" (part 5, page 211)
subclass of: media-transcoding-hints-descriptor-parameter
subclass of: zero-to-one

emphasis
type: Class
comment: Corresponds to the "Emphasis" element of the "MediaFormatType" (part 5, page 204). The type union can collect a string of {none _50-over-15-microseconds ccittJ17 } or anyuri.
subclass of: emphasis-union
subclass of: audio-coding-descriptor-parameter

file-format
type: Class
comment: Corrresponds to the "FileFormat" element of the "MediaFormatType" (part 5, page 202)
subclass of: media-format-descriptor-parameter
subclass of: controlled-term-use-type

file-size
type: Class
comment: Corrresponds to the "FileSize" element of the "MediaFormatType" (part 5, page 202)
subclass of: media-format-descriptor-parameter
subclass of: non-negative-integer

frame-aspect-ratio
type: Class
comment: Corresponds to the "aspectRatio" attribute of the "MediaFormatType" (part 5, page 203)
subclass of: non-negative-real
subclass of: frame-descriptor-parameter

frame-descriptor
type: Class
comment: Corresponds to the local complex type of the element "Frame" of the "MediaFormatType", specified in part 5, page 203.
subclass of: http://lodlaundromat.org/.well-known/genid/85d373edf16945c6598ba0cfb24d8aa2#27
subclass of: nested-media-descriptor
subclass of: digital-data

frame-height
type: Class
comment: Corresponds to the "height" attribute of the "MediaFormatType" (part 5, page 203)
subclass of: non-negative-integer
subclass of: frame-descriptor-parameter

frame-rate
type: Class
comment: Corresponds to the "rate" attribute of the "MediaFormatType" (part 5, page 203)
subclass of: non-negative-real
subclass of: frame-descriptor-parameter

frame-structure
type: Class
comment: The type union can collect a string of {progressive interlaced } or anyuri.
subclass of: frame-structure-union
subclass of: frame-descriptor-parameter

frame-width
type: Class
comment: Corresponds to the "width" attribute of the "MediaFormatType" (part 5, page 203)
subclass of: non-negative-integer
subclass of: frame-descriptor-parameter

front-channels
type: Class
comment: Corresponds to the "front" attribute of the "MediaFormatType" (part 5, page 203 - 204)
subclass of: non-negative-integer
subclass of: audio-channels-descriptor-parameter

graphics-coding-format
type: Class
comment: Corrresponds to the "GraphicsCodingFormat" element of the "MediaFormatType" (part 5, page 204)
subclass of: media-format-descriptor-parameter
subclass of: controlled-term-use-type

horizontal-offset
type: Class
comment: Corresponds to the "horizontal" attribute of the "ColorSamplingType" (part 5, page 205)
subclass of: color-sampling-offset-descriptor-parameter
subclass of: non-negative-real

horizontal-period
type: Class
comment: Corresponds to the "horizontal" attribute of the "ColorSamplingType" (part 5, page 205)
subclass of: non-negative-real
subclass of: color-sampling-period-descriptor-parameter

importance
type: Class
comment: Corresponds to the "importance" attribute of the "MediaTranscodingHintsType" (part 5, page 211)
subclass of: media-transcoding-hints-descriptor-parameter
subclass of: zero-to-one

inline-media-descriptor
type: Class
comment: Corresponds to the "InlineMediaType", specified in part 5, page 97.
subclass of: http://lodlaundromat.org/.well-known/genid/85d373edf16945c6598ba0cfb24d8aa2#28
subclass of: nested-media-descriptor
subclass of: digital-data

inline-media-descriptor-type
type: Class
comment: Corrresponds to the "type" attribute of the "InlineMediaType" (part 5, page 97)
subclass of: inline-media-descriptor-parameter
subclass of: mime-type

intensity
type: Class
comment: Corresponds to the "intensity" attribute of the "MediaTranscodingHintsType" (part 5, page 210)
subclass of: motion-hints-descriptor-parameter
subclass of: zero-to-one

intra-frame-distance
type: Class
comment: Corresponds to the "intraFrameDistance" element of the "MediaTranscodingHintsType" (part 5, page 211)
subclass of: coding-hints-descriptor-parameter
subclass of: non-negative-integer

lattice-height
type: Class
comment: Corresponds to the "height" attribute of the "ColorSamplingType" (part 5, page 205)
subclass of: color-sampling-lattice-descriptor-parameter
subclass of: positive-integer

lattice-width
type: Class
comment: Corresponds to the "width" attribute of the "ColorSamplingType" (part 5, page 205)
subclass of: color-sampling-lattice-descriptor-parameter
subclass of: positive-integer

lfe-channels
type: Class
comment: Corresponds to the "lfe" attribute of the "MediaFormatType" (part 5, page 204)
subclass of: non-negative-integer
subclass of: audio-channels-descriptor-parameter

maximum-bitrate
type: Class
comment: Corresponds to the "maximum" attribute of the "MediaFormatType" (part 5, page 202)
subclass of: non-negative-integer
subclass of: bitrate-descriptor-parameter

media-content
type: Class
comment: Corrresponds to the "Content" element of the "MediaFormatType" (part 5, page 201)
subclass of: media-format-descriptor-parameter
subclass of: controlled-term-use-type

media-data-16
type: Class
comment: Corrresponds to the "MediaData16" element of the "InlineMediaType" (part 5, page 97)
subclass of: inline-media-descriptor-parameter
subclass of: hexBinary

media-data-64
type: Class
comment: Corrresponds to the "MediaData64" element of the "InlineMediaType" (part 5, page 97)
subclass of: inline-media-descriptor-parameter
subclass of: base64Binary

media-format-descriptor
type: Class
comment: Corresponds to the "MediaFormatType", specified in part 5, page 201 - 210.
subclass of: media-descriptor
subclass of: digital-data
subclass of: http://lodlaundromat.org/.well-known/genid/85d373edf16945c6598ba0cfb24d8aa2#29

visual-coding-descriptor
type: Class
comment: Corresponds to the local complex type of the element "VisualCoding" of the "MediaFormatType", specified in part 5, page 202 - 203.
subclass of: http://lodlaundromat.org/.well-known/genid/85d373edf16945c6598ba0cfb24d8aa2#86
subclass of: digital-data
subclass of: nested-media-descriptor

media-instance-descriptor
type: Class
comment: Corresponds to the "MediaInstanceType", specified in part 5, page 215 - 216. The element "LocationDescription" is not supported.
subclass of: media-descriptor
subclass of: http://lodlaundromat.org/.well-known/genid/85d373edf16945c6598ba0cfb24d8aa2#35
subclass of: digital-data

media-locator-descriptor
type: Class
comment: Corresponds to the "MediaLocatorType", specified in part 5, page 96.
subclass of: http://lodlaundromat.org/.well-known/genid/85d373edf16945c6598ba0cfb24d8aa2#39
subclass of: digital-data
subclass of: nested-media-descriptor
subclass of: http://lodlaundromat.org/.well-known/genid/85d373edf16945c6598ba0cfb24d8aa2#43

unique-id-descriptor
type: Class
comment: Corresponds to the "UniqueIDType", specified in part 5, page 76.
subclass of: http://lodlaundromat.org/.well-known/genid/85d373edf16945c6598ba0cfb24d8aa2#81
subclass of: nested-media-descriptor
subclass of: digital-data

http://lodlaundromat.org/.well-known/genid/85d373edf16945c6598ba0cfb24d8aa2#43
type: Restriction
on property: about
max cardinality: 1
values from: http://lodlaundromat.org/.well-known/genid/85d373edf16945c6598ba0cfb24d8aa2#44

media-uri
type: Class
comment: Corrresponds to the "MediaURI" element of the "MediaLocatorType" (part 5, page 96)
subclass of: any-uri
subclass of: media-locator-descriptor-parameter

media-quality-descriptor
type: Class
comment: Corresponds to the "MediaQualityType", specified in part 5, page 212 - 215.The element "RatingInformationLocator" is not supported.
subclass of: http://lodlaundromat.org/.well-known/genid/85d373edf16945c6598ba0cfb24d8aa2#47
subclass of: media-descriptor
subclass of: digital-data

perceptible-defects-descriptor
type: Class
comment: Corresponds to the local complex type of the element "PerceptibleDefects" of the "MediaQualityType", specified in part 5, page 213- 214.
subclass of: http://lodlaundromat.org/.well-known/genid/85d373edf16945c6598ba0cfb24d8aa2#63
subclass of: nested-media-descriptor
subclass of: digital-data

quality-rating-descriptor
type: Class
comment: Corresponds to the local complex type of the element "RatingQualityType" of the "MediaQualityType", specified in part 5, page 213- 214.
subclass of: http://lodlaundromat.org/.well-known/genid/85d373edf16945c6598ba0cfb24d8aa2#65
subclass of: nested-media-descriptor
subclass of: digital-data

motion-hints-descriptor
type: Class
comment: Corresponds to the local complex type of the element "MotionHints" of the "MediaTranscodingType", specified in part 5, page 210.
subclass of: digital-data
subclass of: nested-media-descriptor
subclass of: http://lodlaundromat.org/.well-known/genid/85d373edf16945c6598ba0cfb24d8aa2#58

medium
type: Class
comment: Corrresponds to the "Medium" element of the "MediaFormatType" (part 5, page 201)
subclass of: media-format-descriptor-parameter
subclass of: controlled-term-use-type

minimum-bitrate
type: Class
comment: Corresponds to the "minimum" attribute of the "MediaFormatType" (part 5, page 202)
subclass of: non-negative-integer
subclass of: bitrate-descriptor-parameter

motion-range-descriptor
type: Class
comment: Corresponds to the local complex type of the element "MotionRange" of the "MediaTranscodingType", specified in part 5, page 210.
subclass of: digital-data
subclass of: http://lodlaundromat.org/.well-known/genid/85d373edf16945c6598ba0cfb24d8aa2#62
subclass of: nested-media-descriptor

motion-range-x-left
type: Class
comment: Corresponds to the "xLeft" attribute of the "MediaTranscodingHintsType" (part 5, page 210)
subclass of: motion-range-descriptor-parameter
subclass of: non-negative-integer

motion-range-x-right
type: Class
comment: Corresponds to the "xRight" attribute of the "MediaTranscodingHintsType" (part 5, page 210)
subclass of: motion-range-descriptor-parameter
subclass of: non-negative-integer

motion-range-y-down
type: Class
comment: Corresponds to the "yDown" attribute of the "MediaTranscodingHintsType" (part 5, page 210)
subclass of: motion-range-descriptor-parameter
subclass of: non-negative-integer

motion-range-y-up
type: Class
comment: Corresponds to the "yUp" attribute of the "MediaTranscodingHintsType" (part 5, page 210)
subclass of: motion-range-descriptor-parameter
subclass of: non-negative-integer

number-of-non-transcoding-per-blocks
type: Class
comment: Corresponds to the "numOfNonTranspBlocks" element of the "MediaTranscodingHintsType" (part 5, page 211)
subclass of: non-negative-real
subclass of: shape-hint-descriptor-parameter

number-of-tracks
type: Class
comment: Corresponds to the "track" attribute of the "MediaFormatType" (part 5, page 204)
subclass of: non-negative-integer
subclass of: audio-channels-descriptor-parameter

organization
type: Class
comment: Corrresponds to the "organization" attribute of the "UniqueIDType" (part 5, page 76)
subclass of: unique-id-descriptor-parameter
subclass of: nmtoken

other-coding-format
type: Class
comment: Corrresponds to the "OtherCodingFormat" element of the "MediaFormatType" (part 5, page 204
subclass of: media-format-descriptor-parameter
subclass of: controlled-term-use-type

pixel-aspect-ratio
type: Class
comment: Corresponds to the "aspectRatio" attribute of the "MediaFormatType" (part 5, page 203)
subclass of: non-negative-real
subclass of: pixel-descriptor-parameter

pixel-descriptor
type: Class
comment: Corresponds to the local complex type of the element "Pixel" of the "MediaFormatType", specified in part 5, page 203.
subclass of: http://lodlaundromat.org/.well-known/genid/85d373edf16945c6598ba0cfb24d8aa2#64
subclass of: digital-data
subclass of: nested-media-descriptor

pixel-resolution
type: Class
comment: Corresponds to the "resoultion" attribute of the "MediaFormatType" (part 5, page 203)
subclass of: non-negative-integer
subclass of: pixel-descriptor-parameter

positional-order
type: Class
comment: Corresponds to the "positionalOrder" attribute of the "ColorSamplingType" (part 5, page 205)
subclass of: color-sampling-field-descriptor-parameter
subclass of: non-negative-integer

rating-descriptor
type: Class
comment: Corresponds to the local complex type of the element "RatingType" of the "MediaQualityType", specified in part 5, page 213- 214.
subclass of: http://lodlaundromat.org/.well-known/genid/85d373edf16945c6598ba0cfb24d8aa2#72
subclass of: nested-media-descriptor
subclass of: digital-data

quality-rating-type
type: Class
comment: Corresponds to the "type" attribute of the "MediaQualityType" (part 5, page 213)
subclass of: quality-rating-descriptor-parameter
subclass of: quality-rating-type-enumeration

rating-scheme-descriptor
type: Class
comment: Corresponds to the local complex type of the element "RatingType" of the "MediaQualityType", specified in part 5, page 213- 214.
subclass of: nested-media-descriptor
subclass of: digital-data
subclass of: http://lodlaundromat.org/.well-known/genid/85d373edf16945c6598ba0cfb24d8aa2#76

rating-scheme
type: Class
comment: Corresponds to the "RatingScheme" element of the local comlex element "RatingType" of the "MediaQualityType" (part 5, page 213 - 214)
subclass of: rating-scheme-descriptor-parameter
subclass of: term-use-type

rating-scheme-best
type: Class
comment: Corresponds to the "best" attribute of the local comlex element "RatingType" of the "MediaQualityType" (part 5, page 213 - 214)
subclass of: float-scalar
subclass of: rating-scheme-descriptor-parameter

rating-scheme-style
type: Class
comment: Corresponds to the "style" attribute of the local comlex element "RatingType" of the "MediaQualityType" (part 5, page 213 - 214)
subclass of: rating-scheme-style-enumeration
subclass of: rating-scheme-descriptor-parameter

rating-scheme-worst
type: Class
comment: Corresponds to the "worst" attribute of the local comlex element "RatingType" of the "MediaQualityType" (part 5, page 213 - 214)
subclass of: float-scalar
subclass of: rating-scheme-descriptor-parameter

rating-value
type: Class
comment: Corresponds to the "RatingValue" element of the "MediaQualityType" (part 5, page 213)
subclass of: rating-descriptor-parameter
subclass of: float-scalar

rear-channels
type: Class
comment: Corresponds to the "rear" attribute of the "MediaFormatType" (part 5, page 204)
subclass of: non-negative-integer
subclass of: audio-channels-descriptor-parameter

sample-rate
type: Class
comment: Corresponds to the "rate" attribute of the "Sample" element of the "MediaFormatType" (part 5, page 204)
subclass of: non-negative-real
subclass of: audio-coding-descriptor-parameter

scalable-coding
type: Class
comment: Corrresponds to the "ScalableCoding" element of the "MediaFormatType" (part 5, page 202). The type union can collect a string of {fgs temporal spatial snr} or anyuri.
subclass of: scalable-coding-union
subclass of: media-format-descriptor-parameter

scene-coding-format
type: Class
comment: Corrresponds to the "SceneCodingFormat" element of the "MediaFormatType" (part 5, page 204)
subclass of: media-format-descriptor-parameter
subclass of: controlled-term-use-type

shape-change
type: Class
comment: Corresponds to the "shapeChange" element of the "MediaTranscodingHintsType" (part 5, page 211)
subclass of: shape-hint-descriptor-parameter
subclass of: float-scalar

shape-hint-descriptor
type: Class
comment: Corresponds to the local complex type of the element "ShapeHint" of the "MediaTranscodingType", specified in part 5, page 211.
subclass of: http://lodlaundromat.org/.well-known/genid/85d373edf16945c6598ba0cfb24d8aa2#80
subclass of: nested-media-descriptor
subclass of: digital-data

side-channels
type: Class
comment: Corresponds to the "side" attribute of the "MediaFormatType" (part 5, page 204)
subclass of: non-negative-integer
subclass of: audio-channels-descriptor-parameter

spatial-resolution-hint
type: Class
comment: Corresponds to the "spatialResolutionHint" attribute of the "MediaTranscodingHintsType" (part 5, page 211)
subclass of: media-transcoding-hints-descriptor-parameter
subclass of: zero-to-one

stream-id
type: Class
comment: Corrresponds to the "StreamID" element of the "MediaLocatorType" (part 5, page 96)
subclass of: non-negative-integer
subclass of: media-locator-descriptor-parameter

system
type: Class
comment: Corrresponds to the "System" element of the "MediaFormatType" (part 5, page 202)
subclass of: media-format-descriptor-parameter
subclass of: controlled-term-use-type

target-channel-bit-rate
type: Class
comment: Corrresponds to the "TargetChannelBitRate" element of the "MediaFormatType" (part 5, page 202)
subclass of: media-format-descriptor-parameter
subclass of: non-negative-integer

temporal-order
type: Class
comment: Corresponds to the "temporalOrder" attribute of the "ColorSamplingType" (part 5, page 205)
subclass of: color-sampling-field-descriptor-parameter
subclass of: non-negative-integer

uncompensability
type: Class
comment: Corresponds to the "uncompensability" attribute of the "MediaTranscodingHintsType" (part 5, page 210)
subclass of: motion-hints-descriptor-parameter
subclass of: zero-to-one

unique-id-descriptor-type
type: Class
comment: Corrresponds to the "type" attribute of the "UniqueIDType" (part 5, page 76)
subclass of: unique-id-descriptor-parameter
subclass of: nmtoken

unique-id-encoding
type: Class
comment: Corresponds to the "encoding" attribute of the "UniqueIDType" (part 5, page 76). The value is a string of {base16 base64 text}
subclass of: unique-id-descriptor-parameter
subclass of: unique-id-encoding-enumeration

unique-id-string
type: Class
comment: Corresponds to the value of the "UniqueIDType" (part 5, page 76)
subclass of: unique-id-descriptor-parameter
subclass of: string

variable-bitrate
type: Class
comment: Corresponds to the "variable" attribute of the "MediaFormatType" (part 5, page 202)
subclass of: boolean
subclass of: bitrate-descriptor-parameter

vertical-offset
type: Class
comment: Corresponds to the "vertical" attribute of the "ColorSamplingType" (part 5, page 205)
subclass of: color-sampling-offset-descriptor-parameter
subclass of: non-negative-real

vertical-period
type: Class
comment: Corresponds to the "vertical" attribute of the "ColorSamplingType" (part 5, page 205)
subclass of: non-negative-real
subclass of: color-sampling-period-descriptor-parameter

visual-coding-format-descriptor
type: Class
comment: Corresponds to the local complex type of the element "Format" of the "MediaFormatType", specified in part 5, page 202 - 203.
subclass of: http://lodlaundromat.org/.well-known/genid/85d373edf16945c6598ba0cfb24d8aa2#92
subclass of: digital-data
subclass of: nested-media-descriptor

visual-coding-format
type: Class
comment: Corresponds to the "Format" element of the "MediaFormatType" (part 5, page 202 - 203)
subclass of: visual-coding-format-descriptor-parameter
subclass of: controlled-term-use-type

visual-defects
type: Class
comment: Corresponds to the "AudioDefects" element of the "MediaQualityType" (part 5, page 213)
subclass of: perceptible-defects-descriptor-parameter
subclass of: controlled-term-use-type